aws_cli

Build log

nerves_system_x86_64

aws_cli 0.1.0 · fail · run aws_cli-0.1.0-1789936442671
510 of 510 lines
1Resolving Hex dependencies...2Resolution completed in 0.241s3Unchanged:4  aws_cli 0.1.05  circular_buffer 1.1.06  elixir_make 0.10.07  erlexec 1.1.0 RETIRED!8    (deprecated) Deprecated9  interactive_cmd 0.1.410  jason 1.4.511  nerves 1.15.012  nerves_discovery 0.1.513  nerves_logging 0.2.414  nerves_runtime 0.13.1315  nerves_system_bbb 2.30.216  nerves_system_br 1.34.417  nerves_system_mangopi_mq_pro 0.17.218  nerves_system_qemu_aarch64 0.4.219  nerves_system_rpi 2.1.220  nerves_system_rpi0 2.1.221  nerves_system_rpi0_2 2.1.222  nerves_system_rpi2 2.1.223  nerves_system_rpi3 2.1.224  nerves_system_rpi4 2.1.225  nerves_system_rpi5 2.1.226  nerves_system_x86_64 1.34.227  nerves_toolchain_aarch64_nerves_linux_gnu 15.3.128  nerves_toolchain_armv6_nerves_linux_gnueabihf 15.3.129  nerves_toolchain_armv7_nerves_linux_gnueabihf 15.3.130  nerves_toolchain_riscv64_nerves_linux_gnu 15.3.131  nerves_toolchain_x86_64_nerves_linux_musl 15.3.132  nerves_uevent 0.1.733  property_table 0.3.434  ring_logger 0.11.735  shoehorn 0.9.336  tablet 0.3.337  toolshed 0.5.038  uboot_env 1.0.239* Getting aws_cli (Hex package)40* Getting nerves (Hex package)41* Getting shoehorn (Hex package)42* Getting ring_logger (Hex package)43* Getting toolshed (Hex package)44* Getting nerves_runtime (Hex package)45* Getting nerves_system_bbb (Hex package)46* Getting nerves_system_mangopi_mq_pro (Hex package)47* Getting nerves_system_qemu_aarch64 (Hex package)48* Getting nerves_system_rpi (Hex package)49* Getting nerves_system_rpi0 (Hex package)50* Getting nerves_system_rpi0_2 (Hex package)51* Getting nerves_system_rpi2 (Hex package)52* Getting nerves_system_rpi3 (Hex package)53* Getting nerves_system_rpi4 (Hex package)54* Getting nerves_system_rpi5 (Hex package)55* Getting nerves_system_x86_64 (Hex package)56* Getting nerves_system_br (Hex package)57* Getting nerves_toolchain_x86_64_nerves_linux_musl (Hex package)58* Getting nerves_toolchain_aarch64_nerves_linux_gnu (Hex package)59* Getting nerves_toolchain_armv7_nerves_linux_gnueabihf (Hex package)60* Getting nerves_toolchain_armv6_nerves_linux_gnueabihf (Hex package)61* Getting nerves_toolchain_riscv64_nerves_linux_gnu (Hex package)62* Getting nerves_logging (Hex package)63* Getting nerves_uevent (Hex package)64* Getting uboot_env (Hex package)65* Getting elixir_make (Hex package)66* Getting property_table (Hex package)67* Getting circular_buffer (Hex package)68* Getting interactive_cmd (Hex package)69* Getting jason (Hex package)70* Getting nerves_discovery (Hex package)71* Getting tablet (Hex package)72* Getting erlexec (Hex package)73Found retired packages, see above for details74==> jason75Compiling 10 files (.ex)76Generated jason app77==> tablet78Compiling 2 files (.ex)79Generated tablet app80==> elixir_make81Compiling 8 files (.ex)82Generated elixir_make app83==> nerves_discovery84Compiling 5 files (.ex)85Generated nerves_discovery app86==> interactive_cmd87Compiling 1 file (.ex)88Generated interactive_cmd app89==> nerves90HOST_CC port.o91HOST_LD port92Compiling 55 files (.ex)93Generated nerves app94==> nerves_compatibility_test9596Nerves environment97  MIX_TARGET:   x86_6498  MIX_ENV:      prod99100Checking for prebuilt Nerves artifacts...101  Found nerves_system_x86_64 in cache102    /home/nerves/.nerves/artifacts/nerves_system_x86_64-portable-1.34.2103  Found nerves_toolchain_x86_64_nerves_linux_musl in cache104    /home/nerves/.nerves/artifacts/nerves_toolchain_x86_64_nerves_linux_musl-linux_x86_64-15.3.1105==> nerves106==> nerves_compatibility_test107108Nerves environment109  MIX_TARGET:   x86_64110  MIX_ENV:      prod111112===> Fetching pc v1.15.0113===> Analyzing applications...114===> Compiling pc115===> Compiling /work/proj/deps_x86_64/erlexec/c_src/ei++.cpp116===> In file included from /usr/include/x86_64-linux-gnu/c++/13/bits/c++config.h:679,117                 from /usr/include/c++/13/bits/requires_hosted.h:31,118                 from /usr/include/c++/13/sstream:38,119                 from c_src/ei++.cpp:3:120/usr/include/x86_64-linux-gnu/c++/13/bits/os_defines.h:44:19: error: missing binary operator before token "("121   44 | #if __GLIBC_PREREQ(2,15) && defined(_GNU_SOURCE)122      |                   ^123/usr/include/x86_64-linux-gnu/c++/13/bits/os_defines.h:55:19: error: missing binary operator before token "("124   55 | #if __GLIBC_PREREQ(2, 26) \125      |                   ^126/usr/include/x86_64-linux-gnu/c++/13/bits/os_defines.h:66:20: error: missing binary operator before token "("127   66 | # if __GLIBC_PREREQ(2, 27)128      |                    ^129/usr/include/x86_64-linux-gnu/c++/13/bits/os_defines.h:78:20: error: missing binary operator before token "("130   78 | # if __GLIBC_PREREQ(2, 34)131      |                    ^132In file included from /usr/include/c++/13/bits/localefwd.h:40,133                 from /usr/include/c++/13/ios:43,134                 from /usr/include/c++/13/istream:40,135                 from /usr/include/c++/13/sstream:40:136/usr/include/x86_64-linux-gnu/c++/13/bits/c++locale.h:62:11: error: ‘__locale_t’ does not name a type; did you mean ‘locale_t’?137   62 |   typedef __locale_t            __c_locale;138      |           ^~~~~~~~~~139      |           locale_t140/usr/include/x86_64-linux-gnu/c++/13/bits/c++locale.h:74:26: error: ‘__c_locale’ does not name a type141   74 |   __convert_from_v(const __c_locale& __cloc __attribute__ ((__unused__)),142      |                          ^~~~~~~~~~143In file included from /usr/include/c++/13/bits/ios_base.h:41,144                 from /usr/include/c++/13/ios:44:145/usr/include/c++/13/bits/locale_classes.h:386:12: error: ‘__c_locale’ does not name a type; did you mean ‘locale’?146  386 |     static __c_locale                   _S_c_locale;147      |            ^~~~~~~~~~148      |            locale149/usr/include/c++/13/bits/locale_classes.h:417:24: error: ‘__c_locale’ has not been declared150  417 |     _S_create_c_locale(__c_locale& __cloc, const char* __s,151      |                        ^~~~~~~~~~152/usr/include/c++/13/bits/locale_classes.h:418:24: error: ‘__c_locale’ has not been declared153  418 |                        __c_locale __old = 0);154      |                        ^~~~~~~~~~155/usr/include/c++/13/bits/locale_classes.h:420:12: error: ‘__c_locale’ does not name a type; did you mean ‘locale’?156  420 |     static __c_locale157      |            ^~~~~~~~~~158      |            locale159/usr/include/c++/13/bits/locale_classes.h:424:25: error: ‘__c_locale’ has not been declared160  424 |     _S_destroy_c_locale(__c_locale& __cloc);161      |                         ^~~~~~~~~~162/usr/include/c++/13/bits/locale_classes.h:426:12: error: ‘__c_locale’ does not name a type; did you mean ‘locale’?163  426 |     static __c_locale164      |            ^~~~~~~~~~165      |            locale166/usr/include/c++/13/bits/locale_classes.h:431:12: error: ‘__c_locale’ does not name a type; did you mean ‘locale’?167  431 |     static __c_locale168      |            ^~~~~~~~~~169      |            locale170/usr/include/c++/13/bits/locale_classes.h:673:7: error: ‘__c_locale’ does not name a type; did you mean ‘locale’?171  673 |       __c_locale                        _M_c_locale_collate;172      |       ^~~~~~~~~~173      |       locale174/usr/include/c++/13/bits/locale_classes.h:701:25: error: expected ‘)’ before ‘__cloc’175  701 |       collate(__c_locale __cloc, size_t __refs = 0)176      |              ~          ^~~~~~~177      |                         )178/usr/include/c++/13/bits/locale_classes.h: In constructor ‘std::__cxx11::collate<_CharT>::collate(std::size_t)’:179/usr/include/c++/13/bits/locale_classes.h:688:24: error: class ‘std::__cxx11::collate<_CharT>’ does not have any field named ‘_M_c_locale_collate’180  688 |       : facet(__refs), _M_c_locale_collate(_S_get_c_locale())181      |                        ^~~~~~~~~~~~~~~~~~~182/usr/include/c++/13/bits/locale_classes.h:688:44: error: there are no arguments to ‘_S_get_c_locale’ that depend on a template parameter, so a declaration of ‘_S_get_c_locale’ must be available [-fpermissive]183  688 |       : facet(__refs), _M_c_locale_collate(_S_get_c_locale())184      |                                            ^~~~~~~~~~~~~~~185/usr/include/c++/13/bits/locale_classes.h:688:44: note: (if you use ‘-fpermissive’, G++ will accept your code, but allowing the use of an undeclared name is deprecated)186/usr/include/c++/13/bits/locale_classes.h: In destructor ‘virtual std::__cxx11::collate<_CharT>::~collate()’:187/usr/include/c++/13/bits/locale_classes.h:765:29: error: ‘_M_c_locale_collate’ was not declared in this scope188  765 |       { _S_destroy_c_locale(_M_c_locale_collate); }189      |                             ^~~~~~~~~~~~~~~~~~~190In file included from /usr/include/c++/13/bits/locale_facets.h:41,191                 from /usr/include/c++/13/bits/basic_ios.h:37,192                 from /usr/include/c++/13/ios:46:193/usr/include/x86_64-linux-gnu/c++/13/bits/ctype_base.h: At global scope:194/usr/include/x86_64-linux-gnu/c++/13/bits/ctype_base.h:49:35: error: ‘_ISupper’ was not declared in this scope; did you mean ‘isupper’?195   49 |     static const mask upper     = _ISupper;196      |                                   ^~~~~~~~197      |                                   isupper198/usr/include/x86_64-linux-gnu/c++/13/bits/ctype_base.h:50:35: error: ‘_ISlower’ was not declared in this scope; did you mean ‘islower’?199   50 |     static const mask lower     = _ISlower;200      |                                   ^~~~~~~~201      |                                   islower202/usr/include/x86_64-linux-gnu/c++/13/bits/ctype_base.h:51:35: error: ‘_ISalpha’ was not declared in this scope; did you mean ‘isalpha’?203   51 |     static const mask alpha     = _ISalpha;204      |                                   ^~~~~~~~205      |                                   isalpha206/usr/include/x86_64-linux-gnu/c++/13/bits/ctype_base.h:52:35: error: ‘_ISdigit’ was not declared in this scope; did you mean ‘isdigit’?207   52 |     static const mask digit     = _ISdigit;208      |                                   ^~~~~~~~209      |                                   isdigit210/usr/include/x86_64-linux-gnu/c++/13/bits/ctype_base.h:53:35: error: ‘_ISxdigit’ was not declared in this scope; did you mean ‘isxdigit’?211   53 |     static const mask xdigit    = _ISxdigit;212      |                                   ^~~~~~~~~213      |                                   isxdigit214/usr/include/x86_64-linux-gnu/c++/13/bits/ctype_base.h:54:35: error: ‘_ISspace’ was not declared in this scope; did you mean ‘isspace’?215   54 |     static const mask space     = _ISspace;216      |                                   ^~~~~~~~217      |                                   isspace218/usr/include/x86_64-linux-gnu/c++/13/bits/ctype_base.h:55:35: error: ‘_ISprint’ was not declared in this scope; did you mean ‘isprint’?219   55 |     static const mask print     = _ISprint;220      |                                   ^~~~~~~~221      |                                   isprint222/usr/include/x86_64-linux-gnu/c++/13/bits/ctype_base.h:56:35: error: ‘_ISalpha’ was not declared in this scope; did you mean ‘isalpha’?223   56 |     static const mask graph     = _ISalpha | _ISdigit | _ISpunct;224      |                                   ^~~~~~~~225      |                                   isalpha226/usr/include/x86_64-linux-gnu/c++/13/bits/ctype_base.h:56:46: error: ‘_ISdigit’ was not declared in this scope; did you mean ‘isdigit’?227   56 |     static const mask graph     = _ISalpha | _ISdigit | _ISpunct;228      |                                              ^~~~~~~~229      |                                              isdigit230/usr/include/x86_64-linux-gnu/c++/13/bits/ctype_base.h:56:57: error: ‘_ISpunct’ was not declared in this scope; did you mean ‘ispunct’?231   56 |     static const mask graph     = _ISalpha | _ISdigit | _ISpunct;232      |                                                         ^~~~~~~~233      |                                                         ispunct234/usr/include/x86_64-linux-gnu/c++/13/bits/ctype_base.h:57:35: error: ‘_IScntrl’ was not declared in this scope; did you mean ‘iscntrl’?235   57 |     static const mask cntrl     = _IScntrl;236      |                                   ^~~~~~~~237      |                                   iscntrl238/usr/include/x86_64-linux-gnu/c++/13/bits/ctype_base.h:58:35: error: ‘_ISpunct’ was not declared in this scope; did you mean ‘ispunct’?239   58 |     static const mask punct     = _ISpunct;240      |                                   ^~~~~~~~241      |                                   ispunct242/usr/include/x86_64-linux-gnu/c++/13/bits/ctype_base.h:59:35: error: ‘_ISalpha’ was not declared in this scope; did you mean ‘isalpha’?243   59 |     static const mask alnum     = _ISalpha | _ISdigit;244      |                                   ^~~~~~~~245      |                                   isalpha246/usr/include/x86_64-linux-gnu/c++/13/bits/ctype_base.h:59:46: error: ‘_ISdigit’ was not declared in this scope; did you mean ‘isdigit’?247   59 |     static const mask alnum     = _ISalpha | _ISdigit;248      |                                              ^~~~~~~~249      |                                              isdigit250/usr/include/x86_64-linux-gnu/c++/13/bits/ctype_base.h:61:35: error: ‘_ISblank’ was not declared in this scope; did you mean ‘isblank’?251   61 |     static const mask blank     = _ISblank;252      |                                   ^~~~~~~~253      |                                   isblank254/usr/include/c++/13/bits/locale_facets.h:77:26: error: ‘__c_locale’ does not name a type; did you mean ‘locale’?255   77 |                    const __c_locale&) throw();256      |                          ^~~~~~~~~~257      |                          locale258/usr/include/c++/13/bits/locale_facets.h:83:26: error: ‘__c_locale’ does not name a type; did you mean ‘locale’?259   83 |                    const __c_locale&) throw();260      |                          ^~~~~~~~~~261      |                          locale262/usr/include/c++/13/bits/locale_facets.h:88:26: error: ‘__c_locale’ does not name a type; did you mean ‘locale’?263   88 |                    const __c_locale&) throw();264      |                          ^~~~~~~~~~265      |                          locale266/usr/include/c++/13/bits/locale_facets.h:93:26: error: ‘__c_locale’ does not name a type; did you mean ‘locale’?267   93 |                    const __c_locale&) throw();268      |                          ^~~~~~~~~~269      |                          locale270/usr/include/c++/13/bits/locale_facets.h:698:7: error: ‘__c_locale’ does not name a type; did you mean ‘locale’?271  698 |       __c_locale                _M_c_locale_ctype;272      |       ^~~~~~~~~~273      |       locale274/usr/include/c++/13/bits/locale_facets.h:739:23: error: expected ‘)’ before ‘__cloc’275  739 |       ctype(__c_locale __cloc, const mask* __table = 0, bool __del = false,276      |            ~          ^~~~~~~277      |                       )278/usr/include/c++/13/bits/locale_facets.h:1203:7: error: ‘__c_locale’ does not name a type; did you mean ‘locale’?279 1203 |       __c_locale                _M_c_locale_ctype;280      |       ^~~~~~~~~~281      |       locale282/usr/include/c++/13/bits/locale_facets.h:1238:23: error: expected ‘)’ before ‘__cloc’283 1238 |       ctype(__c_locale __cloc, size_t __refs = 0);284      |            ~          ^~~~~~~285      |                       )286/usr/include/c++/13/bits/locale_facets.h:1730:26: error: expected ‘)’ before ‘__cloc’287 1730 |       numpunct(__c_locale __cloc, size_t __refs = 0)288      |               ~          ^~~~~~~289      |                          )290/usr/include/c++/13/bits/locale_facets.h:1887:30: error: ‘__c_locale’ has not been declared291 1887 |       _M_initialize_numpunct(__c_locale __cloc = 0);292      |                              ^~~~~~~~~~293/usr/include/c++/13/bits/locale_facets.h:1898:5: error: variable or field ‘_M_initialize_numpunct’ declared void294 1898 |     numpunct<char>::_M_initialize_numpunct(__c_locale __cloc);295      |     ^~~~~~~~~~~~~~296/usr/include/c++/13/bits/locale_facets.h:1898:44: error: ‘__c_locale’ was not declared in this scope297 1898 |     numpunct<char>::_M_initialize_numpunct(__c_locale __cloc);298      |                                            ^~~~~~~~~~299/usr/include/c++/13/bits/locale_facets.h:1906:5: error: variable or field ‘_M_initialize_numpunct’ declared void300 1906 |     numpunct<wchar_t>::_M_initialize_numpunct(__c_locale __cloc);301      |     ^~~~~~~~~~~~~~~~~302/usr/include/c++/13/bits/locale_facets.h:1906:47: error: ‘__c_locale’ was not declared in this scope303 1906 |     numpunct<wchar_t>::_M_initialize_numpunct(__c_locale __cloc);304      |                                               ^~~~~~~~~~305/usr/include/c++/13/bits/locale_facets.h: In constructor ‘std::__cxx11::numpunct_byname<_CharT>::numpunct_byname(const char*, std::size_t)’:306/usr/include/c++/13/bits/locale_facets.h:1924:13: error: ‘__c_locale’ was not declared in this scope307 1924 |             __c_locale __tmp;308      |             ^~~~~~~~~~309/usr/include/c++/13/bits/locale_facets.h:1925:38: error: ‘__tmp’ was not declared in this scope310 1925 |             this->_S_create_c_locale(__tmp, __s);311      |                                      ^~~~~312In file included from /usr/include/c++/13/bits/locale_facets.h:2687:313/usr/include/c++/13/bits/locale_facets.tcc: In member function ‘virtual _InIter std::num_get<_CharT, _InIter>::do_get(iter_type, iter_type, std::ios_base&, std::ios_base::iostate&, float&) const’:314/usr/include/c++/13/bits/locale_facets.tcc:697:55: error: there are no arguments to ‘_S_get_c_locale’ that depend on a template parameter, so a declaration of ‘_S_get_c_locale’ must be available [-fpermissive]315  697 |       std::__convert_to_v(__xtrc.c_str(), __v, __err, _S_get_c_locale());316      |                                                       ^~~~~~~~~~~~~~~317/usr/include/c++/13/bits/locale_facets.tcc: In member function ‘virtual _InIter std::num_get<_CharT, _InIter>::do_get(iter_type, iter_type, std::ios_base&, std::ios_base::iostate&, double&) const’:318/usr/include/c++/13/bits/locale_facets.tcc:712:55: error: there are no arguments to ‘_S_get_c_locale’ that depend on a template parameter, so a declaration of ‘_S_get_c_locale’ must be available [-fpermissive]319  712 |       std::__convert_to_v(__xtrc.c_str(), __v, __err, _S_get_c_locale());320      |                                                       ^~~~~~~~~~~~~~~321/usr/include/c++/13/bits/locale_facets.tcc: In member function ‘virtual _InIter std::num_get<_CharT, _InIter>::do_get(iter_type, iter_type, std::ios_base&, std::ios_base::iostate&, long double&) const’:322/usr/include/c++/13/bits/locale_facets.tcc:744:55: error: there are no arguments to ‘_S_get_c_locale’ that depend on a template parameter, so a declaration of ‘_S_get_c_locale’ must be available [-fpermissive]323  744 |       std::__convert_to_v(__xtrc.c_str(), __v, __err, _S_get_c_locale());324      |                                                       ^~~~~~~~~~~~~~~325/usr/include/c++/13/bits/locale_facets.tcc: In member function ‘_OutIter std::num_put<_CharT, _OutIter>::_M_insert_float(_OutIter, std::ios_base&, _CharT, char, _ValueT) const’:326/usr/include/c++/13/bits/locale_facets.tcc:1023:41: error: there are no arguments to ‘_S_get_c_locale’ that depend on a template parameter, so a declaration of ‘_S_get_c_locale’ must be available [-fpermissive]327 1023 |           __len = std::__convert_from_v(_S_get_c_locale(), __cs, __cs_size,328      |                                         ^~~~~~~~~~~~~~~329/usr/include/c++/13/bits/locale_facets.tcc:1026:41: error: there are no arguments to ‘_S_get_c_locale’ that depend on a template parameter, so a declaration of ‘_S_get_c_locale’ must be available [-fpermissive]330 1026 |           __len = std::__convert_from_v(_S_get_c_locale(), __cs, __cs_size,331      |                                         ^~~~~~~~~~~~~~~332/usr/include/c++/13/bits/locale_facets.tcc:1035:45: error: there are no arguments to ‘_S_get_c_locale’ that depend on a template parameter, so a declaration of ‘_S_get_c_locale’ must be available [-fpermissive]333 1035 |               __len = std::__convert_from_v(_S_get_c_locale(), __cs, __cs_size,334      |                                             ^~~~~~~~~~~~~~~335/usr/include/c++/13/bits/locale_facets.tcc:1038:45: error: there are no arguments to ‘_S_get_c_locale’ that depend on a template parameter, so a declaration of ‘_S_get_c_locale’ must be available [-fpermissive]336 1038 |               __len = std::__convert_from_v(_S_get_c_locale(), __cs, __cs_size,337      |                                             ^~~~~~~~~~~~~~~338In file included from /usr/include/c++/13/locale:43,339                 from /usr/include/c++/13/iomanip:45,340                 from c_src/ei++.cpp:4:341/usr/include/c++/13/bits/locale_facets_nonio.h: At global scope:342/usr/include/c++/13/bits/locale_facets_nonio.h:183:7: error: ‘__c_locale’ does not name a type; did you mean ‘locale’?343  183 |       __c_locale                        _M_c_locale_timepunct;344      |       ^~~~~~~~~~345      |       locale346/usr/include/c++/13/bits/locale_facets_nonio.h:207:29: error: expected ‘)’ before ‘__cloc’347  207 |       __timepunct(__c_locale __cloc, const char* __s, size_t __refs = 0);348      |                  ~          ^~~~~~~349      |                             )350/usr/include/c++/13/bits/locale_facets_nonio.h:322:31: error: ‘__c_locale’ has not been declared351  322 |       _M_initialize_timepunct(__c_locale __cloc = 0);352      |                               ^~~~~~~~~~353/usr/include/c++/13/bits/locale_facets_nonio.h:331:5: error: variable or field ‘_M_initialize_timepunct’ declared void354  331 |     __timepunct<char>::_M_initialize_timepunct(__c_locale __cloc);355      |     ^~~~~~~~~~~~~~~~~356/usr/include/c++/13/bits/locale_facets_nonio.h:331:48: error: ‘__c_locale’ was not declared in this scope357  331 |     __timepunct<char>::_M_initialize_timepunct(__c_locale __cloc);358      |                                                ^~~~~~~~~~359/usr/include/c++/13/bits/locale_facets_nonio.h:340:5: error: variable or field ‘_M_initialize_timepunct’ declared void360  340 |     __timepunct<wchar_t>::_M_initialize_timepunct(__c_locale __cloc);361      |     ^~~~~~~~~~~~~~~~~~~~362/usr/include/c++/13/bits/locale_facets_nonio.h:340:51: error: ‘__c_locale’ was not declared in this scope363  340 |     __timepunct<wchar_t>::_M_initialize_timepunct(__c_locale __cloc);364      |                                                   ^~~~~~~~~~365In file included from /usr/include/c++/13/bits/locale_facets_nonio.h:352:366/usr/include/x86_64-linux-gnu/c++/13/bits/time_members.h: In constructor ‘std::__timepunct<_CharT>::__timepunct(std::size_t)’:367/usr/include/x86_64-linux-gnu/c++/13/bits/time_members.h:43:34: error: class ‘std::__timepunct<_CharT>’ does not have any field named ‘_M_c_locale_timepunct’368   43 |     : facet(__refs), _M_data(0), _M_c_locale_timepunct(0),369      |                                  ^~~~~~~~~~~~~~~~~~~~~370/usr/include/x86_64-linux-gnu/c++/13/bits/time_members.h: In constructor ‘std::__timepunct<_CharT>::__timepunct(__cache_type*, std::size_t)’:371/usr/include/x86_64-linux-gnu/c++/13/bits/time_members.h:49:40: error: class ‘std::__timepunct<_CharT>’ does not have any field named ‘_M_c_locale_timepunct’372   49 |     : facet(__refs), _M_data(__cache), _M_c_locale_timepunct(0),373      |                                        ^~~~~~~~~~~~~~~~~~~~~374/usr/include/x86_64-linux-gnu/c++/13/bits/time_members.h: At global scope:375/usr/include/x86_64-linux-gnu/c++/13/bits/time_members.h:54:37: error: expected constructor, destructor, or type conversion before ‘(’ token376   54 |     __timepunct<_CharT>::__timepunct(__c_locale __cloc, const char* __s,377      |                                     ^378/usr/include/x86_64-linux-gnu/c++/13/bits/time_members.h: In destructor ‘virtual std::__timepunct<_CharT>::~__timepunct()’:379/usr/include/x86_64-linux-gnu/c++/13/bits/time_members.h:85:27: error: ‘_M_c_locale_timepunct’ was not declared in this scope; did you mean ‘_M_name_timepunct’?380   85 |       _S_destroy_c_locale(_M_c_locale_timepunct);381      |                           ^~~~~~~~~~~~~~~~~~~~~382      |                           _M_name_timepunct383/usr/include/c++/13/bits/locale_facets_nonio.h: At global scope:384/usr/include/c++/13/bits/locale_facets_nonio.h:1119:28: error: expected ‘)’ before ‘__cloc’385 1119 |       moneypunct(__c_locale __cloc, const char* __s, size_t __refs = 0)386      |                 ~          ^~~~~~~387      |                            )388/usr/include/c++/13/bits/locale_facets_nonio.h:1408:33: error: ‘__c_locale’ has not been declared389 1408 |        _M_initialize_moneypunct(__c_locale __cloc = 0,390      |                                 ^~~~~~~~~~391/usr/include/c++/13/bits/locale_facets_nonio.h:1426:5: error: variable or field ‘_M_initialize_moneypunct’ declared void392 1426 |     moneypunct<char, true>::_M_initialize_moneypunct(__c_locale, const char*);393      |     ^~~~~~~~~~~~~~~~~~~~~~394/usr/include/c++/13/bits/locale_facets_nonio.h:1426:54: error: ‘__c_locale’ was not declared in this scope395 1426 |     moneypunct<char, true>::_M_initialize_moneypunct(__c_locale, const char*);396      |                                                      ^~~~~~~~~~397/usr/include/c++/13/bits/locale_facets_nonio.h:1426:66: error: expected primary-expression before ‘const’398 1426 |     moneypunct<char, true>::_M_initialize_moneypunct(__c_locale, const char*);399      |                                                                  ^~~~~400/usr/include/c++/13/bits/locale_facets_nonio.h:1430:5: error: variable or field ‘_M_initialize_moneypunct’ declared void401 1430 |     moneypunct<char, false>::_M_initialize_moneypunct(__c_locale, const char*);402      |     ^~~~~~~~~~~~~~~~~~~~~~~403/usr/include/c++/13/bits/locale_facets_nonio.h:1430:55: error: ‘__c_locale’ was not declared in this scope404 1430 |     moneypunct<char, false>::_M_initialize_moneypunct(__c_locale, const char*);405      |                                                       ^~~~~~~~~~406/usr/include/c++/13/bits/locale_facets_nonio.h:1430:67: error: expected primary-expression before ‘const’407 1430 |     moneypunct<char, false>::_M_initialize_moneypunct(__c_locale, const char*);408      |                                                                   ^~~~~409/usr/include/c++/13/bits/locale_facets_nonio.h:1441:5: error: variable or field ‘_M_initialize_moneypunct’ declared void410 1441 |     moneypunct<wchar_t, true>::_M_initialize_moneypunct(__c_locale,411      |     ^~~~~~~~~~~~~~~~~~~~~~~~~412/usr/include/c++/13/bits/locale_facets_nonio.h:1441:57: error: ‘__c_locale’ was not declared in this scope413 1441 |     moneypunct<wchar_t, true>::_M_initialize_moneypunct(__c_locale,414      |                                                         ^~~~~~~~~~415/usr/include/c++/13/bits/locale_facets_nonio.h:1442:57: error: expected primary-expression before ‘const’416 1442 |                                                         const char*);417      |                                                         ^~~~~418/usr/include/c++/13/bits/locale_facets_nonio.h:1446:5: error: variable or field ‘_M_initialize_moneypunct’ declared void419 1446 |     moneypunct<wchar_t, false>::_M_initialize_moneypunct(__c_locale,420      |     ^~~~~~~~~~~~~~~~~~~~~~~~~~421/usr/include/c++/13/bits/locale_facets_nonio.h:1446:58: error: ‘__c_locale’ was not declared in this scope422 1446 |     moneypunct<wchar_t, false>::_M_initialize_moneypunct(__c_locale,423      |                                                          ^~~~~~~~~~424/usr/include/c++/13/bits/locale_facets_nonio.h:1447:58: error: expected primary-expression before ‘const’425 1447 |                                                          const char*);426      |                                                          ^~~~~427/usr/include/c++/13/bits/locale_facets_nonio.h: In constructor ‘std::__cxx11::moneypunct_byname<_CharT, _Intl>::moneypunct_byname(const char*, std::size_t)’:428/usr/include/c++/13/bits/locale_facets_nonio.h:1467:13: error: ‘__c_locale’ was not declared in this scope429 1467 |             __c_locale __tmp;430      |             ^~~~~~~~~~431/usr/include/c++/13/bits/locale_facets_nonio.h:1468:38: error: ‘__tmp’ was not declared in this scope432 1468 |             this->_S_create_c_locale(__tmp, __s);433      |                                      ^~~~~434/usr/include/c++/13/bits/locale_facets_nonio.h: At global scope:435/usr/include/c++/13/bits/locale_facets_nonio.h:1866:7: error: ‘__c_locale’ does not name a type; did you mean ‘locale’?436 1866 |       __c_locale                        _M_c_locale_messages;437      |       ^~~~~~~~~~438      |       locale439/usr/include/c++/13/bits/locale_facets_nonio.h:1895:26: error: expected ‘)’ before ‘__cloc’440 1895 |       messages(__c_locale __cloc, const char* __s, size_t __refs = 0);441      |               ~          ^~~~~~~442      |                          )443In file included from /usr/include/c++/13/bits/locale_facets_nonio.h:2064:444/usr/include/x86_64-linux-gnu/c++/13/bits/messages_members.h: In constructor ‘std::__cxx11::messages<_CharT>::messages(std::size_t)’:445/usr/include/x86_64-linux-gnu/c++/13/bits/messages_members.h:45:22: error: class ‘std::__cxx11::messages<_CharT>’ does not have any field named ‘_M_c_locale_messages’446   45 |     : facet(__refs), _M_c_locale_messages(_S_get_c_locale()),447      |                      ^~~~~~~~~~~~~~~~~~~~448/usr/include/x86_64-linux-gnu/c++/13/bits/messages_members.h:45:43: error: there are no arguments to ‘_S_get_c_locale’ that depend on a template parameter, so a declaration of ‘_S_get_c_locale’ must be available [-fpermissive]449   45 |     : facet(__refs), _M_c_locale_messages(_S_get_c_locale()),450      |                                           ^~~~~~~~~~~~~~~451/usr/include/x86_64-linux-gnu/c++/13/bits/messages_members.h: At global scope:452/usr/include/x86_64-linux-gnu/c++/13/bits/messages_members.h:50:31: error: expected constructor, destructor, or type conversion before ‘(’ token453   50 |     messages<_CharT>::messages(__c_locale __cloc, const char* __s,454      |                               ^455/usr/include/x86_64-linux-gnu/c++/13/bits/messages_members.h: In destructor ‘virtual std::__cxx11::messages<_CharT>::~messages()’:456/usr/include/x86_64-linux-gnu/c++/13/bits/messages_members.h:83:27: error: ‘_M_c_locale_messages’ was not declared in this scope; did you mean ‘_M_name_messages’?457   83 |       _S_destroy_c_locale(_M_c_locale_messages);458      |                           ^~~~~~~~~~~~~~~~~~~~459      |                           _M_name_messages460In file included from /usr/include/c++/13/bits/locale_facets_nonio.h:2067:461/usr/include/c++/13/bits/codecvt.h: At global scope:462/usr/include/c++/13/bits/codecvt.h:288:7: error: ‘__c_locale’ does not name a type; did you mean ‘locale’?463  288 |       __c_locale                        _M_c_locale_codecvt;464      |       ^~~~~~~~~~465      |       locale466/usr/include/c++/13/bits/codecvt.h:300:25: error: expected ‘)’ before ‘__cloc’467  300 |       codecvt(__c_locale __cloc, size_t __refs = 0);468      |              ~          ^~~~~~~469      |                         )470/usr/include/c++/13/bits/codecvt.h: In constructor ‘std::codecvt<_InternT, _ExternT, _StateT>::codecvt(std::size_t)’:471/usr/include/c++/13/bits/codecvt.h:296:9: error: class ‘std::codecvt<_InternT, _ExternT, _StateT>’ does not have any field named ‘_M_c_locale_codecvt’472  296 |         _M_c_locale_codecvt(0)473      |         ^~~~~~~~~~~~~~~~~~~474/usr/include/c++/13/bits/codecvt.h: At global scope:475/usr/include/c++/13/bits/codecvt.h:353:7: error: ‘__c_locale’ does not name a type; did you mean ‘locale’?476  353 |       __c_locale                        _M_c_locale_codecvt;477      |       ^~~~~~~~~~478      |       locale479/usr/include/c++/13/bits/codecvt.h:362:25: error: expected ‘)’ before ‘__cloc’480  362 |       codecvt(__c_locale __cloc, size_t __refs = 0);481      |              ~          ^~~~~~~482      |                         )483/usr/include/c++/13/bits/codecvt.h:416:7: error: ‘__c_locale’ does not name a type; did you mean ‘locale’?484  416 |       __c_locale                        _M_c_locale_codecvt;485      |       ^~~~~~~~~~486      |       locale487/usr/include/c++/13/bits/codecvt.h:425:25: error: expected ‘)’ before ‘__cloc’488  425 |       codecvt(__c_locale __cloc, size_t __refs = 0);489      |              ~          ^~~~~~~490      |                         )491In file included from /usr/include/c++/13/bits/locale_facets_nonio.h:2069:492/usr/include/c++/13/bits/locale_facets_nonio.tcc: In member function ‘virtual _InIter std::__cxx11::money_get<_CharT, _InIter>::do_get(iter_type, iter_type, bool, std::ios_base&, std::ios_base::iostate&, long double&) const’:493/usr/include/c++/13/bits/locale_facets_nonio.tcc:377:58: error: there are no arguments to ‘_S_get_c_locale’ that depend on a template parameter, so a declaration of ‘_S_get_c_locale’ must be available [-fpermissive]494  377 |       std::__convert_to_v(__str.c_str(), __units, __err, _S_get_c_locale());495      |                                                          ^~~~~~~~~~~~~~~496/usr/include/c++/13/bits/locale_facets_nonio.tcc: In member function ‘virtual _OutIter std::__cxx11::money_put<_CharT, _OutIter>::do_put(iter_type, bool, std::ios_base&, char_type, long double) const’:497/usr/include/c++/13/bits/locale_facets_nonio.tcc:604:41: error: there are no arguments to ‘_S_get_c_locale’ that depend on a template parameter, so a declaration of ‘_S_get_c_locale’ must be available [-fpermissive]498  604 |       int __len = std::__convert_from_v(_S_get_c_locale(), __cs, __cs_size,499      |                                         ^~~~~~~~~~~~~~~500/usr/include/c++/13/bits/locale_facets_nonio.tcc:611:41: error: there are no arguments to ‘_S_get_c_locale’ that depend on a template parameter, so a declaration of ‘_S_get_c_locale’ must be available [-fpermissive]501  611 |           __len = std::__convert_from_v(_S_get_c_locale(), __cs, __cs_size,502      |                                         ^~~~~~~~~~~~~~~503In file included from c_src/ei++.cpp:5:504c_src/ei++.hpp: In destructor ‘ei::Serializer::Tuple::Temp::~Temp()’:505c_src/ei++.hpp:431:29: warning: ‘throw’ will always call ‘terminate’ [-Wterminate]506  431 |                             throw "Use of operator<< only allowed for tuples with less than 256 items!";507      |                             ^~~~~~~~~~~~~~~~~~~~~~~~~~~~~~~~~~~~~~~~~~~~~~~~~~~~~~~~~~~~~~~~~~~~~~~~~~~508c_src/ei++.hpp:431:29: note: in C++11 destructors default to ‘noexcept’509510** (Mix) Could not compile dependency :erlexec, "/home/nerves/.mix/elixir/1-20-otp-29/rebar3 bare compile --paths /work/proj/_build/x86_64/lib/*/ebin" command failed. Errors may have been logged above. You can recompile this dependency with "mix deps.compile erlexec --force", update it with "mix deps.update erlexec" or clean it with "mix deps.clean erlexec"