boombox

Build log

nerves_system_qemu_aarch64

boombox 0.3.0 · fail · run boombox-0.3.0-1791172449087
1549 of 1549 lines
1Resolving Hex dependencies...2Resolution completed in 1.424s3Unchanged:4  bandit 1.12.55  bimap 1.3.06  boombox 0.3.07  bunch 1.6.48  bunch_native 0.5.29  bundlex 1.5.810  cc_precompiler 0.1.1111  certifi 2.17.012  circular_buffer 1.1.013  coerce 1.0.214  corsica 2.1.315  crc 0.11.016  elixir_make 0.10.017  elixir_uuid 1.2.118  ex_dtls 0.18.119  ex_hls 0.1.520  ex_ice 0.13.021  ex_libsrt 0.2.122  ex_libsrtp 0.7.423  ex_m3u8 0.15.424  ex_rtcp 0.4.225  ex_rtp 0.4.126  ex_sdp 1.3.027  ex_stun 0.2.128  ex_turn 0.2.329  ex_webrtc 0.15.130  finch 0.22.031  h2 0.12.432  hackney 4.8.533  heap 2.0.234  hpax 1.1.035  idna 7.1.036  image 0.54.437  interactive_cmd 0.1.438  jason 1.4.539  logger_backends 1.0.140  membrane_aac_fdk_plugin 0.18.1541  membrane_aac_format 0.8.142  membrane_aac_plugin 0.19.443  membrane_av1_format 0.3.144  membrane_cmaf_format 0.7.245  membrane_common_c 0.16.246  membrane_core 1.3.447  membrane_ffmpeg_swresample_plugin 0.21.048  membrane_ffmpeg_swscale_plugin 0.16.549  membrane_file_plugin 0.17.550  membrane_flv_plugin 0.12.051  membrane_funnel_plugin 0.9.252  membrane_h264_ffmpeg_plugin 0.32.753  membrane_h264_format 0.6.154  membrane_h265_ffmpeg_plugin 0.4.355  membrane_h265_format 0.2.056  membrane_h26x_plugin 0.10.957  membrane_hackney_plugin 0.11.358  membrane_http_adaptive_stream_plugin 0.20.259  membrane_ivf_plugin 0.9.260  membrane_mp3_lame_plugin 0.18.761  membrane_mp3_mad_plugin 0.18.762  membrane_mp4_format 0.8.163  membrane_mp4_plugin 0.36.1064  membrane_mpeg_ts_plugin 1.3.465  membrane_mpegaudio_format 0.3.266  membrane_mpegts_plugin 0.6.367  membrane_ogg_plugin 0.5.268  membrane_opus_format 0.3.269  membrane_opus_plugin 0.20.870  membrane_portaudio_plugin 0.19.671  membrane_precompiled_dependency_provider 0.2.472  membrane_raw_audio_format 0.12.373  membrane_raw_video_format 0.4.574  membrane_realtimer_plugin 0.11.175  membrane_rtmp_plugin 0.29.676  membrane_rtp_aac_plugin 0.9.877  membrane_rtp_format 0.11.178  membrane_rtp_h264_plugin 0.20.679  membrane_rtp_h265_plugin 0.5.480  membrane_rtp_opus_plugin 0.10.381  membrane_rtp_plugin 0.31.582  membrane_rtp_vp8_plugin 0.9.783  membrane_rtsp 0.10.184  membrane_rtsp_plugin 0.7.285  membrane_sdl_plugin 0.18.886  membrane_srt_plugin 0.2.387  membrane_stream_plugin 0.4.288  membrane_tcp_plugin 0.6.189  membrane_tee_plugin 0.12.090  membrane_telemetry_metrics 0.1.391  membrane_timestamp_queue 0.2.392  membrane_transcoder_plugin 0.5.093  membrane_udp_plugin 0.14.494  membrane_vp8_format 0.5.195  membrane_vp9_format 0.5.196  membrane_vpx_plugin 0.4.497  membrane_wav_plugin 0.10.398  membrane_webrtc_plugin 0.26.799  mime 2.0.7100  mimerl 1.5.0101  mint 1.11.0102  mockery 2.3.4103  mpeg_ts 2.0.2104  nerves 2.0.0-pre.2105  nerves_discovery 0.1.5106  nerves_logging 0.2.4107  nerves_runtime 0.13.13108  nerves_system_bbb 2.30.2109  nerves_system_br 1.34.4110  nerves_system_mangopi_mq_pro 0.17.2111  nerves_system_qemu_aarch64 0.4.2112  nerves_system_rpi0 2.1.2113  nerves_system_rpi4 2.1.2114  nerves_system_rpi5 2.1.2115  nerves_system_trellis 0.5.0116  nerves_system_x86_64 1.34.2117  nerves_toolchain_aarch64_nerves_linux_gnu 15.3.1118  nerves_toolchain_armv6_nerves_linux_gnueabihf 15.3.1119  nerves_toolchain_armv7_nerves_linux_gnueabihf 15.3.1120  nerves_toolchain_riscv64_nerves_linux_gnu 15.3.1121  nerves_toolchain_x86_64_nerves_linux_musl 15.3.1122  nerves_uevent 0.1.7123  nimble_options 1.1.1124  nimble_parsec 1.4.2125  nimble_pool 1.1.0126  numbers 5.2.5127  parse_trans 3.4.2128  phoenix_html 4.3.0129  plug 1.20.3130  plug_crypto 2.2.0131  property_table 0.3.4132  qex 0.5.2133  quic 2.1.1134  ratio 4.0.1135  req 0.5.18 VULNERABLE!136    EEF-CVE-2026-49755 (HIGH)137    aka: CVE-2026-49755, GHSA-655f-mp8p-96gv138    Decompression bomb DoS in Req via auto-decoded archive and compressed response bodies139    https://osv.dev/vulnerability/EEF-CVE-2026-49755140141    EEF-CVE-2026-49756 (LOW)142    aka: CVE-2026-49756, GHSA-px9f-whj3-246m143    Multipart form-data header injection in Req via unescaped name/filename/content_type144    https://osv.dev/vulnerability/EEF-CVE-2026-49756145  ring_logger 0.11.7146  shmex 0.5.2147  ssl_verify_fun 1.1.7148  stream_split 0.1.7149  sweet_xml 0.7.5150  tablet 0.3.3151  telemetry 1.4.2152  telemetry_metrics 1.2.0153  thousand_island 1.5.0154  toolshed 0.5.0155  typed_struct 0.3.0156  uboot_env 1.0.2157  unifex 1.2.5158  vix 0.42.0159  websock 0.5.3160  websock_adapter 0.5.9161  webtransport 0.4.8162  zarex 1.0.6163* Getting boombox (Hex package)164* Getting nerves (Hex package)165* Getting ring_logger (Hex package)166* Getting toolshed (Hex package)167* Getting nerves_runtime (Hex package)168* Getting nerves_system_bbb (Hex package)169* Getting nerves_system_mangopi_mq_pro (Hex package)170* Getting nerves_system_qemu_aarch64 (Hex package)171* Getting nerves_system_rpi0 (Hex package)172* Getting nerves_system_rpi4 (Hex package)173* Getting nerves_system_rpi5 (Hex package)174* Getting nerves_system_trellis (Hex package)175* Getting nerves_system_x86_64 (Hex package)176* Getting nerves_system_br (Hex package)177* Getting nerves_toolchain_x86_64_nerves_linux_musl (Hex package)178* Getting nerves_toolchain_armv7_nerves_linux_gnueabihf (Hex package)179* Getting nerves_toolchain_aarch64_nerves_linux_gnu (Hex package)180* Getting nerves_toolchain_armv6_nerves_linux_gnueabihf (Hex package)181* Getting nerves_toolchain_riscv64_nerves_linux_gnu (Hex package)182* Getting nerves_logging (Hex package)183* Getting nerves_uevent (Hex package)184* Getting uboot_env (Hex package)185* Getting elixir_make (Hex package)186* Getting property_table (Hex package)187* Getting circular_buffer (Hex package)188* Getting interactive_cmd (Hex package)189* Getting nerves_discovery (Hex package)190* Getting tablet (Hex package)191* Getting image (Hex package)192* Getting membrane_core (Hex package)193* Getting membrane_ffmpeg_swresample_plugin (Hex package)194* Getting membrane_ffmpeg_swscale_plugin (Hex package)195* Getting membrane_hackney_plugin (Hex package)196* Getting membrane_http_adaptive_stream_plugin (Hex package)197* Getting membrane_ivf_plugin (Hex package)198* Getting membrane_mp4_plugin (Hex package)199* Getting membrane_ogg_plugin (Hex package)200* Getting membrane_portaudio_plugin (Hex package)201* Getting membrane_realtimer_plugin (Hex package)202* Getting membrane_rtmp_plugin (Hex package)203* Getting membrane_rtp_aac_plugin (Hex package)204* Getting membrane_rtp_format (Hex package)205* Getting membrane_rtp_h264_plugin (Hex package)206* Getting membrane_rtp_h265_plugin (Hex package)207* Getting membrane_rtp_opus_plugin (Hex package)208* Getting membrane_rtp_plugin (Hex package)209* Getting membrane_rtsp_plugin (Hex package)210* Getting membrane_sdl_plugin (Hex package)211* Getting membrane_srt_plugin (Hex package)212* Getting membrane_stream_plugin (Hex package)213* Getting membrane_transcoder_plugin (Hex package)214* Getting membrane_vpx_plugin (Hex package)215* Getting membrane_wav_plugin (Hex package)216* Getting membrane_webrtc_plugin (Hex package)217* Getting bandit (Hex package)218* Getting corsica (Hex package)219* Getting ex_webrtc (Hex package)220* Getting membrane_rtp_vp8_plugin (Hex package)221* Getting req (Hex package)222* Getting websock_adapter (Hex package)223* Getting plug (Hex package)224* Getting websock (Hex package)225* Getting mime (Hex package)226* Getting plug_crypto (Hex package)227* Getting telemetry (Hex package)228* Getting finch (Hex package)229* Getting jason (Hex package)230* Getting mint (Hex package)231* Getting nimble_options (Hex package)232* Getting nimble_pool (Hex package)233* Getting hpax (Hex package)234* Getting membrane_vp8_format (Hex package)235* Getting crc (Hex package)236* Getting ex_dtls (Hex package)237* Getting ex_ice (Hex package)238* Getting ex_libsrtp (Hex package)239* Getting ex_rtcp (Hex package)240* Getting ex_rtp (Hex package)241* Getting ex_sdp (Hex package)242* Getting bunch (Hex package)243* Getting elixir_uuid (Hex package)244* Getting bundlex (Hex package)245* Getting membrane_precompiled_dependency_provider (Hex package)246* Getting unifex (Hex package)247* Getting shmex (Hex package)248* Getting bunch_native (Hex package)249* Getting qex (Hex package)250* Getting zarex (Hex package)251* Getting ex_stun (Hex package)252* Getting ex_turn (Hex package)253* Getting thousand_island (Hex package)254* Getting membrane_raw_audio_format (Hex package)255* Getting bimap (Hex package)256* Getting membrane_raw_video_format (Hex package)257* Getting membrane_vp9_format (Hex package)258* Getting membrane_aac_fdk_plugin (Hex package)259* Getting membrane_aac_format (Hex package)260* Getting membrane_aac_plugin (Hex package)261* Getting membrane_funnel_plugin (Hex package)262* Getting membrane_h264_ffmpeg_plugin (Hex package)263* Getting membrane_h264_format (Hex package)264* Getting membrane_h265_ffmpeg_plugin (Hex package)265* Getting membrane_h265_format (Hex package)266* Getting membrane_h26x_plugin (Hex package)267* Getting membrane_mp3_lame_plugin (Hex package)268* Getting membrane_mp3_mad_plugin (Hex package)269* Getting membrane_mpegaudio_format (Hex package)270* Getting membrane_opus_format (Hex package)271* Getting membrane_opus_plugin (Hex package)272* Getting membrane_tee_plugin (Hex package)273* Getting membrane_timestamp_queue (Hex package)274* Getting heap (Hex package)275* Getting membrane_common_c (Hex package)276* Getting ex_libsrt (Hex package)277* Getting membrane_mpeg_ts_plugin (Hex package)278* Getting membrane_mpegts_plugin (Hex package)279* Getting mpeg_ts (Hex package)280* Getting membrane_rtsp (Hex package)281* Getting membrane_tcp_plugin (Hex package)282* Getting membrane_udp_plugin (Hex package)283* Getting mockery (Hex package)284* Getting nimble_parsec (Hex package)285* Getting membrane_telemetry_metrics (Hex package)286* Getting telemetry_metrics (Hex package)287* Getting membrane_file_plugin (Hex package)288* Getting membrane_flv_plugin (Hex package)289* Getting logger_backends (Hex package)290* Getting membrane_cmaf_format (Hex package)291* Getting membrane_mp4_format (Hex package)292* Getting membrane_av1_format (Hex package)293* Getting ex_hls (Hex package)294* Getting stream_split (Hex package)295* Getting ex_m3u8 (Hex package)296* Getting typed_struct (Hex package)297* Getting hackney (Hex package)298* Getting certifi (Hex package)299* Getting h2 (Hex package)300* Getting idna (Hex package)301* Getting mimerl (Hex package)302* Getting parse_trans (Hex package)303* Getting quic (Hex package)304* Getting ssl_verify_fun (Hex package)305* Getting webtransport (Hex package)306* Getting ratio (Hex package)307* Getting numbers (Hex package)308* Getting coerce (Hex package)309* Getting phoenix_html (Hex package)310* Getting sweet_xml (Hex package)311* Getting vix (Hex package)312* Getting cc_precompiler (Hex package)313Found packages with security advisories, see above for details314You have added/upgraded packages you could sponsor, run `mix hex.sponsor` to learn more315==> nerves_system_br316Generated nerves_system_br app317==> typed_struct318Compiling 2 files (.ex)319Generated typed_struct app320==> membrane_mp4_format321Compiling 1 file (.ex)322Generated membrane_mp4_format app323==> mime324Compiling 1 file (.ex)325Generated mime app326==> circular_buffer327Compiling 1 file (.ex)328Generated circular_buffer app329==> nimble_options330Compiling 3 files (.ex)331Generated nimble_options app332==> membrane_vp8_format333Compiling 1 file (.ex)334Generated membrane_vp8_format app335==> jason336Compiling 10 files (.ex)337Generated jason app338==> logger_backends339Compiling 7 files (.ex)340Generated logger_backends app341==> plug_crypto342Compiling 5 files (.ex)343Generated plug_crypto app344 C      checksum_xor.c345 C      crc_8.c346 C      crc_algorithm.c347 C      crc_model.c348 C      crc_nif.c349 C      crc_resource.c350 C      xnif_slice.c351 LD     crc_nif.so352==> crc353Compiling 7 files (.erl)354Compiling 3 files (.ex)355Generated crc app356==> stream_split357Compiling 1 file (.ex)358Generated stream_split app359==> hpax360Compiling 4 files (.ex)361Generated hpax app362==> mint363Compiling 1 file (.erl)364Compiling 21 files (.ex)365Generated mint app366==> nerves_compatibility_test367===> Analyzing applications...368===> Compiling mimerl369==> coerce370Compiling 3 files (.ex)371Generated coerce app372==> bunch373Compiling 19 files (.ex)374Generated bunch app375==> ssl_verify_fun376Compiling 7 files (.erl)377Generated ssl_verify_fun app378==> nerves_compatibility_test379===> Analyzing applications...380===> Compiling h2381==> ex_rtcp382Compiling 14 files (.ex)383Generated ex_rtcp app384==> mpeg_ts385Compiling 9 files (.ex)386    warning: the variable "content_length" is accessed inside size(...) of a bitstring but it was defined outside of the match. You must precede it with the pin operator387    │388 38 │         <<raw_data::binary-size(content_length), _crc::@crc_length-binary, _::binary>> ->389    │                                 ~390    │391    └─ lib/mpeg/ts/psi.ex:38:33: MPEG.TS.PSI.unmarshal/2392393     warning: the variable "leader" is accessed inside size(...) of a bitstring but it was defined outside of the match. You must precede it with the pin operator394     │395 120 │           <<payload::binary-size(leader.length)-unit(8), _rest::binary>> = payload396     │                                  ~397     │398     └─ lib/mpeg/ts/stream_queue.ex:120:34: MPEG.TS.StreamQueue.depayload/1399400    warning: the variable "program_info_length" is accessed inside size(...) of a bitstring but it was defined outside of the match. You must precede it with the pin operator401    │402 73 │     <<_program_descriptors::binary-size(program_info_length), rest::binary>> = data403    │                                         ~404    │405    └─ lib/mpeg/ts/pmt.ex:73:41: MPEG.TS.PMT.parse_program_info/2406407    warning: unused require Logger408    │409 22 │   require Logger410    │   ~411    │412    └─ lib/mpeg/ts/partial_pes.ex:22:3413414    warning: a struct for MPEG.TS.Demuxer is expected on struct update:415416        %MPEG.TS.Demuxer{state | buffered_bytes: <<>>}417418    but got type:419420        dynamic(%{..., buffered_bytes: binary()})421422    where "state" was given the type:423424        # type: dynamic(%{..., buffered_bytes: binary()})425        # from: lib/mpeg/ts/demuxer.ex:34426        <<state.buffered_bytes::binary, ...>>427428    when defining the variable "state", you must also pattern match on "%MPEG.TS.Demuxer{}"429430    type warning found at:431    │432 41 │     state = push_packets(%__MODULE__{state | buffered_bytes: <<>>}, ok)433    │                          ~434    │435    └─ lib/mpeg/ts/demuxer.ex:41:26: MPEG.TS.Demuxer.push_buffer/3436437     warning: a struct for MPEG.TS.Demuxer is expected on struct update:438439         %MPEG.TS.Demuxer{state | pmt: pmt}440441     but got type:442443         dynamic()444445     where "state" was given the type:446447         # type: dynamic()448         # from: lib/mpeg/ts/demuxer.ex:111:25449         state450451     when defining the variable "state", you must also pattern match on "%MPEG.TS.Demuxer{}"452453     type warning found at:454     │455 127 │     %__MODULE__{state | pmt: pmt}456     │     ~457     │458     └─ lib/mpeg/ts/demuxer.ex:127:5: MPEG.TS.Demuxer.push_pmt_packets/2459460Generated mpeg_ts app461==> tablet462Compiling 2 files (.ex)463Generated tablet app464==> zarex465Compiling 1 file (.ex)466Generated zarex app467==> numbers468Compiling 7 files (.ex)469Generated numbers app470==> elixir_make471Compiling 8 files (.ex)472Generated elixir_make app473==> nerves_logging474 CC kmsg_tailer.o475 LD kmsg_tailer476Compiling 5 files (.ex)477Generated nerves_logging app478==> mockery479Compiling 8 files (.ex)480Generated mockery app481==> ratio482Compiling 5 files (.ex)483Generated ratio app484==> elixir_uuid485Compiling 1 file (.ex)486    warning: use Bitwise is deprecated. import Bitwise instead487    │488  2 │   use Bitwise, only_operators: true489    │   ~~~~~~~~~~~~~~~~~~~~~~~~~~~~~~~~~490    │491    └─ lib/uuid.ex:2: UUID (module)492493Generated elixir_uuid app494==> nerves_discovery495Compiling 5 files (.ex)496Generated nerves_discovery app497==> ring_logger498Compiling 7 files (.ex)499Generated ring_logger app500==> interactive_cmd501Compiling 1 file (.ex)502Generated interactive_cmd app503==> nerves504Compiling 65 files (.ex)505    warning: redefining module Mix.Tasks.Nerves.Init (current version loaded from /work/proj/_build/qemu_aarch64/lib/nerves/ebin/Elixir.Mix.Tasks.Nerves.Init.beam)506    │507  6 │ defmodule Mix.Tasks.Nerves.Init do508    │ ~~~~~~~~~~~~~~~~~~~~~~~~~~~~~~~~~~509    │510    └─ lib/mix/tasks/nerves.init.ex:6: Mix.Tasks.Nerves.Init (module)511512    warning: redefining module Nerves (current version loaded from /work/proj/_build/qemu_aarch64/lib/nerves/ebin/Elixir.Nerves.beam)513    │514  6 │ defmodule Nerves do515    │ ~~~~~~~~~~~~~~~~~~~516    │517    └─ lib/nerves.ex:6: Nerves (module)518519    warning: redefining module Nerves.ArtifactResolver (current version loaded from /work/proj/_build/qemu_aarch64/lib/nerves/ebin/Elixir.Nerves.ArtifactResolver.beam)520    │521  5 │ defmodule Nerves.ArtifactResolver do522    │ ~~~~~~~~~~~~~~~~~~~~~~~~~~~~~~~~~~~~523    │524    └─ lib/nerves/artifact_resolver.ex:5: Nerves.ArtifactResolver (module)525526    warning: redefining module Nerves.BuildAction.AppModes (current version loaded from /work/proj/_build/qemu_aarch64/lib/nerves/ebin/Elixir.Nerves.BuildAction.AppModes.beam)527    │528  6 │ defmodule Nerves.BuildAction.AppModes do529    │ ~~~~~~~~~~~~~~~~~~~~~~~~~~~~~~~~~~~~~~~~530    │531    └─ lib/nerves/build_action/app_modes.ex:6: Nerves.BuildAction.AppModes (module)532533    warning: redefining module Nerves.BuildAction.CheckExecutables (current version loaded from /work/proj/_build/qemu_aarch64/lib/nerves/ebin/Elixir.Nerves.BuildAction.CheckExecutables.beam)534    │535  5 │ defmodule Nerves.BuildAction.CheckExecutables do536    │ ~~~~~~~~~~~~~~~~~~~~~~~~~~~~~~~~~~~~~~~~~~~~~~~~537    │538    └─ lib/nerves/build_action/check_executables.ex:5: Nerves.BuildAction.CheckExecutables (module)539540    warning: redefining module Nerves.BuildAction.Erlinit (current version loaded from /work/proj/_build/qemu_aarch64/lib/nerves/ebin/Elixir.Nerves.BuildAction.Erlinit.beam)541    │542  8 │ defmodule Nerves.BuildAction.Erlinit do543    │ ~~~~~~~~~~~~~~~~~~~~~~~~~~~~~~~~~~~~~~~544    │545    └─ lib/nerves/build_action/erlinit.ex:8: Nerves.BuildAction.Erlinit (module)546547    warning: redefining module Nerves.BuildAction.Firmware (current version loaded from /work/proj/_build/qemu_aarch64/lib/nerves/ebin/Elixir.Nerves.BuildAction.Firmware.beam)548    │549  5 │ defmodule Nerves.BuildAction.Firmware do550    │ ~~~~~~~~~~~~~~~~~~~~~~~~~~~~~~~~~~~~~~~~551    │552    └─ lib/nerves/build_action/firmware.ex:5: Nerves.BuildAction.Firmware (module)553554    warning: redefining module Nerves.BuildAction.IExStartupCheck (current version loaded from /work/proj/_build/qemu_aarch64/lib/nerves/ebin/Elixir.Nerves.BuildAction.IExStartupCheck.beam)555    │556  7 │ defmodule Nerves.BuildAction.IExStartupCheck do557    │ ~~~~~~~~~~~~~~~~~~~~~~~~~~~~~~~~~~~~~~~~~~~~~~~558    │559    └─ lib/nerves/build_action/iex_startup_check.ex:7: Nerves.BuildAction.IExStartupCheck (module)560561    warning: redefining module Nerves.BuildAction.NervesV1System (current version loaded from /work/proj/_build/qemu_aarch64/lib/nerves/ebin/Elixir.Nerves.BuildAction.NervesV1System.beam)562    │563  5 │ defmodule Nerves.BuildAction.NervesV1System do564    │ ~~~~~~~~~~~~~~~~~~~~~~~~~~~~~~~~~~~~~~~~~~~~~~565    │566    └─ lib/nerves/build_action/nerves_v1_system.ex:5: Nerves.BuildAction.NervesV1System (module)567568    warning: redefining module Nerves.BuildAction.NervesV1Toolchain (current version loaded from /work/proj/_build/qemu_aarch64/lib/nerves/ebin/Elixir.Nerves.BuildAction.NervesV1Toolchain.beam)569    │570  5 │ defmodule Nerves.BuildAction.NervesV1Toolchain do571    │ ~~~~~~~~~~~~~~~~~~~~~~~~~~~~~~~~~~~~~~~~~~~~~~~~~572    │573    └─ lib/nerves/build_action/nerves_v1_toolchain.ex:5: Nerves.BuildAction.NervesV1Toolchain (module)574575    warning: redefining module Nerves.BuildAction.Rootfs (current version loaded from /work/proj/_build/qemu_aarch64/lib/nerves/ebin/Elixir.Nerves.BuildAction.Rootfs.beam)576    │577  5 │ defmodule Nerves.BuildAction.Rootfs do578    │ ~~~~~~~~~~~~~~~~~~~~~~~~~~~~~~~~~~~~~~579    │580    └─ lib/nerves/build_action/rootfs.ex:5: Nerves.BuildAction.Rootfs (module)581582    warning: redefining module Nerves.BuildAction.SortApps (current version loaded from /work/proj/_build/qemu_aarch64/lib/nerves/ebin/Elixir.Nerves.BuildAction.SortApps.beam)583    │584  6 │ defmodule Nerves.BuildAction.SortApps do585    │ ~~~~~~~~~~~~~~~~~~~~~~~~~~~~~~~~~~~~~~~~586    │587    └─ lib/nerves/build_action/sort_apps.ex:6: Nerves.BuildAction.SortApps (module)588589    warning: redefining module Nerves.BuildAction.StripAll (current version loaded from /work/proj/_build/qemu_aarch64/lib/nerves/ebin/Elixir.Nerves.BuildAction.StripAll.beam)590    │591  5 │ defmodule Nerves.BuildAction.StripAll do592    │ ~~~~~~~~~~~~~~~~~~~~~~~~~~~~~~~~~~~~~~~~593    │594    └─ lib/nerves/build_action/strip_all.ex:5: Nerves.BuildAction.StripAll (module)595596    warning: redefining module Nerves.BuildAction.Trimmer (current version loaded from /work/proj/_build/qemu_aarch64/lib/nerves/ebin/Elixir.Nerves.BuildAction.Trimmer.beam)597    │598  5 │ defmodule Nerves.BuildAction.Trimmer do599    │ ~~~~~~~~~~~~~~~~~~~~~~~~~~~~~~~~~~~~~~~600    │601    └─ lib/nerves/build_action/trimmer.ex:5: Nerves.BuildAction.Trimmer (module)602603    warning: redefining module Nerves.BuildPlan (current version loaded from /work/proj/_build/qemu_aarch64/lib/nerves/ebin/Elixir.Nerves.BuildPlan.beam)604    │605  5 │ defmodule Nerves.BuildPlan do606    │ ~~~~~~~~~~~~~~~~~~~~~~~~~~~~~607    │608    └─ lib/nerves/build_plan.ex:5: Nerves.BuildPlan (module)609610    warning: redefining module Nerves.BuildPlan.Checks (current version loaded from /work/proj/_build/qemu_aarch64/lib/nerves/ebin/Elixir.Nerves.BuildPlan.Checks.beam)611    │612  5 │ defmodule Nerves.BuildPlan.Checks do613    │ ~~~~~~~~~~~~~~~~~~~~~~~~~~~~~~~~~~~~614    │615    └─ lib/nerves/build_plan/checks.ex:5: Nerves.BuildPlan.Checks (module)616617    warning: redefining module Nerves.Container (current version loaded from /work/proj/_build/qemu_aarch64/lib/nerves/ebin/Elixir.Nerves.Container.beam)618    │619  6 │ defmodule Nerves.Container do620    │ ~~~~~~~~~~~~~~~~~~~~~~~~~~~~~621    │622    └─ lib/nerves/container.ex:6: Nerves.Container (module)623624    warning: redefining module Nerves.Fingerprint (current version loaded from /work/proj/_build/qemu_aarch64/lib/nerves/ebin/Elixir.Nerves.Fingerprint.beam)625    │626  5 │ defmodule Nerves.Fingerprint do627    │ ~~~~~~~~~~~~~~~~~~~~~~~~~~~~~~~628    │629    └─ lib/nerves/fingerprint.ex:5: Nerves.Fingerprint (module)630631    warning: redefining module Nerves.MixPackage (current version loaded from /work/proj/_build/qemu_aarch64/lib/nerves/ebin/Elixir.Nerves.MixPackage.beam)632    │633  5 │ defmodule Nerves.MixPackage do634    │ ~~~~~~~~~~~~~~~~~~~~~~~~~~~~~~635    │636    └─ lib/nerves/mix_package.ex:5: Nerves.MixPackage (module)637638    warning: redefining module Nerves.Paths (current version loaded from /work/proj/_build/qemu_aarch64/lib/nerves/ebin/Elixir.Nerves.Paths.beam)639    │640  5 │ defmodule Nerves.Paths do641    │ ~~~~~~~~~~~~~~~~~~~~~~~~~642    │643    └─ lib/nerves/paths.ex:5: Nerves.Paths (module)644645    warning: redefining module Nerves.TargetTuple (current version loaded from /work/proj/_build/qemu_aarch64/lib/nerves/ebin/Elixir.Nerves.TargetTuple.beam)646    │647  5 │ defmodule Nerves.TargetTuple do648    │ ~~~~~~~~~~~~~~~~~~~~~~~~~~~~~~~649    │650    └─ lib/nerves/target_tuple.ex:5: Nerves.TargetTuple (module)651652Generated nerves app653==> nerves_toolchain_aarch64_nerves_linux_gnu654Compiling 1 file (.ex)655Generated nerves_toolchain_aarch64_nerves_linux_gnu app656==> nerves_system_qemu_aarch64657Compiling 1 file (.ex)658Generated nerves_system_qemu_aarch64 app659==> nerves_compatibility_test660===> Analyzing applications...661===> Compiling idna662==> nimble_parsec663Compiling 4 files (.ex)664Generated nimble_parsec app665==> ex_m3u8666Compiling 25 files (.ex)667     warning: unused require ExM3U8.Helpers668     │669 123 │     require ExM3U8.Helpers670     │     ~671     │672     └─ lib/ex_m3u8/dsl.ex:123:5673674     warning: a struct for ExM3U8.Tags.Stream is expected on struct update:675676         %ExM3U8.Tags.Stream{variant | uri: uri}677678     but got type:679680         dynamic()681682     where "variant" was given the type:683684         # type: dynamic()685         # from: lib/ex_m3u8/deserializer/parser.ex:355:25686         {:ok, variant} <- ExM3U8.Tags.Stream.deserialize(attrs)687688     when defining the variable "variant", you must also pattern match on "%ExM3U8.Tags.Stream{}"689690     type warning found at:691     │692 356 │       {:ok, :stream, %ExM3U8.Tags.Stream{variant | uri: uri}, lines}693     │                      ~694     │695     └─ lib/ex_m3u8/deserializer/parser.ex:356:22: ExM3U8.Deserializer.Parser.do_parse/3696697Generated ex_m3u8 app698==> membrane_cmaf_format699Compiling 1 file (.ex)700Generated membrane_cmaf_format app701==> nerves_compatibility_test702===> Analyzing applications...703===> Compiling telemetry704==> thousand_island705Compiling 18 files (.ex)706Generated thousand_island app707==> telemetry_metrics708Compiling 7 files (.ex)709Generated telemetry_metrics app710==> membrane_telemetry_metrics711Compiling 7 files (.ex)712    warning: the following clause cannot match because the previous clauses already matched all possible values:713714        _ ->715716    it attempts to match on the result of:717718        emit_event?(event_name)719720    which has the already matched type:721722        dynamic(false)723724    type warning found at:725    │726 14 │     if emit_event?(event_name) do727    │     ~~~~~~~~~~~~~~~~~~~~~~~~~~~~~728    │729    └─ lib/telemetry_metrics.ex:14: Membrane.TelemetryMetrics.conditional_execute/5730731    warning: the following clause cannot match because the previous clauses already matched all possible values:732733        _ ->734735    it attempts to match on the result of:736737        emit_event?(event_name)738739    which has the already matched type:740741        dynamic(false)742743    type warning found at:744    │745 43 │     if emit_event?(event_name) do746    │     ~~~~~~~~~~~~~~~~~~~~~~~~~~~~~747    │748    └─ lib/telemetry_metrics.ex:43: Membrane.TelemetryMetrics.execute/4749750    warning: the following clause cannot match because the previous clauses already matched all possible values:751752        _ ->753754    it attempts to match on the result of:755756        emit_event?(event_name)757758    which has the already matched type:759760        dynamic(false)761762    type warning found at:763    │764 70 │     if emit_event?(event_name) do765    │     ~~~~~~~~~~~~~~~~~~~~~~~~~~~~~766    │767    └─ lib/telemetry_metrics.ex:70: Membrane.TelemetryMetrics.register/2768769Generated membrane_telemetry_metrics app770==> membrane_h265_format771Compiling 1 file (.ex)772Generated membrane_h265_format app773==> phoenix_html774Compiling 6 files (.ex)775Generated phoenix_html app776==> membrane_h264_format777Compiling 1 file (.ex)778Generated membrane_h264_format app779==> membrane_mpegaudio_format780Compiling 1 file (.ex)781Generated membrane_mpegaudio_format app782==> bimap783Compiling 2 files (.ex)784Generated bimap app785==> membrane_aac_format786Compiling 1 file (.ex)787Generated membrane_aac_format app788==> heap789Compiling 4 files (.ex)790Generated heap app791==> membrane_vp9_format792Compiling 1 file (.ex)793Generated membrane_vp9_format app794==> membrane_opus_format795Compiling 1 file (.ex)796Generated membrane_opus_format app797==> nerves_compatibility_test798===> Analyzing applications...799===> Compiling certifi800==> ex_rtp801Compiling 5 files (.ex)802Generated ex_rtp app803==> ex_sdp804Compiling 26 files (.ex)805Generated ex_sdp app806==> membrane_rtsp807Compiling 11 files (.ex)808    warning: unused require Logger809    │810  5 │   require Logger811    │   ~812    │813    └─ lib/membrane_rtsp/server/conn.ex:5:3814815     warning: a struct for Membrane.RTSP.State is expected on struct update:816817         %Membrane.RTSP.State{state | cseq: state.cseq + 1}818819     but got type:820821         dynamic()822823     where "state" was given the type:824825         # type: dynamic()826         # from: lib/membrane_rtsp/rtsp.ex:270:23827         {:ok, state} <- detect_authentication_type(parsed_response, state)828829     when defining the variable "state", you must also pattern match on "%Membrane.RTSP.State{}"830831     type warning found at:832     │833 271 │       state = %State{state | cseq: state.cseq + 1}834     │               ~835     │836     └─ lib/membrane_rtsp/rtsp.ex:271:15: Membrane.RTSP.parse_response/2837838     warning: a struct for URI is expected on struct update:839840         %URI{uri | userinfo: nil}841842     but got type:843844         dynamic()845846     where "uri" was given the type:847848         # type: dynamic()849         # from: lib/membrane_rtsp/request.ex:163:28850         uri851852     when defining the variable "uri", you must also pattern match on "%URI{}"853854     type warning found at:855     │856 164 │     %URI{uri | userinfo: nil}857     │     ~858     │859     └─ lib/membrane_rtsp/request.ex:164:5: Membrane.RTSP.Request.process_uri/2860861Generated membrane_rtsp app862==> plug863Compiling 1 file (.erl)864Compiling 42 files (.ex)865Generated plug app866==> nerves_compatibility_test867===> Analyzing applications...868===> Compiling parse_trans869==> uboot_env870Compiling 5 files (.ex)871Generated uboot_env app872==> qex873Compiling 4 files (.ex)874warning: x..y inside match is deprecated, you must always match on the step: x..y//var or x..y//_ if you want to ignore it875  lib/qex.ex:45: Qex.new/1876877Generated qex app878==> membrane_core879Compiling 143 files (.ex)880Generated membrane_core app881==> membrane_ogg_plugin882Compiling 5 files (.ex)883    warning: the variable "page_segments_count" is accessed inside size(...) of a bitstring but it was defined outside of the match. You must precede it with the pin operator884    │885 86 │       <<segment_table::binary-size(page_segments_count), data::binary>> ->886    │                                    ~887    │888    └─ lib/parser.ex:86:36: Membrane.Ogg.Parser.parse_segment_table/2889890     warning: the variable "after_crc_size" is accessed inside size(...) of a bitstring but it was defined outside of the match. You must precede it with the pin operator891     │892 105 │         after_crc::binary-size(after_crc_size), _rest::binary>> = data893     │                                ~894     │895     └─ lib/parser.ex:105:32: Membrane.Ogg.Parser.verify_length_and_crc/2896897     warning: the variable "count" is accessed inside size(...) of a bitstring but it was defined outside of the match. You must precede it with the pin operator898     │899 175 │     <<packet::binary-size(count), rem_data::binary>> = data900     │                           ~901     │902     └─ lib/parser.ex:175:27: Membrane.Ogg.Parser.split_packets/2903904     warning: the following clause is redundant:905906         <<>> ->907908     previous clauses have already matched on the following types:909910         binary()911912     type warning found at:913     │914 129 │       <<>> ->915     │            ~916     │917     └─ lib/page.ex:129:12: Membrane.Ogg.Page.get_packet_segment_table/1918919Generated membrane_ogg_plugin app920==> membrane_rtp_format921Compiling 5 files (.ex)922Generated membrane_rtp_format app923==> membrane_rtp_aac_plugin924Compiling 4 files (.ex)925    warning: the variable "au_size_length" is accessed inside size(...) of a bitstring but it was defined outside of the match. You must precede it with the pin operator926    │927 69 │       for <<au_size::size(au_size_length), au_index::size(au_index_length) <- header_section>>,928    │                           ~929    │930    └─ lib/membrane_element_rtp_aac/utils.ex:69:27: Membrane.RTP.AAC.Utils.parse_packet/2931932    warning: the variable "au_index_length" is accessed inside size(...) of a bitstring but it was defined outside of the match. You must precede it with the pin operator933    │934 69 │       for <<au_size::size(au_size_length), au_index::size(au_index_length) <- header_section>>,935    │                                                           ~936    │937    └─ lib/membrane_element_rtp_aac/utils.ex:69:59: Membrane.RTP.AAC.Utils.parse_packet/2938939    warning: the variable "len" is accessed inside size(...) of a bitstring but it was defined outside of the match. You must precede it with the pin operator940    │941 95 │           <<au::binary-size(len), rest::binary>> -> {{:ok, au}, rest}942    │                             ~943    │944    └─ lib/membrane_element_rtp_aac/utils.ex:95:29: Membrane.RTP.AAC.Utils.parse_data_section/2945946Generated membrane_rtp_aac_plugin app947==> membrane_rtp_h264_plugin948Compiling 8 files (.ex)949    warning: the variable "preferred_size" is accessed inside size(...) of a bitstring but it was defined outside of the match. You must precede it with the pin operator950    │951 37 │       <<header::1-binary, head::binary-size(preferred_size - 1), rest::binary>> ->952    │                                             ~953    │954    └─ lib/rtp_h264/nal_formats/fu.ex:37:45: Membrane.RTP.H264.FU.serialize/2955956    warning: the variable "preferred_size" is accessed inside size(...) of a bitstring but it was defined outside of the match. You must precede it with the pin operator957    │958 54 │       <<head::binary-size(preferred_size - 2), rest::binary>> when byte_size(rest) > 0 ->959    │                           ~960    │961    └─ lib/rtp_h264/nal_formats/fu.ex:54:27: Membrane.RTP.H264.FU.do_serialize/5962963     warning: the variable "offset" is accessed inside size(...) of a bitstring but it was defined outside of the match. You must precede it with the pin operator964     │965 120 │       <<_x::binary-size(offset), nalu::binary-size(nalu_size), remaining_aus::binary>> = rest966     │                         ~967     │968     └─ lib/rtp_h264/utils.ex:120:25: Membrane.RTP.H264.Utils.check_first_aggregation_unit/3969970     warning: the variable "nalu_size" is accessed inside size(...) of a bitstring but it was defined outside of the match. You must precede it with the pin operator971     │972 120 │       <<_x::binary-size(offset), nalu::binary-size(nalu_size), remaining_aus::binary>> = rest973     │                                                    ~974     │975     └─ lib/rtp_h264/utils.ex:120:52: Membrane.RTP.H264.Utils.check_first_aggregation_unit/3976977Generated membrane_rtp_h264_plugin app978==> membrane_rtp_h265_plugin979Compiling 6 files (.ex)980    warning: the variable "chunk_size" is accessed inside size(...) of a bitstring but it was defined outside of the match. You must precede it with the pin operator981    │982 56 │     <<head::binary-size(chunk_size), rest::binary>> = rest983    │                         ~984    │985    └─ lib/nal_formats/fu.ex:56:25: Membrane.RTP.H265.FU.serialize/2986987    warning: the variable "preferred_size" is accessed inside size(...) of a bitstring but it was defined outside of the match. You must precede it with the pin operator988    │989 70 │     <<head::binary-size(preferred_size), rest::binary>> = data990    │                         ~991    │992    └─ lib/nal_formats/fu.ex:70:25: Membrane.RTP.H265.FU.do_serialize/6993994Generated membrane_rtp_h265_plugin app995==> membrane_rtp_opus_plugin996Compiling 3 files (.ex)997Generated membrane_rtp_opus_plugin app998==> membrane_stream_plugin999Compiling 7 files (.ex)1000Generated membrane_stream_plugin app1001==> membrane_rtp_vp8_plugin1002Compiling 6 files (.ex)1003Generated membrane_rtp_vp8_plugin app1004==> membrane_raw_audio_format1005Compiling 2 files (.ex)1006Generated membrane_raw_audio_format app1007==> membrane_aac_plugin1008Compiling 6 files (.ex)1009    warning: the variable "size" is accessed inside size(...) of a bitstring but it was defined outside of the match. You must precede it with the pin operator1010    │1011 89 │       <<frame::binary-size(size), rest::binary>> -> {:frame, frame, rest}1012    │                            ~1013    │1014    └─ lib/membrane/aac/parser/adts.ex:89:28: Membrane.AAC.Parser.ADTS.extract_frame/410151016    warning: the variable "adts_size" is accessed inside size(...) of a bitstring but it was defined outside of the match. You must precede it with the pin operator1017    │1018 98 │       <<_adts::binary-size(adts_size), frame::binary-size(frame_size), rest::binary>> ->1019    │                            ~1020    │1021    └─ lib/membrane/aac/parser/adts.ex:98:28: Membrane.AAC.Parser.ADTS.extract_frame/410221023    warning: the variable "frame_size" is accessed inside size(...) of a bitstring but it was defined outside of the match. You must precede it with the pin operator1024    │1025 98 │       <<_adts::binary-size(adts_size), frame::binary-size(frame_size), rest::binary>> ->1026    │                                                           ~1027    │1028    └─ lib/membrane/aac/parser/adts.ex:98:59: Membrane.AAC.Parser.ADTS.extract_frame/410291030    warning: the variable "custom_frequency_length" is accessed inside size(...) of a bitstring but it was defined outside of the match. You must precede it with the pin operator1031    │1032 32 │     <<custom_frequency::integer-size(custom_frequency_length), channel_config_id::4,1033    │                                      ~1034    │1035    └─ lib/membrane/aac/parser/audio_specific_config.ex:32:38: Membrane.AAC.Parser.AudioSpecificConfig.parse_audio_specific_config/110361037    warning: the variable "url_length" is accessed inside size(...) of a bitstring but it was defined outside of the match. You must precede it with the pin operator1038    │1039 58 │         <<_url::binary-size(url_length), rest::binary>> = rest1040    │                             ~1041    │1042    └─ lib/membrane/aac/parser/esds.ex:58:29: Membrane.AAC.Parser.Esds.parse_esds/110431044    warning: the variable "payload_size" is accessed inside size(...) of a bitstring but it was defined outside of the match. You must precede it with the pin operator1045    │1046 93 │         <<payload::binary-size(payload_size), rest::binary>> = rest1047    │                                ~1048    │1049    └─ lib/membrane/aac/parser/esds.ex:93:32: Membrane.AAC.Parser.Esds.unpack_esds_section/210501051    warning: the variable "payload_size" is accessed inside size(...) of a bitstring but it was defined outside of the match. You must precede it with the pin operator1052    │1053 97 │         <<payload::binary-size(payload_size), rest::binary>> = rest1054    │                                ~1055    │1056    └─ lib/membrane/aac/parser/esds.ex:97:32: Membrane.AAC.Parser.Esds.unpack_esds_section/210571058Generated membrane_aac_plugin app1059==> membrane_funnel_plugin1060Compiling 2 files (.ex)1061Generated membrane_funnel_plugin app1062==> membrane_h26x_plugin1063Compiling 31 files (.ex)1064Generated membrane_h26x_plugin app1065==> membrane_tee_plugin1066Compiling 3 files (.ex)1067106804:04:13.494 [warning] Membrane.Tee.Master defines pads with `flow_control: :auto` and pads with `flow_control: :push` at the same time. Please, consider if this what you want to do - flow control of these pads won't be integrated. Setting `flow_control` to `:auto` in the places where it has been set to `:push` might be a good idea.1069Pads with `flow_control: :auto`: input, master.1070Pads with `flow_control: :push`: copy.10711072If you want get rid of this warning, pass `flow_control_hints?: false` option to `use Membrane.Filter`.10731074107504:04:13.551 [warning] Membrane.Tee.PushOutput defines pads with `flow_control: :auto` and pads with `flow_control: :push` at the same time. Please, consider if this what you want to do - flow control of these pads won't be integrated. Setting `flow_control` to `:auto` in the places where it has been set to `:push` might be a good idea.1076Pads with `flow_control: :auto`: input.1077Pads with `flow_control: :push`: output.10781079If you want get rid of this warning, pass `flow_control_hints?: false` option to `use Membrane.Filter`.10801081Generated membrane_tee_plugin app1082==> membrane_timestamp_queue1083Compiling 1 file (.ex)1084Generated membrane_timestamp_queue app1085==> membrane_mpeg_ts_plugin1086Compiling 4 files (.ex)1087     warning: the variable "min_size" is accessed inside size(...) of a bitstring but it was defined outside of the match. You must precede it with the pin operator1088     │1089 409 │         <<payload::binary-size(min_size)-unit(8), rest::binary>> = payload1090     │                                ~1091     │1092     └─ lib/membrane/mpeg/ts/muxer.ex:409:32: Membrane.MPEG.TS.Muxer.do_marshal_ts/510931094     warning: the variable "size" is accessed inside size(...) of a bitstring but it was defined outside of the match. You must precede it with the pin operator1095     │1096 470 │           <<payload::binary-size(size)-unit(8), rest::binary>> = payload1097     │                                  ~1098     │1099     └─ lib/membrane/mpeg/ts/muxer.ex:470:34: Membrane.MPEG.TS.Muxer.do_marshal_ts/511001101     warning: a struct for MPEG.TS.Demuxer is expected on struct update:11021103         %MPEG.TS.Demuxer{state.demuxer | packet_filter: &Enum.__in__(&1, followed_stream_ids)}11041105     but got type:11061107         dynamic()11081109     where "state" was given the type:11101111         # type: dynamic(%{..., demuxer: term()})1112         # from: lib/membrane/mpeg/ts/demuxer.ex:165:151113         %MPEG.TS.Demuxer{...}11141115     you must assign "state.demuxer" to variable and pattern match on "%MPEG.TS.Demuxer{}"11161117     type warning found at:1118     │1119 165 │     demuxer = %TS.Demuxer{state.demuxer | packet_filter: &(&1 in followed_stream_ids)}1120     │               ~1121     │1122     └─ lib/membrane/mpeg/ts/demuxer.ex:165:15: Membrane.MPEG.TS.Demuxer.handle_info/311231124Generated membrane_mpeg_ts_plugin app1125==> membrane_mpegts_plugin1126Compiling 8 files (.ex)1127Generated membrane_mpegts_plugin app1128==> membrane_tcp_plugin1129Compiling 4 files (.ex)1130Generated membrane_tcp_plugin app1131==> membrane_udp_plugin1132Compiling 5 files (.ex)1133Generated membrane_udp_plugin app1134==> membrane_file_plugin1135Compiling 10 files (.ex)1136Generated membrane_file_plugin app1137==> membrane_mp4_plugin1138Compiling 34 files (.ex)1139Generated membrane_mp4_plugin app1140==> membrane_wav_plugin1141Compiling 3 files (.ex)1142     warning: the variable "stage_size" is accessed inside size(...) of a bitstring but it was defined outside of the match. You must precede it with the pin operator1143     │1144 176 │       _fact_chunk::binary-size(stage_size),1145     │                                ~1146     │1147     └─ lib/membrane_wav/parser.ex:176:32: Membrane.WAV.Parser.parse_payload/311481149Generated membrane_wav_plugin app1150==> membrane_flv_plugin1151Compiling 5 files (.ex)1152    warning: the variable "data_offset" is accessed inside size(...) of a bitstring but it was defined outside of the match. You must precede it with the pin operator1153    │1154 13 │       <<_header::binary-size(data_offset), rest::binary>> ->1155    │                              ~1156    │1157    └─ lib/membrane_flv_plugin/parser.ex:13:30: Membrane.FLV.Parser.parse_header/111581159Generated membrane_flv_plugin app1160==> membrane_av1_format1161Compiling 1 file (.ex)1162Generated membrane_av1_format app1163==> membrane_ivf_plugin1164Compiling 3 files (.ex)1165     warning: the variable "size_of_frame" is accessed inside size(...) of a bitstring but it was defined outside of the match. You must precede it with the pin operator1166     │1167 110 │          <<frame::binary-size(size_of_frame), rest::binary>> <- rest do1168     │                               ~1169     │1170     └─ lib/membrane_ivf/deserializer.ex:110:31: Membrane.IVF.Deserializer.get_buffer/211711172Generated membrane_ivf_plugin app1173==> membrane_realtimer_plugin1174Compiling 2 files (.ex)1175Generated membrane_realtimer_plugin app1176==> nimble_pool1177Compiling 2 files (.ex)1178Generated nimble_pool app1179==> finch1180Compiling 22 files (.ex)1181Generated finch app1182warning: "xref: [exclude: ...]" in your mix.exs file is deprecated, instead use: "elixirc_options: [no_warn_undefined: ...]"1183  (mix 1.20.3) lib/mix/tasks/compile.elixir.ex:243: Mix.Tasks.Compile.Elixir.xref_exclude_opts/21184  (mix 1.20.3) lib/mix/tasks/compile.elixir.ex:142: Mix.Tasks.Compile.Elixir.run/11185  (mix 1.20.3) lib/mix/task.ex:502: anonymous fn/3 in Mix.Task.run_task/51186  (mix 1.20.3) lib/mix/task.compiler.ex:299: Mix.Task.Compiler.run_compiler/21187  (mix 1.20.3) lib/mix/task.compiler.ex:287: Mix.Task.Compiler.run/41188  (mix 1.20.3) lib/mix/tasks/compile.all.ex:75: Mix.Tasks.Compile.All.do_run/211891190==> req1191Compiling 19 files (.ex)1192Generated req app1193==> bundlex1194Compiling 39 files (.ex)1195    warning: the following clause will never match:11961197        :custom ->11981199    because it attempts to match on the result of:12001201        Bundlex.Platform.get_target!()12021203    which has type:12041205        dynamic(:nerves)12061207    type warning found at:1208    │1209 82 │       :custom -> :nerves1210    │       ~~~~~~~~~~~~~~~~~~1211    │1212    └─ lib/bundlex.ex:82: Bundlex.platform/012131214Generated bundlex app1215==> bunch_native1216Bundlex: Building natives: lib, bunch1217Generated bunch_native app1218==> shmex1219Bundlex: Building natives: lib, shmex1220Compiling 2 files (.ex)1221Generated shmex app1222==> unifex1223Bundlex: Building natives: unifex1224/work/proj/deps_qemu_aarch64/unifex/c_src/unifex/cnode/unifex/cnode.c: In function 'unifex_cnode_init':1225/work/proj/deps_qemu_aarch64/unifex/c_src/unifex/cnode/unifex/cnode.c:172:49: warning: 'calloc' sizes specified with 'sizeof' in the earlier argument and not in the later argument [-Wcalloc-transposed-args]1226  172 |   *env = (UnifexEnv){.node_name = calloc(sizeof(char), 256),1227      |                                                 ^~~~1228/work/proj/deps_qemu_aarch64/unifex/c_src/unifex/cnode/unifex/cnode.c:172:49: note: earlier argument should specify number of elements, later size of each element1229Compiling 33 files (.ex)1230    warning: unused require Bundlex.CNode1231    │1232  6 │   require Bundlex.CNode1233    │   ~1234    │1235    └─ lib/unifex/cnode.ex:6:312361237Generated unifex app1238==> ex_dtls1239Bundlex: Building natives: native1240Compiling 2 files (.ex)1241Generated ex_dtls app1242==> membrane_common_c1243Bundlex: Building natives: membrane, membrane_ringbuffer1244Compiling 1 file (.ex)1245Generated membrane_common_c app1246==> membrane_precompiled_dependency_provider1247Compiling 1 file (.ex)1248Generated membrane_precompiled_dependency_provider app1249==> membrane_ffmpeg_swresample_plugin1250Bundlex: Building natives: converter1251125204:04:35.283 [debug] redirecting to https://release-assets.githubusercontent.com/github-production-release-asset/688460577/87b29f64-689d-4284-9d3d-b3fdf87c1fc5?sp=r&sv=2018-11-09&sr=b&spr=https&se=2026-10-05T05%3A03%3A20Z&rscd=attachment%3B+filename%3Dffmpeg_linuxarm64.tar.xz&rsct=application%2Foctet-stream&skoid=96c2d410-5711-43a1-aedd-ab1947aa7ab0&sktid=398a6654-997b-47e9-b12b-9515b896b4de&skt=2026-10-05T04%3A03%3A16Z&ske=2026-10-05T05%3A03%3A20Z&sks=b&skv=2018-11-09&sig=Hg53GuEL7bFoPs5%2FobRW3LRh8%2BfK8OTn9QQn3ZRdfog%3D&jwt=eyJ0eXAiOiJKV1QiLCJhbGciOiJIUzI1NiJ9.eyJpc3MiOiJnaXRodWIuY29tIiwiYXVkIjoicmVsZWFzZS1hc3NldHMuZ2l0aHVidXNlcmNvbnRlbnQuY29tIiwia2V5Ijoia2V5MSIsImV4cCI6MTc5MTE3NDg3NSwibmJmIjoxNzkxMTczMDc1LCJwYXRoIjoicmVsZWFzZWFzc2V0cHJvZHVjdGlvbi5ibG9iLmNvcmUud2luZG93cy5uZXQifQ.hlptHkzNgnhx0oPKFL1tu15tIGS3Ggs7qod8TSEOleA&response-content-disposition=attachment%3B%20filename%3Dffmpeg_linuxarm64.tar.xz&response-content-type=application%2Foctet-stream1253Bundlex: Successfully downloaded precompiled ffmpeg build from https://github.com/membraneframework-precompiled/precompiled_ffmpeg/releases/download/v6.0.1/ffmpeg_linuxarm64.tar.xz1254Compiling 2 files (.ex)1255Generated membrane_ffmpeg_swresample_plugin app1256==> membrane_portaudio_plugin1257Bundlex: Building natives: sink, source, pa_devices1258125904:04:40.679 [debug] redirecting to https://release-assets.githubusercontent.com/github-production-release-asset/691488165/3797aa76-6b59-446d-ae70-06667036c92c?sp=r&sv=2018-11-09&sr=b&spr=https&se=2026-10-05T05%3A00%3A38Z&rscd=attachment%3B+filename%3Dportaudio_linux_arm.tar.gz&rsct=application%2Foctet-stream&skoid=96c2d410-5711-43a1-aedd-ab1947aa7ab0&sktid=398a6654-997b-47e9-b12b-9515b896b4de&skt=2026-10-05T04%3A00%3A10Z&ske=2026-10-05T05%3A00%3A38Z&sks=b&skv=2018-11-09&sig=DSygWjQaYkx2E74FykAI1qLcfTO2fXt0cvCqdb%2F9q88%3D&jwt=eyJ0eXAiOiJKV1QiLCJhbGciOiJIUzI1NiJ9.eyJpc3MiOiJnaXRodWIuY29tIiwiYXVkIjoicmVsZWFzZS1hc3NldHMuZ2l0aHVidXNlcmNvbnRlbnQuY29tIiwia2V5Ijoia2V5MSIsImV4cCI6MTc5MTE3NDg4MCwibmJmIjoxNzkxMTczMDgwLCJwYXRoIjoicmVsZWFzZWFzc2V0cHJvZHVjdGlvbi5ibG9iLmNvcmUud2luZG93cy5uZXQifQ.Pu8ANkzMteh9GZQ0nkc5nnvNJJ0gvnkGmUQXSqvD9oo&response-content-disposition=attachment%3B%20filename%3Dportaudio_linux_arm.tar.gz&response-content-type=application%2Foctet-stream1260Bundlex: Successfully downloaded precompiled portaudio build from https://github.com/membraneframework-precompiled/precompiled_portaudio/releases/download/v19.7.0/portaudio_linux_arm.tar.gz1261Compiling 9 files (.ex)1262Generated membrane_portaudio_plugin app1263==> membrane_rtmp_plugin1264Bundlex: Building natives: rtmp_sink1265Compiling 37 files (.ex)1266Generated membrane_rtmp_plugin app1267==> membrane_aac_fdk_plugin1268Bundlex: Building natives: decoder, encoder1269127004:04:48.557 [debug] redirecting to https://release-assets.githubusercontent.com/github-production-release-asset/696245853/cc9f950b-c399-4a67-b060-12b37a999f14?sp=r&sv=2018-11-09&sr=b&spr=https&se=2026-10-05T04%3A40%3A28Z&rscd=attachment%3B+filename%3Dfdk-aac_linux_arm.tar.gz&rsct=application%2Foctet-stream&skoid=96c2d410-5711-43a1-aedd-ab1947aa7ab0&sktid=398a6654-997b-47e9-b12b-9515b896b4de&skt=2026-10-05T03%3A40%3A20Z&ske=2026-10-05T04%3A40%3A28Z&sks=b&skv=2018-11-09&sig=JrvRW8WtchJmnyEL31bVvleYxwY3edeA0Aowpa%2BqpcI%3D&jwt=eyJ0eXAiOiJKV1QiLCJhbGciOiJIUzI1NiJ9.eyJpc3MiOiJnaXRodWIuY29tIiwiYXVkIjoicmVsZWFzZS1hc3NldHMuZ2l0aHVidXNlcmNvbnRlbnQuY29tIiwia2V5Ijoia2V5MSIsImV4cCI6MTc5MTE3MzM4OCwibmJmIjoxNzkxMTczMDg4LCJwYXRoIjoicmVsZWFzZWFzc2V0cHJvZHVjdGlvbi5ibG9iLmNvcmUud2luZG93cy5uZXQifQ.bj9u3w-QOiJxoALpsnJ-Le-XLfwJF-9HRCLNvN12q9w&response-content-disposition=attachment%3B%20filename%3Dfdk-aac_linux_arm.tar.gz&response-content-type=application%2Foctet-stream1271Bundlex: Successfully downloaded precompiled fdk-aac build from https://github.com/membraneframework-precompiled/precompiled_fdk-aac/releases/download/v2.0.3/fdk-aac_linux_arm.tar.gz1272Compiling 4 files (.ex)1273     warning: the variable "bytes_used" is accessed inside size(...) of a bitstring but it was defined outside of the match. You must precede it with the pin operator1274     │1275 163 │         <<_handled::binary-size(bytes_used), rest::binary>> = to_encode1276     │                                 ~1277     │1278     └─ lib/membrane_aac_fdk_plugin/encoder.ex:163:33: Membrane.AAC.FDK.Encoder.handle_buffer/412791280     warning: the variable "raw_frame_size" is accessed inside size(...) of a bitstring but it was defined outside of the match. You must precede it with the pin operator1281     │1282 207 │     <<raw_frame::binary-size(raw_frame_size), rest::binary>> = buffer1283     │                              ~1284     │1285     └─ lib/membrane_aac_fdk_plugin/encoder.ex:207:30: Membrane.AAC.FDK.Encoder.encode_buffer/612861287Generated membrane_aac_fdk_plugin app1288==> membrane_mp3_mad_plugin1289Bundlex: Building natives: decoder1290129104:04:50.198 [debug] redirecting to https://release-assets.githubusercontent.com/github-production-release-asset/697676016/10281c49-3314-4e46-9edf-b9cec5b33bbc?sp=r&sv=2018-11-09&sr=b&spr=https&se=2026-10-05T04%3A38%3A14Z&rscd=attachment%3B+filename%3Dmad_linux_arm.tar.gz&rsct=application%2Foctet-stream&skoid=96c2d410-5711-43a1-aedd-ab1947aa7ab0&sktid=398a6654-997b-47e9-b12b-9515b896b4de&skt=2026-10-05T03%3A37%3A33Z&ske=2026-10-05T04%3A38%3A14Z&sks=b&skv=2018-11-09&sig=N%2Fqt59uypYTF%2BAV5VlV6bQ%2F%2F7enw65cWyEX3DXjGVUU%3D&jwt=eyJ0eXAiOiJKV1QiLCJhbGciOiJIUzI1NiJ9.eyJpc3MiOiJnaXRodWIuY29tIiwiYXVkIjoicmVsZWFzZS1hc3NldHMuZ2l0aHVidXNlcmNvbnRlbnQuY29tIiwia2V5Ijoia2V5MSIsImV4cCI6MTc5MTE3MzM5MCwibmJmIjoxNzkxMTczMDkwLCJwYXRoIjoicmVsZWFzZWFzc2V0cHJvZHVjdGlvbi5ibG9iLmNvcmUud2luZG93cy5uZXQifQ.ydkv85zRbP21hxc7rT1yByJkj4QUVSzV1ccBQ3TGdjU&response-content-disposition=attachment%3B%20filename%3Dmad_linux_arm.tar.gz&response-content-type=application%2Foctet-stream1292Bundlex: Successfully downloaded precompiled mad build from https://github.com/membraneframework-precompiled/precompiled_mad/releases/download/v0.15.1b/mad_linux_arm.tar.gz1293Compiling 2 files (.ex)1294    warning: the variable "tag_size" is accessed inside size(...) of a bitstring but it was defined outside of the match. You must precede it with the pin operator1295    │1296 97 │         <<_tag::binary-size(tag_size), rest::binary>> -> {:skipped, rest}1297    │                             ~1298    │1299    └─ lib/membrane_mp3_mad_plugin/decoder.ex:97:29: Membrane.MP3.MAD.Decoder.skip_id3/113001301     warning: the variable "frame_size" is accessed inside size(...) of a bitstring but it was defined outside of the match. You must precede it with the pin operator1302     │1303 135 │       <<_used::binary-size(frame_size), rest::binary>> = buffer1304     │                            ~1305     │1306     └─ lib/membrane_mp3_mad_plugin/decoder.ex:135:28: Membrane.MP3.MAD.Decoder.decode_buffer/513071308     warning: the variable "bytes_to_skip" is accessed inside size(...) of a bitstring but it was defined outside of the match. You must precede it with the pin operator1309     │1310 152 │         <<_used::binary-size(bytes_to_skip), new_buffer::binary>> = buffer1311     │                              ~1312     │1313     └─ lib/membrane_mp3_mad_plugin/decoder.ex:152:30: Membrane.MP3.MAD.Decoder.decode_buffer/513141315Generated membrane_mp3_mad_plugin app1316==> ex_libsrt1317Bundlex: Building natives: srt_nif1318131904:04:51.604 [debug] redirecting to https://release-assets.githubusercontent.com/github-production-release-asset/984224907/bfcbbe57-2442-42cb-bfdb-681a4d141322?sp=r&sv=2018-11-09&sr=b&spr=https&se=2026-10-05T04%3A50%3A03Z&rscd=attachment%3B+filename%3Dsrt_linux_arm.tar.gz&rsct=application%2Foctet-stream&skoid=96c2d410-5711-43a1-aedd-ab1947aa7ab0&sktid=398a6654-997b-47e9-b12b-9515b896b4de&skt=2026-10-05T03%3A49%3A59Z&ske=2026-10-05T04%3A50%3A03Z&sks=b&skv=2018-11-09&sig=BwV6j3e%2FX5m4ZXK2D35aq7fHfZurmSmyOTPJqi1JSD8%3D&jwt=eyJ0eXAiOiJKV1QiLCJhbGciOiJIUzI1NiJ9.eyJpc3MiOiJnaXRodWIuY29tIiwiYXVkIjoicmVsZWFzZS1hc3NldHMuZ2l0aHVidXNlcmNvbnRlbnQuY29tIiwia2V5Ijoia2V5MSIsImV4cCI6MTc5MTE3MzM5MSwibmJmIjoxNzkxMTczMDkxLCJwYXRoIjoicmVsZWFzZWFzc2V0cHJvZHVjdGlvbi5ibG9iLmNvcmUud2luZG93cy5uZXQifQ.D83vSOqQbaGGxubqnzn1-pulaswpMMuun9BZxUjPcbU&response-content-disposition=attachment%3B%20filename%3Dsrt_linux_arm.tar.gz&response-content-type=application%2Foctet-stream1320Bundlex: Successfully downloaded precompiled srt build from https://github.com/membraneframework-precompiled/precompiled_srt/releases/download/v1.5.4/srt_linux_arm.tar.gz1321In file included from /work/proj/deps_qemu_aarch64/ex_libsrt/c_src/ex_libsrt/server/server.h:3,1322                 from /work/proj/deps_qemu_aarch64/ex_libsrt/c_src/ex_libsrt/server/server.cpp:1:1323/work/proj/deps_qemu_aarch64/ex_libsrt/c_src/ex_libsrt/server/../common/srt_socket_stats.h:6:3: error: 'int64_t' does not name a type1324    6 |   int64_t msTimeStamp;1325      |   ^~~~~~~1326/work/proj/deps_qemu_aarch64/ex_libsrt/c_src/ex_libsrt/server/../common/srt_socket_stats.h:4:1: note: 'int64_t' is defined in header '<cstdint>'; this is probably fixable by adding '#include <cstdint>'1327    3 | #include <memory>1328  +++ |+#include <cstdint>1329    4 | 1330/work/proj/deps_qemu_aarch64/ex_libsrt/c_src/ex_libsrt/server/../common/srt_socket_stats.h:7:3: error: 'int64_t' does not name a type1331    7 |   int64_t pktSentTotal;1332      |   ^~~~~~~1333/work/proj/deps_qemu_aarch64/ex_libsrt/c_src/ex_libsrt/server/../common/srt_socket_stats.h:7:3: note: 'int64_t' is defined in header '<cstdint>'; this is probably fixable by adding '#include <cstdint>'1334/work/proj/deps_qemu_aarch64/ex_libsrt/c_src/ex_libsrt/server/../common/srt_socket_stats.h:8:3: error: 'int64_t' does not name a type1335    8 |   int64_t pktRecvTotal;1336      |   ^~~~~~~1337/work/proj/deps_qemu_aarch64/ex_libsrt/c_src/ex_libsrt/server/../common/srt_socket_stats.h:8:3: note: 'int64_t' is defined in header '<cstdint>'; this is probably fixable by adding '#include <cstdint>'1338/work/proj/deps_qemu_aarch64/ex_libsrt/c_src/ex_libsrt/server/../common/srt_socket_stats.h:9:3: error: 'int64_t' does not name a type1339    9 |   int64_t pktSentUniqueTotal;1340      |   ^~~~~~~1341/work/proj/deps_qemu_aarch64/ex_libsrt/c_src/ex_libsrt/server/../common/srt_socket_stats.h:9:3: note: 'int64_t' is defined in header '<cstdint>'; this is probably fixable by adding '#include <cstdint>'1342/work/proj/deps_qemu_aarch64/ex_libsrt/c_src/ex_libsrt/server/../common/srt_socket_stats.h:10:3: error: 'int64_t' does not name a type1343   10 |   int64_t pktRecvUniqueTotal;1344      |   ^~~~~~~1345/work/proj/deps_qemu_aarch64/ex_libsrt/c_src/ex_libsrt/server/../common/srt_socket_stats.h:10:3: note: 'int64_t' is defined in header '<cstdint>'; this is probably fixable by adding '#include <cstdint>'1346/work/proj/deps_qemu_aarch64/ex_libsrt/c_src/ex_libsrt/server/../common/srt_socket_stats.h:11:3: error: 'int32_t' does not name a type1347   11 |   int32_t pktSndLossTotal;1348      |   ^~~~~~~1349/work/proj/deps_qemu_aarch64/ex_libsrt/c_src/ex_libsrt/server/../common/srt_socket_stats.h:11:3: note: 'int32_t' is defined in header '<cstdint>'; this is probably fixable by adding '#include <cstdint>'1350/work/proj/deps_qemu_aarch64/ex_libsrt/c_src/ex_libsrt/server/../common/srt_socket_stats.h:12:3: error: 'int32_t' does not name a type1351   12 |   int32_t pktRcvLossTotal;1352      |   ^~~~~~~1353/work/proj/deps_qemu_aarch64/ex_libsrt/c_src/ex_libsrt/server/../common/srt_socket_stats.h:12:3: note: 'int32_t' is defined in header '<cstdint>'; this is probably fixable by adding '#include <cstdint>'1354/work/proj/deps_qemu_aarch64/ex_libsrt/c_src/ex_libsrt/server/../common/srt_socket_stats.h:13:3: error: 'int32_t' does not name a type1355   13 |   int32_t pktRetransTotal;1356      |   ^~~~~~~1357/work/proj/deps_qemu_aarch64/ex_libsrt/c_src/ex_libsrt/server/../common/srt_socket_stats.h:13:3: note: 'int32_t' is defined in header '<cstdint>'; this is probably fixable by adding '#include <cstdint>'1358/work/proj/deps_qemu_aarch64/ex_libsrt/c_src/ex_libsrt/server/../common/srt_socket_stats.h:14:3: error: 'int32_t' does not name a type1359   14 |   int32_t pktSentACKTotal;1360      |   ^~~~~~~1361/work/proj/deps_qemu_aarch64/ex_libsrt/c_src/ex_libsrt/server/../common/srt_socket_stats.h:14:3: note: 'int32_t' is defined in header '<cstdint>'; this is probably fixable by adding '#include <cstdint>'1362/work/proj/deps_qemu_aarch64/ex_libsrt/c_src/ex_libsrt/server/../common/srt_socket_stats.h:15:3: error: 'int32_t' does not name a type1363   15 |   int32_t pktRecvACKTotal;1364      |   ^~~~~~~1365/work/proj/deps_qemu_aarch64/ex_libsrt/c_src/ex_libsrt/server/../common/srt_socket_stats.h:15:3: note: 'int32_t' is defined in header '<cstdint>'; this is probably fixable by adding '#include <cstdint>'1366/work/proj/deps_qemu_aarch64/ex_libsrt/c_src/ex_libsrt/server/../common/srt_socket_stats.h:16:3: error: 'int32_t' does not name a type1367   16 |   int32_t pktSentNAKTotal;1368      |   ^~~~~~~1369/work/proj/deps_qemu_aarch64/ex_libsrt/c_src/ex_libsrt/server/../common/srt_socket_stats.h:16:3: note: 'int32_t' is defined in header '<cstdint>'; this is probably fixable by adding '#include <cstdint>'1370/work/proj/deps_qemu_aarch64/ex_libsrt/c_src/ex_libsrt/server/../common/srt_socket_stats.h:17:3: error: 'int32_t' does not name a type1371   17 |   int32_t pktRecvNAKTotal;1372      |   ^~~~~~~1373/work/proj/deps_qemu_aarch64/ex_libsrt/c_src/ex_libsrt/server/../common/srt_socket_stats.h:17:3: note: 'int32_t' is defined in header '<cstdint>'; this is probably fixable by adding '#include <cstdint>'1374/work/proj/deps_qemu_aarch64/ex_libsrt/c_src/ex_libsrt/server/../common/srt_socket_stats.h:18:3: error: 'int64_t' does not name a type1375   18 |   int64_t usSndDurationTotal;1376      |   ^~~~~~~1377/work/proj/deps_qemu_aarch64/ex_libsrt/c_src/ex_libsrt/server/../common/srt_socket_stats.h:18:3: note: 'int64_t' is defined in header '<cstdint>'; this is probably fixable by adding '#include <cstdint>'1378/work/proj/deps_qemu_aarch64/ex_libsrt/c_src/ex_libsrt/server/../common/srt_socket_stats.h:19:3: error: 'int32_t' does not name a type1379   19 |   int32_t pktSndDropTotal;1380      |   ^~~~~~~1381/work/proj/deps_qemu_aarch64/ex_libsrt/c_src/ex_libsrt/server/../common/srt_socket_stats.h:19:3: note: 'int32_t' is defined in header '<cstdint>'; this is probably fixable by adding '#include <cstdint>'1382/work/proj/deps_qemu_aarch64/ex_libsrt/c_src/ex_libsrt/server/../common/srt_socket_stats.h:20:3: error: 'int32_t' does not name a type1383   20 |   int32_t pktRcvDropTotal;1384      |   ^~~~~~~1385/work/proj/deps_qemu_aarch64/ex_libsrt/c_src/ex_libsrt/server/../common/srt_socket_stats.h:20:3: note: 'int32_t' is defined in header '<cstdint>'; this is probably fixable by adding '#include <cstdint>'1386/work/proj/deps_qemu_aarch64/ex_libsrt/c_src/ex_libsrt/server/../common/srt_socket_stats.h:21:3: error: 'int32_t' does not name a type1387   21 |   int32_t pktRcvUndecryptTotal;1388      |   ^~~~~~~1389/work/proj/deps_qemu_aarch64/ex_libsrt/c_src/ex_libsrt/server/../common/srt_socket_stats.h:21:3: note: 'int32_t' is defined in header '<cstdint>'; this is probably fixable by adding '#include <cstdint>'1390/work/proj/deps_qemu_aarch64/ex_libsrt/c_src/ex_libsrt/server/../common/srt_socket_stats.h:22:3: error: 'int32_t' does not name a type1391   22 |   int32_t pktSndFilterExtraTotal;1392      |   ^~~~~~~1393/work/proj/deps_qemu_aarch64/ex_libsrt/c_src/ex_libsrt/server/../common/srt_socket_stats.h:22:3: note: 'int32_t' is defined in header '<cstdint>'; this is probably fixable by adding '#include <cstdint>'1394/work/proj/deps_qemu_aarch64/ex_libsrt/c_src/ex_libsrt/server/../common/srt_socket_stats.h:23:3: error: 'int32_t' does not name a type1395   23 |   int32_t pktRcvFilterExtraTotal;1396      |   ^~~~~~~1397/work/proj/deps_qemu_aarch64/ex_libsrt/c_src/ex_libsrt/server/../common/srt_socket_stats.h:23:3: note: 'int32_t' is defined in header '<cstdint>'; this is probably fixable by adding '#include <cstdint>'1398/work/proj/deps_qemu_aarch64/ex_libsrt/c_src/ex_libsrt/server/../common/srt_socket_stats.h:24:3: error: 'int32_t' does not name a type1399   24 |   int32_t pktRcvFilterSupplyTotal;1400      |   ^~~~~~~1401/work/proj/deps_qemu_aarch64/ex_libsrt/c_src/ex_libsrt/server/../common/srt_socket_stats.h:24:3: note: 'int32_t' is defined in header '<cstdint>'; this is probably fixable by adding '#include <cstdint>'1402/work/proj/deps_qemu_aarch64/ex_libsrt/c_src/ex_libsrt/server/../common/srt_socket_stats.h:25:3: error: 'int32_t' does not name a type1403   25 |   int32_t pktRcvFilterLossTotal;1404      |   ^~~~~~~1405/work/proj/deps_qemu_aarch64/ex_libsrt/c_src/ex_libsrt/server/../common/srt_socket_stats.h:25:3: note: 'int32_t' is defined in header '<cstdint>'; this is probably fixable by adding '#include <cstdint>'1406/work/proj/deps_qemu_aarch64/ex_libsrt/c_src/ex_libsrt/server/../common/srt_socket_stats.h:26:3: error: 'uint64_t' does not name a type1407   26 |   uint64_t byteSentTotal;1408      |   ^~~~~~~~1409/work/proj/deps_qemu_aarch64/ex_libsrt/c_src/ex_libsrt/server/../common/srt_socket_stats.h:26:3: note: 'uint64_t' is defined in header '<cstdint>'; this is probably fixable by adding '#include <cstdint>'1410/work/proj/deps_qemu_aarch64/ex_libsrt/c_src/ex_libsrt/server/../common/srt_socket_stats.h:27:3: error: 'uint64_t' does not name a type1411   27 |   uint64_t byteRecvTotal;1412      |   ^~~~~~~~1413/work/proj/deps_qemu_aarch64/ex_libsrt/c_src/ex_libsrt/server/../common/srt_socket_stats.h:27:3: note: 'uint64_t' is defined in header '<cstdint>'; this is probably fixable by adding '#include <cstdint>'1414/work/proj/deps_qemu_aarch64/ex_libsrt/c_src/ex_libsrt/server/../common/srt_socket_stats.h:28:3: error: 'uint64_t' does not name a type1415   28 |   uint64_t byteSentUniqueTotal;1416      |   ^~~~~~~~1417/work/proj/deps_qemu_aarch64/ex_libsrt/c_src/ex_libsrt/server/../common/srt_socket_stats.h:28:3: note: 'uint64_t' is defined in header '<cstdint>'; this is probably fixable by adding '#include <cstdint>'1418/work/proj/deps_qemu_aarch64/ex_libsrt/c_src/ex_libsrt/server/../common/srt_socket_stats.h:29:3: error: 'uint64_t' does not name a type1419   29 |   uint64_t byteRecvUniqueTotal;1420      |   ^~~~~~~~1421/work/proj/deps_qemu_aarch64/ex_libsrt/c_src/ex_libsrt/server/../common/srt_socket_stats.h:29:3: note: 'uint64_t' is defined in header '<cstdint>'; this is probably fixable by adding '#include <cstdint>'1422/work/proj/deps_qemu_aarch64/ex_libsrt/c_src/ex_libsrt/server/../common/srt_socket_stats.h:30:3: error: 'uint64_t' does not name a type1423   30 |   uint64_t byteRcvLossTotal;1424      |   ^~~~~~~~1425/work/proj/deps_qemu_aarch64/ex_libsrt/c_src/ex_libsrt/server/../common/srt_socket_stats.h:30:3: note: 'uint64_t' is defined in header '<cstdint>'; this is probably fixable by adding '#include <cstdint>'1426/work/proj/deps_qemu_aarch64/ex_libsrt/c_src/ex_libsrt/server/../common/srt_socket_stats.h:31:3: error: 'uint64_t' does not name a type1427   31 |   uint64_t byteRetransTotal;1428      |   ^~~~~~~~1429/work/proj/deps_qemu_aarch64/ex_libsrt/c_src/ex_libsrt/server/../common/srt_socket_stats.h:31:3: note: 'uint64_t' is defined in header '<cstdint>'; this is probably fixable by adding '#include <cstdint>'1430/work/proj/deps_qemu_aarch64/ex_libsrt/c_src/ex_libsrt/server/../common/srt_socket_stats.h:32:3: error: 'uint64_t' does not name a type1431   32 |   uint64_t byteSndDropTotal;1432      |   ^~~~~~~~1433/work/proj/deps_qemu_aarch64/ex_libsrt/c_src/ex_libsrt/server/../common/srt_socket_stats.h:32:3: note: 'uint64_t' is defined in header '<cstdint>'; this is probably fixable by adding '#include <cstdint>'1434/work/proj/deps_qemu_aarch64/ex_libsrt/c_src/ex_libsrt/server/../common/srt_socket_stats.h:33:3: error: 'uint64_t' does not name a type1435   33 |   uint64_t byteRcvDropTotal;1436      |   ^~~~~~~~1437/work/proj/deps_qemu_aarch64/ex_libsrt/c_src/ex_libsrt/server/../common/srt_socket_stats.h:33:3: note: 'uint64_t' is defined in header '<cstdint>'; this is probably fixable by adding '#include <cstdint>'1438/work/proj/deps_qemu_aarch64/ex_libsrt/c_src/ex_libsrt/server/../common/srt_socket_stats.h:34:3: error: 'uint64_t' does not name a type1439   34 |   uint64_t byteRcvUndecryptTotal;1440      |   ^~~~~~~~1441/work/proj/deps_qemu_aarch64/ex_libsrt/c_src/ex_libsrt/server/../common/srt_socket_stats.h:34:3: note: 'uint64_t' is defined in header '<cstdint>'; this is probably fixable by adding '#include <cstdint>'1442/work/proj/deps_qemu_aarch64/ex_libsrt/c_src/ex_libsrt/server/../common/srt_socket_stats.h:35:3: error: 'int64_t' does not name a type1443   35 |   int64_t pktSent;1444      |   ^~~~~~~1445/work/proj/deps_qemu_aarch64/ex_libsrt/c_src/ex_libsrt/server/../common/srt_socket_stats.h:35:3: note: 'int64_t' is defined in header '<cstdint>'; this is probably fixable by adding '#include <cstdint>'1446/work/proj/deps_qemu_aarch64/ex_libsrt/c_src/ex_libsrt/server/../common/srt_socket_stats.h:36:3: error: 'int64_t' does not name a type1447   36 |   int64_t pktRecv;1448      |   ^~~~~~~1449/work/proj/deps_qemu_aarch64/ex_libsrt/c_src/ex_libsrt/server/../common/srt_socket_stats.h:36:3: note: 'int64_t' is defined in header '<cstdint>'; this is probably fixable by adding '#include <cstdint>'1450/work/proj/deps_qemu_aarch64/ex_libsrt/c_src/ex_libsrt/server/../common/srt_socket_stats.h:37:3: error: 'int64_t' does not name a type1451   37 |   int64_t pktSentUnique;1452      |   ^~~~~~~1453/work/proj/deps_qemu_aarch64/ex_libsrt/c_src/ex_libsrt/server/../common/srt_socket_stats.h:37:3: note: 'int64_t' is defined in header '<cstdint>'; this is probably fixable by adding '#include <cstdint>'1454/work/proj/deps_qemu_aarch64/ex_libsrt/c_src/ex_libsrt/server/../common/srt_socket_stats.h:38:3: error: 'int64_t' does not name a type1455   38 |   int64_t pktRecvUnique;1456      |   ^~~~~~~1457/work/proj/deps_qemu_aarch64/ex_libsrt/c_src/ex_libsrt/server/../common/srt_socket_stats.h:38:3: note: 'int64_t' is defined in header '<cstdint>'; this is probably fixable by adding '#include <cstdint>'1458/work/proj/deps_qemu_aarch64/ex_libsrt/c_src/ex_libsrt/server/../common/srt_socket_stats.h:39:3: error: 'int32_t' does not name a type1459   39 |   int32_t pktSndLoss;1460      |   ^~~~~~~1461/work/proj/deps_qemu_aarch64/ex_libsrt/c_src/ex_libsrt/server/../common/srt_socket_stats.h:39:3: note: 'int32_t' is defined in header '<cstdint>'; this is probably fixable by adding '#include <cstdint>'1462/work/proj/deps_qemu_aarch64/ex_libsrt/c_src/ex_libsrt/server/../common/srt_socket_stats.h:40:3: error: 'int32_t' does not name a type1463   40 |   int32_t pktRcvLoss;1464      |   ^~~~~~~1465/work/proj/deps_qemu_aarch64/ex_libsrt/c_src/ex_libsrt/server/../common/srt_socket_stats.h:40:3: note: 'int32_t' is defined in header '<cstdint>'; this is probably fixable by adding '#include <cstdint>'1466/work/proj/deps_qemu_aarch64/ex_libsrt/c_src/ex_libsrt/server/../common/srt_socket_stats.h:41:3: error: 'int32_t' does not name a type1467   41 |   int32_t pktRetrans;1468      |   ^~~~~~~1469/work/proj/deps_qemu_aarch64/ex_libsrt/c_src/ex_libsrt/server/../common/srt_socket_stats.h:41:3: note: 'int32_t' is defined in header '<cstdint>'; this is probably fixable by adding '#include <cstdint>'1470/work/proj/deps_qemu_aarch64/ex_libsrt/c_src/ex_libsrt/server/../common/srt_socket_stats.h:42:3: error: 'int32_t' does not name a type1471   42 |   int32_t pktRcvRetrans;1472      |   ^~~~~~~1473/work/proj/deps_qemu_aarch64/ex_libsrt/c_src/ex_libsrt/server/../common/srt_socket_stats.h:42:3: note: 'int32_t' is defined in header '<cstdint>'; this is probably fixable by adding '#include <cstdint>'1474/work/proj/deps_qemu_aarch64/ex_libsrt/c_src/ex_libsrt/server/../common/srt_socket_stats.h:43:3: error: 'int32_t' does not name a type1475   43 |   int32_t pktSentACK;1476      |   ^~~~~~~1477/work/proj/deps_qemu_aarch64/ex_libsrt/c_src/ex_libsrt/server/../common/srt_socket_stats.h:43:3: note: 'int32_t' is defined in header '<cstdint>'; this is probably fixable by adding '#include <cstdint>'1478/work/proj/deps_qemu_aarch64/ex_libsrt/c_src/ex_libsrt/server/../common/srt_socket_stats.h:44:3: error: 'int32_t' does not name a type1479   44 |   int32_t pktRecvACK;1480      |   ^~~~~~~1481/work/proj/deps_qemu_aarch64/ex_libsrt/c_src/ex_libsrt/server/../common/srt_socket_stats.h:44:3: note: 'int32_t' is defined in header '<cstdint>'; this is probably fixable by adding '#include <cstdint>'1482/work/proj/deps_qemu_aarch64/ex_libsrt/c_src/ex_libsrt/server/../common/srt_socket_stats.h:45:3: error: 'int32_t' does not name a type1483   45 |   int32_t pktSentNAK;1484      |   ^~~~~~~1485/work/proj/deps_qemu_aarch64/ex_libsrt/c_src/ex_libsrt/server/../common/srt_socket_stats.h:45:3: note: 'int32_t' is defined in header '<cstdint>'; this is probably fixable by adding '#include <cstdint>'1486/work/proj/deps_qemu_aarch64/ex_libsrt/c_src/ex_libsrt/server/../common/srt_socket_stats.h:46:3: error: 'int32_t' does not name a type1487   46 |   int32_t pktRecvNAK;1488      |   ^~~~~~~1489/work/proj/deps_qemu_aarch64/ex_libsrt/c_src/ex_libsrt/server/../common/srt_socket_stats.h:46:3: note: 'int32_t' is defined in header '<cstdint>'; this is probably fixable by adding '#include <cstdint>'1490/work/proj/deps_qemu_aarch64/ex_libsrt/c_src/ex_libsrt/server/../common/srt_socket_stats.h:47:3: error: 'int32_t' does not name a type1491   47 |   int32_t pktSndFilterExtra;1492      |   ^~~~~~~1493/work/proj/deps_qemu_aarch64/ex_libsrt/c_src/ex_libsrt/server/../common/srt_socket_stats.h:47:3: note: 'int32_t' is defined in header '<cstdint>'; this is probably fixable by adding '#include <cstdint>'1494/work/proj/deps_qemu_aarch64/ex_libsrt/c_src/ex_libsrt/server/../common/srt_socket_stats.h:48:3: error: 'int32_t' does not name a type1495   48 |   int32_t pktRcvFilterExtra;1496      |   ^~~~~~~1497/work/proj/deps_qemu_aarch64/ex_libsrt/c_src/ex_libsrt/server/../common/srt_socket_stats.h:48:3: note: 'int32_t' is defined in header '<cstdint>'; this is probably fixable by adding '#include <cstdint>'1498/work/proj/deps_qemu_aarch64/ex_libsrt/c_src/ex_libsrt/server/../common/srt_socket_stats.h:49:3: error: 'int32_t' does not name a type1499   49 |   int32_t pktRcvFilterSupply;1500      |   ^~~~~~~1501/work/proj/deps_qemu_aarch64/ex_libsrt/c_src/ex_libsrt/server/../common/srt_socket_stats.h:49:3: note: 'int32_t' is defined in header '<cstdint>'; this is probably fixable by adding '#include <cstdint>'1502/work/proj/deps_qemu_aarch64/ex_libsrt/c_src/ex_libsrt/server/../common/srt_socket_stats.h:50:3: error: 'int32_t' does not name a type1503   50 |   int32_t pktRcvFilterLoss;1504      |   ^~~~~~~1505/work/proj/deps_qemu_aarch64/ex_libsrt/c_src/ex_libsrt/server/../common/srt_socket_stats.h:50:3: note: 'int32_t' is defined in header '<cstdint>'; this is probably fixable by adding '#include <cstdint>'1506/work/proj/deps_qemu_aarch64/ex_libsrt/c_src/ex_libsrt/server/../common/srt_socket_stats.h:53:3: error: 'int64_t' does not name a type1507   53 |   int64_t usSndDuration;1508      |   ^~~~~~~1509/work/proj/deps_qemu_aarch64/ex_libsrt/c_src/ex_libsrt/server/../common/srt_socket_stats.h:53:3: note: 'int64_t' is defined in header '<cstdint>'; this is probably fixable by adding '#include <cstdint>'1510/work/proj/deps_qemu_aarch64/ex_libsrt/c_src/ex_libsrt/server/../common/srt_socket_stats.h:54:3: error: 'int32_t' does not name a type1511   54 |   int32_t pktReorderDistance;1512      |   ^~~~~~~1513/work/proj/deps_qemu_aarch64/ex_libsrt/c_src/ex_libsrt/server/../common/srt_socket_stats.h:54:3: note: 'int32_t' is defined in header '<cstdint>'; this is probably fixable by adding '#include <cstdint>'1514/work/proj/deps_qemu_aarch64/ex_libsrt/c_src/ex_libsrt/server/../common/srt_socket_stats.h:55:3: error: 'int64_t' does not name a type1515   55 |   int64_t pktRcvBelated;1516      |   ^~~~~~~1517/work/proj/deps_qemu_aarch64/ex_libsrt/c_src/ex_libsrt/server/../common/srt_socket_stats.h:55:3: note: 'int64_t' is defined in header '<cstdint>'; this is probably fixable by adding '#include <cstdint>'1518/work/proj/deps_qemu_aarch64/ex_libsrt/c_src/ex_libsrt/server/../common/srt_socket_stats.h:56:3: error: 'int32_t' does not name a type1519   56 |   int32_t pktSndDrop;1520      |   ^~~~~~~1521/work/proj/deps_qemu_aarch64/ex_libsrt/c_src/ex_libsrt/server/../common/srt_socket_stats.h:56:3: note: 'int32_t' is defined in header '<cstdint>'; this is probably fixable by adding '#include <cstdint>'1522/work/proj/deps_qemu_aarch64/ex_libsrt/c_src/ex_libsrt/server/../common/srt_socket_stats.h:57:3: error: 'int32_t' does not name a type1523   57 |   int32_t pktRcvDrop;1524      |   ^~~~~~~1525/work/proj/deps_qemu_aarch64/ex_libsrt/c_src/ex_libsrt/server/../common/srt_socket_stats.h:57:3: note: 'int32_t' is defined in header '<cstdint>'; this is probably fixable by adding '#include <cstdint>'1526could not compile dependency :ex_libsrt, "mix compile" failed. Errors may have been logged above. You can recompile this dependency with "mix deps.compile ex_libsrt --force", update it with "mix deps.update ex_libsrt" or clean it with "mix deps.clean ex_libsrt"1527==> nerves_compatibility_test1528** (Mix) Bundlex: Failed to build the native part of package ex_libsrt. Errors may have been logged above.1529Make sure that all required packages are properly installed in your system.1530Requirements and installation guide may be found in the readme of package ex_libsrt.15311532Returned code: 11533Build script:15341535(mkdir -p "/work/proj/_build/qemu_aarch64/lib/ex_libsrt/priv/bundlex/nif/srt_nif_obj") && \1536(/home/nerves/.nerves/artifacts/nerves_toolchain_aarch64_nerves_linux_gnu-15.3.1/bin/aarch64-nerves-linux-gnu-g++ -mabi=lp64 -fstack-protector-strong -mcpu=cortex-a53 -fPIE -pie -D_LARGEFILE_SOURCE -D_LARGEFILE64_SOURCE -D_FILE_OFFSET_BITS=64  -pipe -O2 --sysroot /home/nerves/.nerves/artifacts/nerves_system_qemu_aarch64-0.4.2/staging -fPIC -Wall -Wextra -c -O2 -g -DBUNDLEX_NIF -std=c++17 -I/work/proj/_build/qemu_aarch64/lib/bundlex/priv/shared/precompiled/httpsgithub.commembraneframework-precompiledprecompiled_srtreleasesdownloadv1.5.4srt_linux_arm.tar.gz/include -I/home/nerves/.nerves/artifacts/nerves_system_qemu_aarch64-0.4.2/staging/usr/include -o "/work/proj/_build/qemu_aarch64/lib/ex_libsrt/priv/bundlex/nif/srt_nif_obj/srt_nif.cpp_09B47872DF2190C103883F87D3270E7CCF5FB674.o" -I"/work/proj/deps_qemu_aarch64/bunch_native/c_src/bunch" -I"/work/proj/deps_qemu_aarch64/bunch_native/c_src/bunch/nif" -I"/work/proj/deps_qemu_aarch64/shmex/c_src/shmex" -I"/work/proj/deps_qemu_aarch64/shmex/c_src/shmex/nif" -I"/work/proj/deps_qemu_aarch64/unifex/c_src/unifex/nif" -I"/work/proj/deps_qemu_aarch64/bunch_native/c_src/bunch" -I"/work/proj/deps_qemu_aarch64/bunch_native/c_src/bunch/nif" -I"/work/proj/deps_qemu_aarch64/shmex/c_src/shmex" -I"/work/proj/deps_qemu_aarch64/shmex/c_src/shmex/nif" -I"/work/proj/deps_qemu_aarch64/unifex/c_src/unifex/nif" -I"/usr/local/lib/erlang/usr/include" -I"/work/proj/deps_qemu_aarch64/ex_libsrt/c_src" "/work/proj/deps_qemu_aarch64/ex_libsrt/c_src/ex_libsrt/_generated/nif/srt_nif.cpp"1537) && \1538(/home/nerves/.nerves/artifacts/nerves_toolchain_aarch64_nerves_linux_gnu-15.3.1/bin/aarch64-nerves-linux-gnu-g++ -mabi=lp64 -fstack-protector-strong -mcpu=cortex-a53 -fPIE -pie -D_LARGEFILE_SOURCE -D_LARGEFILE64_SOURCE -D_FILE_OFFSET_BITS=64  -pipe -O2 --sysroot /home/nerves/.nerves/artifacts/nerves_system_qemu_aarch64-0.4.2/staging -fPIC -Wall -Wextra -c -O2 -g -DBUNDLEX_NIF -std=c++17 -I/work/proj/_build/qemu_aarch64/lib/bundlex/priv/shared/precompiled/httpsgithub.commembraneframework-precompiledprecompiled_srtreleasesdownloadv1.5.4srt_linux_arm.tar.gz/include -I/home/nerves/.nerves/artifacts/nerves_system_qemu_aarch64-0.4.2/staging/usr/include -o "/work/proj/_build/qemu_aarch64/lib/ex_libsrt/priv/bundlex/nif/srt_nif_obj/srt_nif.cpp_80102C777A81B4B6B830DCF2C2593C30FA2FAB24.o" -I"/work/proj/deps_qemu_aarch64/bunch_native/c_src/bunch" -I"/work/proj/deps_qemu_aarch64/bunch_native/c_src/bunch/nif" -I"/work/proj/deps_qemu_aarch64/shmex/c_src/shmex" -I"/work/proj/deps_qemu_aarch64/shmex/c_src/shmex/nif" -I"/work/proj/deps_qemu_aarch64/unifex/c_src/unifex/nif" -I"/work/proj/deps_qemu_aarch64/bunch_native/c_src/bunch" -I"/work/proj/deps_qemu_aarch64/bunch_native/c_src/bunch/nif" -I"/work/proj/deps_qemu_aarch64/shmex/c_src/shmex" -I"/work/proj/deps_qemu_aarch64/shmex/c_src/shmex/nif" -I"/work/proj/deps_qemu_aarch64/unifex/c_src/unifex/nif" -I"/usr/local/lib/erlang/usr/include" -I"/work/proj/deps_qemu_aarch64/ex_libsrt/c_src" "/work/proj/deps_qemu_aarch64/ex_libsrt/c_src/ex_libsrt/srt_nif.cpp"1539) && \1540(/home/nerves/.nerves/artifacts/nerves_toolchain_aarch64_nerves_linux_gnu-15.3.1/bin/aarch64-nerves-linux-gnu-g++ -mabi=lp64 -fstack-protector-strong -mcpu=cortex-a53 -fPIE -pie -D_LARGEFILE_SOURCE -D_LARGEFILE64_SOURCE -D_FILE_OFFSET_BITS=64  -pipe -O2 --sysroot /home/nerves/.nerves/artifacts/nerves_system_qemu_aarch64-0.4.2/staging -fPIC -Wall -Wextra -c -O2 -g -DBUNDLEX_NIF -std=c++17 -I/work/proj/_build/qemu_aarch64/lib/bundlex/priv/shared/precompiled/httpsgithub.commembraneframework-precompiledprecompiled_srtreleasesdownloadv1.5.4srt_linux_arm.tar.gz/include -I/home/nerves/.nerves/artifacts/nerves_system_qemu_aarch64-0.4.2/staging/usr/include -o "/work/proj/_build/qemu_aarch64/lib/ex_libsrt/priv/bundlex/nif/srt_nif_obj/server.cpp_B5764135472E0CE913FC2E19DB20A5A5521A2D31.o" -I"/work/proj/deps_qemu_aarch64/bunch_native/c_src/bunch" -I"/work/proj/deps_qemu_aarch64/bunch_native/c_src/bunch/nif" -I"/work/proj/deps_qemu_aarch64/shmex/c_src/shmex" -I"/work/proj/deps_qemu_aarch64/shmex/c_src/shmex/nif" -I"/work/proj/deps_qemu_aarch64/unifex/c_src/unifex/nif" -I"/work/proj/deps_qemu_aarch64/bunch_native/c_src/bunch" -I"/work/proj/deps_qemu_aarch64/bunch_native/c_src/bunch/nif" -I"/work/proj/deps_qemu_aarch64/shmex/c_src/shmex" -I"/work/proj/deps_qemu_aarch64/shmex/c_src/shmex/nif" -I"/work/proj/deps_qemu_aarch64/unifex/c_src/unifex/nif" -I"/usr/local/lib/erlang/usr/include" -I"/work/proj/deps_qemu_aarch64/ex_libsrt/c_src" "/work/proj/deps_qemu_aarch64/ex_libsrt/c_src/ex_libsrt/server/server.cpp"1541) && \1542(/home/nerves/.nerves/artifacts/nerves_toolchain_aarch64_nerves_linux_gnu-15.3.1/bin/aarch64-nerves-linux-gnu-g++ -mabi=lp64 -fstack-protector-strong -mcpu=cortex-a53 -fPIE -pie -D_LARGEFILE_SOURCE -D_LARGEFILE64_SOURCE -D_FILE_OFFSET_BITS=64  -pipe -O2 --sysroot /home/nerves/.nerves/artifacts/nerves_system_qemu_aarch64-0.4.2/staging -fPIC -Wall -Wextra -c -O2 -g -DBUNDLEX_NIF -std=c++17 -I/work/proj/_build/qemu_aarch64/lib/bundlex/priv/shared/precompiled/httpsgithub.commembraneframework-precompiledprecompiled_srtreleasesdownloadv1.5.4srt_linux_arm.tar.gz/include -I/home/nerves/.nerves/artifacts/nerves_system_qemu_aarch64-0.4.2/staging/usr/include -o "/work/proj/_build/qemu_aarch64/lib/ex_libsrt/priv/bundlex/nif/srt_nif_obj/client.cpp_3A70AF1836CD349B01E59F933E9FB1608D216812.o" -I"/work/proj/deps_qemu_aarch64/bunch_native/c_src/bunch" -I"/work/proj/deps_qemu_aarch64/bunch_native/c_src/bunch/nif" -I"/work/proj/deps_qemu_aarch64/shmex/c_src/shmex" -I"/work/proj/deps_qemu_aarch64/shmex/c_src/shmex/nif" -I"/work/proj/deps_qemu_aarch64/unifex/c_src/unifex/nif" -I"/work/proj/deps_qemu_aarch64/bunch_native/c_src/bunch" -I"/work/proj/deps_qemu_aarch64/bunch_native/c_src/bunch/nif" -I"/work/proj/deps_qemu_aarch64/shmex/c_src/shmex" -I"/work/proj/deps_qemu_aarch64/shmex/c_src/shmex/nif" -I"/work/proj/deps_qemu_aarch64/unifex/c_src/unifex/nif" -I"/usr/local/lib/erlang/usr/include" -I"/work/proj/deps_qemu_aarch64/ex_libsrt/c_src" "/work/proj/deps_qemu_aarch64/ex_libsrt/c_src/ex_libsrt/client/client.cpp"1543) && \1544(/home/nerves/.nerves/artifacts/nerves_toolchain_aarch64_nerves_linux_gnu-15.3.1/bin/aarch64-nerves-linux-gnu-g++ -mabi=lp64 -fstack-protector-strong -mcpu=cortex-a53 -fPIE -pie -D_LARGEFILE_SOURCE -D_LARGEFILE64_SOURCE -D_FILE_OFFSET_BITS=64  -pipe -O2 --sysroot /home/nerves/.nerves/artifacts/nerves_system_qemu_aarch64-0.4.2/staging -fPIC -Wall -Wextra -c -O2 -g -DBUNDLEX_NIF -std=c++17 -I/work/proj/_build/qemu_aarch64/lib/bundlex/priv/shared/precompiled/httpsgithub.commembraneframework-precompiledprecompiled_srtreleasesdownloadv1.5.4srt_linux_arm.tar.gz/include -I/home/nerves/.nerves/artifacts/nerves_system_qemu_aarch64-0.4.2/staging/usr/include -o "/work/proj/_build/qemu_aarch64/lib/ex_libsrt/priv/bundlex/nif/srt_nif_obj/srt_socket_stats.cpp_4B3A9313C5E84635F19A84341E4B91E1D24883B7.o" -I"/work/proj/deps_qemu_aarch64/bunch_native/c_src/bunch" -I"/work/proj/deps_qemu_aarch64/bunch_native/c_src/bunch/nif" -I"/work/proj/deps_qemu_aarch64/shmex/c_src/shmex" -I"/work/proj/deps_qemu_aarch64/shmex/c_src/shmex/nif" -I"/work/proj/deps_qemu_aarch64/unifex/c_src/unifex/nif" -I"/work/proj/deps_qemu_aarch64/bunch_native/c_src/bunch" -I"/work/proj/deps_qemu_aarch64/bunch_native/c_src/bunch/nif" -I"/work/proj/deps_qemu_aarch64/shmex/c_src/shmex" -I"/work/proj/deps_qemu_aarch64/shmex/c_src/shmex/nif" -I"/work/proj/deps_qemu_aarch64/unifex/c_src/unifex/nif" -I"/usr/local/lib/erlang/usr/include" -I"/work/proj/deps_qemu_aarch64/ex_libsrt/c_src" "/work/proj/deps_qemu_aarch64/ex_libsrt/c_src/ex_libsrt/common/srt_socket_stats.cpp"1545) && \1546(/home/nerves/.nerves/artifacts/nerves_toolchain_aarch64_nerves_linux_gnu-15.3.1/bin/aarch64-nerves-linux-gnu-g++ --sysroot=/home/nerves/.nerves/artifacts/nerves_system_qemu_aarch64-0.4.2/staging -rdynamic -shared -o "/work/proj/_build/qemu_aarch64/lib/ex_libsrt/priv/bundlex/nif/srt_nif.so" -Wl,--disable-new-dtags,--whole-archive "/work/proj/_build/qemu_aarch64/lib/bunch_native/priv/bundlex/lib.a" "/work/proj/_build/qemu_aarch64/lib/shmex/priv/bundlex/lib.a" "/work/proj/_build/qemu_aarch64/lib/bunch_native/priv/bundlex/nif/bunch.a" "/work/proj/_build/qemu_aarch64/lib/shmex/priv/bundlex/nif/shmex.a" "/work/proj/_build/qemu_aarch64/lib/unifex/priv/bundlex/nif/unifex.a" -Wl,--no-whole-archive "/work/proj/_build/qemu_aarch64/lib/ex_libsrt/priv/bundlex/nif/srt_nif_obj/srt_nif.cpp_09B47872DF2190C103883F87D3270E7CCF5FB674.o" "/work/proj/_build/qemu_aarch64/lib/ex_libsrt/priv/bundlex/nif/srt_nif_obj/srt_nif.cpp_80102C777A81B4B6B830DCF2C2593C30FA2FAB24.o" "/work/proj/_build/qemu_aarch64/lib/ex_libsrt/priv/bundlex/nif/srt_nif_obj/server.cpp_B5764135472E0CE913FC2E19DB20A5A5521A2D31.o" "/work/proj/_build/qemu_aarch64/lib/ex_libsrt/priv/bundlex/nif/srt_nif_obj/client.cpp_3A70AF1836CD349B01E59F933E9FB1608D216812.o" "/work/proj/_build/qemu_aarch64/lib/ex_libsrt/priv/bundlex/nif/srt_nif_obj/srt_socket_stats.cpp_4B3A9313C5E84635F19A84341E4B91E1D24883B7.o"  -lrt -lrt -lpthread -L/work/proj/_build/qemu_aarch64/lib/bundlex/priv/shared/precompiled/httpsgithub.commembraneframework-precompiledprecompiled_srtreleasesdownloadv1.5.4srt_linux_arm.tar.gz/lib -Wl,-rpath,\$ORIGIN/httpsgithub.commembraneframework-precompiledprecompiled_srtreleasesdownloadv1.5.4srt_linux_arm.tar.gz -Wl,-rpath,/opt/homebrew/lib -lsrt -L/home/nerves/.nerves/artifacts/nerves_system_qemu_aarch64-0.4.2/staging/usr/lib -lssl -lcrypto1547)15481549