Build log
nerves_system_rpi5
chi2fit 3.1.0 · fail · run chi2fit-3.1.0-1790958590310
732 of 732 lines
1Resolving Hex dependencies...2Resolution completed in 0.157s3Unchanged:4 chi2fit 3.1.05 circular_buffer 1.1.06 combine 0.10.07 csv 3.2.28 elixir_make 0.10.09 exboost 0.3.910 expo 1.1.111 gettext 0.26.212 interactive_cmd 0.1.413 nerves 2.0.0-pre.214 nerves_discovery 0.1.515 nerves_logging 0.2.416 nerves_runtime 0.13.1317 nerves_system_bbb 2.30.218 nerves_system_br 1.34.419 nerves_system_mangopi_mq_pro 0.17.220 nerves_system_qemu_aarch64 0.4.221 nerves_system_rpi0 2.1.222 nerves_system_rpi4 2.1.223 nerves_system_rpi5 2.1.224 nerves_system_trellis 0.5.025 nerves_system_x86_64 1.34.226 nerves_toolchain_aarch64_nerves_linux_gnu 15.3.127 nerves_toolchain_armv6_nerves_linux_gnueabihf 15.3.128 nerves_toolchain_armv7_nerves_linux_gnueabihf 15.3.129 nerves_toolchain_riscv64_nerves_linux_gnu 15.3.130 nerves_toolchain_x86_64_nerves_linux_musl 15.3.131 nerves_uevent 0.1.732 property_table 0.3.433 ring_logger 0.11.734 tablet 0.3.335 timex 3.7.1336 toolshed 0.5.037 tzdata 1.2.238 uboot_env 1.0.239* Getting chi2fit (Hex package)40* Getting nerves (Hex package)41* Getting ring_logger (Hex package)42* Getting toolshed (Hex package)43* Getting nerves_runtime (Hex package)44* Getting nerves_system_bbb (Hex package)45* Getting nerves_system_mangopi_mq_pro (Hex package)46* Getting nerves_system_qemu_aarch64 (Hex package)47* Getting nerves_system_rpi0 (Hex package)48* Getting nerves_system_rpi4 (Hex package)49* Getting nerves_system_rpi5 (Hex package)50* Getting nerves_system_trellis (Hex package)51* Getting nerves_system_x86_64 (Hex package)52* Getting nerves_system_br (Hex package)53* Getting nerves_toolchain_x86_64_nerves_linux_musl (Hex package)54* Getting nerves_toolchain_armv7_nerves_linux_gnueabihf (Hex package)55* Getting nerves_toolchain_aarch64_nerves_linux_gnu (Hex package)56* Getting nerves_toolchain_armv6_nerves_linux_gnueabihf (Hex package)57* Getting nerves_toolchain_riscv64_nerves_linux_gnu (Hex package)58* Getting nerves_logging (Hex package)59* Getting nerves_uevent (Hex package)60* Getting uboot_env (Hex package)61* Getting elixir_make (Hex package)62* Getting property_table (Hex package)63* Getting circular_buffer (Hex package)64* Getting interactive_cmd (Hex package)65* Getting nerves_discovery (Hex package)66* Getting tablet (Hex package)67* Getting csv (Hex package)68* Getting exboost (Hex package)69* Getting timex (Hex package)70* Getting tzdata (Hex package)71* Getting combine (Hex package)72* Getting gettext (Hex package)73* Getting expo (Hex package)74==> nerves_system_br75Generated nerves_system_br app76==> combine77Compiling 6 files (.ex)78 warning: the variable "n" (context Combine.Parsers.Binary) is accessed inside size(...) of a bitstring but it was defined outside of the match. You must precede it with the pin operator79 │80 26 │ <<bits::bitstring-size(n), rest::bitstring>> ->81 │ ~82 │83 └─ lib/combine/parsers/binary.ex:26:30: Combine.Parsers.Binary.bits_impl/28485 warning: the variable "bits_size" (context Combine.Parsers.Binary) is accessed inside size(...) of a bitstring but it was defined outside of the match. You must precede it with the pin operator86 │87 48 │ <<bits::bitstring-size(bits_size), rest::bitstring>> ->88 │ ~89 │90 └─ lib/combine/parsers/binary.ex:48:30: Combine.Parsers.Binary.bytes_impl/29192 warning: the variable "size" (context Combine.Parsers.Binary) is accessed inside size(...) of a bitstring but it was defined outside of the match. You must precede it with the pin operator93 │94 70 │ <<int::big-unsigned-size(size), rest::bitstring>> ->95 │ ~96 │97 └─ lib/combine/parsers/binary.ex:70:36: Combine.Parsers.Binary.uint_impl/39899 warning: the variable "size" (context Combine.Parsers.Binary) is accessed inside size(...) of a bitstring but it was defined outside of the match. You must precede it with the pin operator100 │101 77 │ <<int::little-unsigned-size(size), rest::bitstring>> ->102 │ ~103 │104 └─ lib/combine/parsers/binary.ex:77:39: Combine.Parsers.Binary.uint_impl/3105106 warning: the variable "size" (context Combine.Parsers.Binary) is accessed inside size(...) of a bitstring but it was defined outside of the match. You must precede it with the pin operator107 │108 101 │ <<int::big-signed-size(size), rest::bitstring>> ->109 │ ~110 │111 └─ lib/combine/parsers/binary.ex:101:34: Combine.Parsers.Binary.int_impl/3112113 warning: the variable "size" (context Combine.Parsers.Binary) is accessed inside size(...) of a bitstring but it was defined outside of the match. You must precede it with the pin operator114 │115 108 │ <<int::little-signed-size(size), rest::bitstring>> ->116 │ ~117 │118 └─ lib/combine/parsers/binary.ex:108:37: Combine.Parsers.Binary.int_impl/3119120 warning: the variable "size" (context Combine.Parsers.Binary) is accessed inside size(...) of a bitstring but it was defined outside of the match. You must precede it with the pin operator121 │122 128 │ <<num::float-size(size), rest::bitstring>> ->123 │ ~124 │125 └─ lib/combine/parsers/binary.ex:128:25: Combine.Parsers.Binary.float_impl/2126127 warning: the variable "byte_size" (context Combine.Parsers.Text) is accessed inside size(...) of a bitstring but it was defined outside of the match. You must precede it with the pin operator128 │129 432 │ <<^expected::binary-size(byte_size), rest::binary>> ->130 │ ~131 │132 └─ lib/combine/parsers/text.ex:432:34: Combine.Parsers.Text.string_impl/2133134 warning: the following clause is redundant:135136 defp word_of_impl(%Combine.ParserState{...} = state, _pattern)137138 it has type:139140 dynamic(%Combine.ParserState{status: :ok}), dynamic()141142 previous clauses have already matched on the following types:143144 %Combine.ParserState{status: :error}, term()145 %Combine.ParserState{status: :ok}, term()146147 │148 488 │ defp word_of_impl(%ParserState{status: :ok} = state, _pattern) do149 │ ~150 │151 └─ lib/combine/parsers/text.ex:488:8: Combine.Parsers.Text.word_of_impl/2152153Generated combine app154==> circular_buffer155Compiling 1 file (.ex)156Generated circular_buffer app157==> tzdata158Compiling 18 files (.ex)159Generated tzdata app160==> csv161Compiling 7 files (.ex)162 warning: default arguments in protocol definitions is deprecated163 │164 11 │ def encode(data, env \\ [])165 │ ~~~~~~~~~~~~~~~~~~~~~~~~~~~166 │167 └─ lib/csv/encoding/encode.ex:11: CSV.Encode (module)168169 warning: protocols can only define functions without implementation via def/1, found: encode/1170 │171 1 │ defprotocol CSV.Encode do172 │ ~~~~~~~~~~~~~~~~~~~~~~~~~173 │174 └─ lib/csv/encoding/encode.ex:1: CSV.Encode (module)175176Generated csv app177==> tablet178Compiling 2 files (.ex)179Generated tablet app180==> elixir_make181Compiling 8 files (.ex)182Generated elixir_make app183==> nerves_logging184 CC kmsg_tailer.o185 LD kmsg_tailer186Compiling 5 files (.ex)187Generated nerves_logging app188==> exboost189c++ -I/usr/local/lib/erlang/erts-17.1/include -I/usr/local/include -fPIC -g -O3 -flto -mtune=generic -Wno-write-strings -D_LARGEFILE_SOURCE -D_LARGEFILE64_SOURCE -D_FILE_OFFSET_BITS=64 --sysroot /home/nerves/.nerves/artifacts/nerves_system_rpi5-2.1.2/staging aarch64 -c -o priv/boostnif.o priv/boostnif.c190In file included from /home/nerves/.nerves/artifacts/nerves_system_rpi5-2.1.2/staging/usr/include/math.h:37,191 from /usr/include/c++/13/cmath:47,192 from /usr/include/c++/13/complex:44,193 from /home/nerves/.nerves/artifacts/nerves_system_rpi5-2.1.2/staging/usr/include/boost/math/special_functions/math_fwd.hpp:27,194 from /home/nerves/.nerves/artifacts/nerves_system_rpi5-2.1.2/staging/usr/include/boost/math/special_functions/airy.hpp:11,195 from /home/nerves/.nerves/artifacts/nerves_system_rpi5-2.1.2/staging/usr/include/boost/math/special_functions.hpp:15,196 from priv/boostnif.c:32:197/home/nerves/.nerves/artifacts/nerves_system_rpi5-2.1.2/staging/usr/include/bits/math-vector.h:192:9: error: ‘__Float32x4_t’ does not name a type; did you mean ‘_Float32x’?198 192 | typedef __Float32x4_t __f32x4_t;199 | ^~~~~~~~~~~~~200 | _Float32x201/home/nerves/.nerves/artifacts/nerves_system_rpi5-2.1.2/staging/usr/include/bits/math-vector.h:193:9: error: ‘__Float64x2_t’ does not name a type; did you mean ‘_Float64x’?202 193 | typedef __Float64x2_t __f64x2_t;203 | ^~~~~~~~~~~~~204 | _Float64x205/home/nerves/.nerves/artifacts/nerves_system_rpi5-2.1.2/staging/usr/include/bits/math-vector.h:202:9: error: ‘__SVFloat32_t’ does not name a type; did you mean ‘_Float32x’?206 202 | typedef __SVFloat32_t __sv_f32_t;207 | ^~~~~~~~~~~~~208 | _Float32x209/home/nerves/.nerves/artifacts/nerves_system_rpi5-2.1.2/staging/usr/include/bits/math-vector.h:203:9: error: ‘__SVFloat64_t’ does not name a type; did you mean ‘_Float64x’?210 203 | typedef __SVFloat64_t __sv_f64_t;211 | ^~~~~~~~~~~~~212 | _Float64x213/home/nerves/.nerves/artifacts/nerves_system_rpi5-2.1.2/staging/usr/include/bits/math-vector.h:204:9: error: ‘__SVBool_t’ does not name a type214 204 | typedef __SVBool_t __sv_bool_t;215 | ^~~~~~~~~~216/home/nerves/.nerves/artifacts/nerves_system_rpi5-2.1.2/staging/usr/include/bits/math-vector.h:214:8: error: ‘__f32x4_t’ does not name a type217 214 | __vpcs __f32x4_t _ZGVnN4vv_atan2f (__f32x4_t, __f32x4_t);218 | ^~~~~~~~~219/home/nerves/.nerves/artifacts/nerves_system_rpi5-2.1.2/staging/usr/include/bits/math-vector.h:215:8: error: ‘__f32x4_t’ does not name a type220 215 | __vpcs __f32x4_t _ZGVnN4vv_atan2pif (__f32x4_t, __f32x4_t);221 | ^~~~~~~~~222/home/nerves/.nerves/artifacts/nerves_system_rpi5-2.1.2/staging/usr/include/bits/math-vector.h:216:8: error: ‘__f32x4_t’ does not name a type223 216 | __vpcs __f32x4_t _ZGVnN4v_acosf (__f32x4_t);224 | ^~~~~~~~~225/home/nerves/.nerves/artifacts/nerves_system_rpi5-2.1.2/staging/usr/include/bits/math-vector.h:217:8: error: ‘__f32x4_t’ does not name a type226 217 | __vpcs __f32x4_t _ZGVnN4v_acoshf (__f32x4_t);227 | ^~~~~~~~~228/home/nerves/.nerves/artifacts/nerves_system_rpi5-2.1.2/staging/usr/include/bits/math-vector.h:218:8: error: ‘__f32x4_t’ does not name a type229 218 | __vpcs __f32x4_t _ZGVnN4v_acospif (__f32x4_t);230 | ^~~~~~~~~231/home/nerves/.nerves/artifacts/nerves_system_rpi5-2.1.2/staging/usr/include/bits/math-vector.h:219:8: error: ‘__f32x4_t’ does not name a type232 219 | __vpcs __f32x4_t _ZGVnN4v_asinf (__f32x4_t);233 | ^~~~~~~~~234/home/nerves/.nerves/artifacts/nerves_system_rpi5-2.1.2/staging/usr/include/bits/math-vector.h:220:8: error: ‘__f32x4_t’ does not name a type235 220 | __vpcs __f32x4_t _ZGVnN4v_asinhf (__f32x4_t);236 | ^~~~~~~~~237/home/nerves/.nerves/artifacts/nerves_system_rpi5-2.1.2/staging/usr/include/bits/math-vector.h:221:8: error: ‘__f32x4_t’ does not name a type238 221 | __vpcs __f32x4_t _ZGVnN4v_asinpif (__f32x4_t);239 | ^~~~~~~~~240/home/nerves/.nerves/artifacts/nerves_system_rpi5-2.1.2/staging/usr/include/bits/math-vector.h:222:8: error: ‘__f32x4_t’ does not name a type241 222 | __vpcs __f32x4_t _ZGVnN4v_atanf (__f32x4_t);242 | ^~~~~~~~~243/home/nerves/.nerves/artifacts/nerves_system_rpi5-2.1.2/staging/usr/include/bits/math-vector.h:223:8: error: ‘__f32x4_t’ does not name a type244 223 | __vpcs __f32x4_t _ZGVnN4v_atanhf (__f32x4_t);245 | ^~~~~~~~~246/home/nerves/.nerves/artifacts/nerves_system_rpi5-2.1.2/staging/usr/include/bits/math-vector.h:224:8: error: ‘__f32x4_t’ does not name a type247 224 | __vpcs __f32x4_t _ZGVnN4v_atanpif (__f32x4_t);248 | ^~~~~~~~~249/home/nerves/.nerves/artifacts/nerves_system_rpi5-2.1.2/staging/usr/include/bits/math-vector.h:225:8: error: ‘__f32x4_t’ does not name a type250 225 | __vpcs __f32x4_t _ZGVnN4v_cbrtf (__f32x4_t);251 | ^~~~~~~~~252/home/nerves/.nerves/artifacts/nerves_system_rpi5-2.1.2/staging/usr/include/bits/math-vector.h:226:8: error: ‘__f32x4_t’ does not name a type253 226 | __vpcs __f32x4_t _ZGVnN4v_cosf (__f32x4_t);254 | ^~~~~~~~~255/home/nerves/.nerves/artifacts/nerves_system_rpi5-2.1.2/staging/usr/include/bits/math-vector.h:227:8: error: ‘__f32x4_t’ does not name a type256 227 | __vpcs __f32x4_t _ZGVnN4v_coshf (__f32x4_t);257 | ^~~~~~~~~258/home/nerves/.nerves/artifacts/nerves_system_rpi5-2.1.2/staging/usr/include/bits/math-vector.h:228:8: error: ‘__f32x4_t’ does not name a type259 228 | __vpcs __f32x4_t _ZGVnN4v_cospif (__f32x4_t);260 | ^~~~~~~~~261/home/nerves/.nerves/artifacts/nerves_system_rpi5-2.1.2/staging/usr/include/bits/math-vector.h:229:8: error: ‘__f32x4_t’ does not name a type262 229 | __vpcs __f32x4_t _ZGVnN4v_erff (__f32x4_t);263 | ^~~~~~~~~264/home/nerves/.nerves/artifacts/nerves_system_rpi5-2.1.2/staging/usr/include/bits/math-vector.h:230:8: error: ‘__f32x4_t’ does not name a type265 230 | __vpcs __f32x4_t _ZGVnN4v_erfcf (__f32x4_t);266 | ^~~~~~~~~267/home/nerves/.nerves/artifacts/nerves_system_rpi5-2.1.2/staging/usr/include/bits/math-vector.h:231:8: error: ‘__f32x4_t’ does not name a type268 231 | __vpcs __f32x4_t _ZGVnN4v_expf (__f32x4_t);269 | ^~~~~~~~~270/home/nerves/.nerves/artifacts/nerves_system_rpi5-2.1.2/staging/usr/include/bits/math-vector.h:232:8: error: ‘__f32x4_t’ does not name a type271 232 | __vpcs __f32x4_t _ZGVnN4v_exp10f (__f32x4_t);272 | ^~~~~~~~~273/home/nerves/.nerves/artifacts/nerves_system_rpi5-2.1.2/staging/usr/include/bits/math-vector.h:233:8: error: ‘__f32x4_t’ does not name a type274 233 | __vpcs __f32x4_t _ZGVnN4v_exp2f (__f32x4_t);275 | ^~~~~~~~~276/home/nerves/.nerves/artifacts/nerves_system_rpi5-2.1.2/staging/usr/include/bits/math-vector.h:234:8: error: ‘__f32x4_t’ does not name a type277 234 | __vpcs __f32x4_t _ZGVnN4v_expm1f (__f32x4_t);278 | ^~~~~~~~~279/home/nerves/.nerves/artifacts/nerves_system_rpi5-2.1.2/staging/usr/include/bits/math-vector.h:235:8: error: ‘__f32x4_t’ does not name a type280 235 | __vpcs __f32x4_t _ZGVnN4v_exp2m1f (__f32x4_t);281 | ^~~~~~~~~282/home/nerves/.nerves/artifacts/nerves_system_rpi5-2.1.2/staging/usr/include/bits/math-vector.h:236:8: error: ‘__f32x4_t’ does not name a type283 236 | __vpcs __f32x4_t _ZGVnN4v_exp10m1f (__f32x4_t);284 | ^~~~~~~~~285/home/nerves/.nerves/artifacts/nerves_system_rpi5-2.1.2/staging/usr/include/bits/math-vector.h:237:8: error: ‘__f32x4_t’ does not name a type286 237 | __vpcs __f32x4_t _ZGVnN4vv_hypotf (__f32x4_t, __f32x4_t);287 | ^~~~~~~~~288/home/nerves/.nerves/artifacts/nerves_system_rpi5-2.1.2/staging/usr/include/bits/math-vector.h:238:8: error: ‘__f32x4_t’ does not name a type289 238 | __vpcs __f32x4_t _ZGVnN4v_logf (__f32x4_t);290 | ^~~~~~~~~291/home/nerves/.nerves/artifacts/nerves_system_rpi5-2.1.2/staging/usr/include/bits/math-vector.h:239:8: error: ‘__f32x4_t’ does not name a type292 239 | __vpcs __f32x4_t _ZGVnN4v_log10f (__f32x4_t);293 | ^~~~~~~~~294/home/nerves/.nerves/artifacts/nerves_system_rpi5-2.1.2/staging/usr/include/bits/math-vector.h:240:8: error: ‘__f32x4_t’ does not name a type295 240 | __vpcs __f32x4_t _ZGVnN4v_log10p1f (__f32x4_t);296 | ^~~~~~~~~297/home/nerves/.nerves/artifacts/nerves_system_rpi5-2.1.2/staging/usr/include/bits/math-vector.h:241:8: error: ‘__f32x4_t’ does not name a type298 241 | __vpcs __f32x4_t _ZGVnN4v_log1pf (__f32x4_t);299 | ^~~~~~~~~300/home/nerves/.nerves/artifacts/nerves_system_rpi5-2.1.2/staging/usr/include/bits/math-vector.h:242:8: error: ‘__f32x4_t’ does not name a type301 242 | __vpcs __f32x4_t _ZGVnN4v_log2f (__f32x4_t);302 | ^~~~~~~~~303/home/nerves/.nerves/artifacts/nerves_system_rpi5-2.1.2/staging/usr/include/bits/math-vector.h:243:8: error: ‘__f32x4_t’ does not name a type304 243 | __vpcs __f32x4_t _ZGVnN4v_log2p1f (__f32x4_t);305 | ^~~~~~~~~306/home/nerves/.nerves/artifacts/nerves_system_rpi5-2.1.2/staging/usr/include/bits/math-vector.h:244:8: error: ‘__f32x4_t’ does not name a type307 244 | __vpcs __f32x4_t _ZGVnN4v_logp1f (__f32x4_t);308 | ^~~~~~~~~309/home/nerves/.nerves/artifacts/nerves_system_rpi5-2.1.2/staging/usr/include/bits/math-vector.h:245:8: error: ‘__f32x4_t’ does not name a type310 245 | __vpcs __f32x4_t _ZGVnN4vv_powf (__f32x4_t, __f32x4_t);311 | ^~~~~~~~~312/home/nerves/.nerves/artifacts/nerves_system_rpi5-2.1.2/staging/usr/include/bits/math-vector.h:246:8: error: ‘__f32x4_t’ does not name a type313 246 | __vpcs __f32x4_t _ZGVnN4v_rsqrtf (__f32x4_t);314 | ^~~~~~~~~315/home/nerves/.nerves/artifacts/nerves_system_rpi5-2.1.2/staging/usr/include/bits/math-vector.h:247:8: error: ‘__f32x4_t’ does not name a type316 247 | __vpcs __f32x4_t _ZGVnN4v_sinf (__f32x4_t);317 | ^~~~~~~~~318/home/nerves/.nerves/artifacts/nerves_system_rpi5-2.1.2/staging/usr/include/bits/math-vector.h:248:8: error: ‘__f32x4_t’ does not name a type319 248 | __vpcs __f32x4_t _ZGVnN4v_sinhf (__f32x4_t);320 | ^~~~~~~~~321/home/nerves/.nerves/artifacts/nerves_system_rpi5-2.1.2/staging/usr/include/bits/math-vector.h:249:8: error: ‘__f32x4_t’ does not name a type322 249 | __vpcs __f32x4_t _ZGVnN4v_sinpif (__f32x4_t);323 | ^~~~~~~~~324/home/nerves/.nerves/artifacts/nerves_system_rpi5-2.1.2/staging/usr/include/bits/math-vector.h:250:8: error: ‘__f32x4_t’ does not name a type325 250 | __vpcs __f32x4_t _ZGVnN4v_tanf (__f32x4_t);326 | ^~~~~~~~~327/home/nerves/.nerves/artifacts/nerves_system_rpi5-2.1.2/staging/usr/include/bits/math-vector.h:251:8: error: ‘__f32x4_t’ does not name a type328 251 | __vpcs __f32x4_t _ZGVnN4v_tanhf (__f32x4_t);329 | ^~~~~~~~~330/home/nerves/.nerves/artifacts/nerves_system_rpi5-2.1.2/staging/usr/include/bits/math-vector.h:252:8: error: ‘__f32x4_t’ does not name a type331 252 | __vpcs __f32x4_t _ZGVnN4v_tanpif (__f32x4_t);332 | ^~~~~~~~~333/home/nerves/.nerves/artifacts/nerves_system_rpi5-2.1.2/staging/usr/include/bits/math-vector.h:254:8: error: ‘__f64x2_t’ does not name a type334 254 | __vpcs __f64x2_t _ZGVnN2vv_atan2 (__f64x2_t, __f64x2_t);335 | ^~~~~~~~~336/home/nerves/.nerves/artifacts/nerves_system_rpi5-2.1.2/staging/usr/include/bits/math-vector.h:255:8: error: ‘__f64x2_t’ does not name a type337 255 | __vpcs __f64x2_t _ZGVnN2vv_atan2pi (__f64x2_t, __f64x2_t);338 | ^~~~~~~~~339/home/nerves/.nerves/artifacts/nerves_system_rpi5-2.1.2/staging/usr/include/bits/math-vector.h:256:8: error: ‘__f64x2_t’ does not name a type340 256 | __vpcs __f64x2_t _ZGVnN2v_acos (__f64x2_t);341 | ^~~~~~~~~342/home/nerves/.nerves/artifacts/nerves_system_rpi5-2.1.2/staging/usr/include/bits/math-vector.h:257:8: error: ‘__f64x2_t’ does not name a type343 257 | __vpcs __f64x2_t _ZGVnN2v_acosh (__f64x2_t);344 | ^~~~~~~~~345/home/nerves/.nerves/artifacts/nerves_system_rpi5-2.1.2/staging/usr/include/bits/math-vector.h:258:8: error: ‘__f64x2_t’ does not name a type346 258 | __vpcs __f64x2_t _ZGVnN2v_acospi (__f64x2_t);347 | ^~~~~~~~~348/home/nerves/.nerves/artifacts/nerves_system_rpi5-2.1.2/staging/usr/include/bits/math-vector.h:259:8: error: ‘__f64x2_t’ does not name a type349 259 | __vpcs __f64x2_t _ZGVnN2v_asin (__f64x2_t);350 | ^~~~~~~~~351/home/nerves/.nerves/artifacts/nerves_system_rpi5-2.1.2/staging/usr/include/bits/math-vector.h:260:8: error: ‘__f64x2_t’ does not name a type352 260 | __vpcs __f64x2_t _ZGVnN2v_asinh (__f64x2_t);353 | ^~~~~~~~~354/home/nerves/.nerves/artifacts/nerves_system_rpi5-2.1.2/staging/usr/include/bits/math-vector.h:261:8: error: ‘__f64x2_t’ does not name a type355 261 | __vpcs __f64x2_t _ZGVnN2v_asinpi (__f64x2_t);356 | ^~~~~~~~~357/home/nerves/.nerves/artifacts/nerves_system_rpi5-2.1.2/staging/usr/include/bits/math-vector.h:262:8: error: ‘__f64x2_t’ does not name a type358 262 | __vpcs __f64x2_t _ZGVnN2v_atan (__f64x2_t);359 | ^~~~~~~~~360/home/nerves/.nerves/artifacts/nerves_system_rpi5-2.1.2/staging/usr/include/bits/math-vector.h:263:8: error: ‘__f64x2_t’ does not name a type361 263 | __vpcs __f64x2_t _ZGVnN2v_atanh (__f64x2_t);362 | ^~~~~~~~~363/home/nerves/.nerves/artifacts/nerves_system_rpi5-2.1.2/staging/usr/include/bits/math-vector.h:264:8: error: ‘__f64x2_t’ does not name a type364 264 | __vpcs __f64x2_t _ZGVnN2v_atanpi (__f64x2_t);365 | ^~~~~~~~~366/home/nerves/.nerves/artifacts/nerves_system_rpi5-2.1.2/staging/usr/include/bits/math-vector.h:265:8: error: ‘__f64x2_t’ does not name a type367 265 | __vpcs __f64x2_t _ZGVnN2v_cbrt (__f64x2_t);368 | ^~~~~~~~~369/home/nerves/.nerves/artifacts/nerves_system_rpi5-2.1.2/staging/usr/include/bits/math-vector.h:266:8: error: ‘__f64x2_t’ does not name a type370 266 | __vpcs __f64x2_t _ZGVnN2v_cos (__f64x2_t);371 | ^~~~~~~~~372/home/nerves/.nerves/artifacts/nerves_system_rpi5-2.1.2/staging/usr/include/bits/math-vector.h:267:8: error: ‘__f64x2_t’ does not name a type373 267 | __vpcs __f64x2_t _ZGVnN2v_cosh (__f64x2_t);374 | ^~~~~~~~~375/home/nerves/.nerves/artifacts/nerves_system_rpi5-2.1.2/staging/usr/include/bits/math-vector.h:268:8: error: ‘__f64x2_t’ does not name a type376 268 | __vpcs __f64x2_t _ZGVnN2v_cospi (__f64x2_t);377 | ^~~~~~~~~378/home/nerves/.nerves/artifacts/nerves_system_rpi5-2.1.2/staging/usr/include/bits/math-vector.h:269:8: error: ‘__f64x2_t’ does not name a type379 269 | __vpcs __f64x2_t _ZGVnN2v_erf (__f64x2_t);380 | ^~~~~~~~~381/home/nerves/.nerves/artifacts/nerves_system_rpi5-2.1.2/staging/usr/include/bits/math-vector.h:270:8: error: ‘__f64x2_t’ does not name a type382 270 | __vpcs __f64x2_t _ZGVnN2v_erfc (__f64x2_t);383 | ^~~~~~~~~384/home/nerves/.nerves/artifacts/nerves_system_rpi5-2.1.2/staging/usr/include/bits/math-vector.h:271:8: error: ‘__f64x2_t’ does not name a type385 271 | __vpcs __f64x2_t _ZGVnN2v_exp (__f64x2_t);386 | ^~~~~~~~~387/home/nerves/.nerves/artifacts/nerves_system_rpi5-2.1.2/staging/usr/include/bits/math-vector.h:272:8: error: ‘__f64x2_t’ does not name a type388 272 | __vpcs __f64x2_t _ZGVnN2v_exp10 (__f64x2_t);389 | ^~~~~~~~~390/home/nerves/.nerves/artifacts/nerves_system_rpi5-2.1.2/staging/usr/include/bits/math-vector.h:273:8: error: ‘__f64x2_t’ does not name a type391 273 | __vpcs __f64x2_t _ZGVnN2v_exp2 (__f64x2_t);392 | ^~~~~~~~~393/home/nerves/.nerves/artifacts/nerves_system_rpi5-2.1.2/staging/usr/include/bits/math-vector.h:274:8: error: ‘__f64x2_t’ does not name a type394 274 | __vpcs __f64x2_t _ZGVnN2v_expm1 (__f64x2_t);395 | ^~~~~~~~~396/home/nerves/.nerves/artifacts/nerves_system_rpi5-2.1.2/staging/usr/include/bits/math-vector.h:275:8: error: ‘__f64x2_t’ does not name a type397 275 | __vpcs __f64x2_t _ZGVnN2v_exp2m1 (__f64x2_t);398 | ^~~~~~~~~399/home/nerves/.nerves/artifacts/nerves_system_rpi5-2.1.2/staging/usr/include/bits/math-vector.h:276:8: error: ‘__f64x2_t’ does not name a type400 276 | __vpcs __f64x2_t _ZGVnN2v_exp10m1 (__f64x2_t);401 | ^~~~~~~~~402/home/nerves/.nerves/artifacts/nerves_system_rpi5-2.1.2/staging/usr/include/bits/math-vector.h:277:8: error: ‘__f64x2_t’ does not name a type403 277 | __vpcs __f64x2_t _ZGVnN2vv_hypot (__f64x2_t, __f64x2_t);404 | ^~~~~~~~~405/home/nerves/.nerves/artifacts/nerves_system_rpi5-2.1.2/staging/usr/include/bits/math-vector.h:278:8: error: ‘__f64x2_t’ does not name a type406 278 | __vpcs __f64x2_t _ZGVnN2v_log (__f64x2_t);407 | ^~~~~~~~~408/home/nerves/.nerves/artifacts/nerves_system_rpi5-2.1.2/staging/usr/include/bits/math-vector.h:279:8: error: ‘__f64x2_t’ does not name a type409 279 | __vpcs __f64x2_t _ZGVnN2v_log10 (__f64x2_t);410 | ^~~~~~~~~411/home/nerves/.nerves/artifacts/nerves_system_rpi5-2.1.2/staging/usr/include/bits/math-vector.h:280:8: error: ‘__f64x2_t’ does not name a type412 280 | __vpcs __f64x2_t _ZGVnN2v_log10p1 (__f64x2_t);413 | ^~~~~~~~~414/home/nerves/.nerves/artifacts/nerves_system_rpi5-2.1.2/staging/usr/include/bits/math-vector.h:281:8: error: ‘__f64x2_t’ does not name a type415 281 | __vpcs __f64x2_t _ZGVnN2v_log1p (__f64x2_t);416 | ^~~~~~~~~417/home/nerves/.nerves/artifacts/nerves_system_rpi5-2.1.2/staging/usr/include/bits/math-vector.h:282:8: error: ‘__f64x2_t’ does not name a type418 282 | __vpcs __f64x2_t _ZGVnN2v_log2 (__f64x2_t);419 | ^~~~~~~~~420/home/nerves/.nerves/artifacts/nerves_system_rpi5-2.1.2/staging/usr/include/bits/math-vector.h:283:8: error: ‘__f64x2_t’ does not name a type421 283 | __vpcs __f64x2_t _ZGVnN2v_log2p1 (__f64x2_t);422 | ^~~~~~~~~423/home/nerves/.nerves/artifacts/nerves_system_rpi5-2.1.2/staging/usr/include/bits/math-vector.h:284:8: error: ‘__f64x2_t’ does not name a type424 284 | __vpcs __f64x2_t _ZGVnN2v_logp1 (__f64x2_t);425 | ^~~~~~~~~426/home/nerves/.nerves/artifacts/nerves_system_rpi5-2.1.2/staging/usr/include/bits/math-vector.h:285:8: error: ‘__f64x2_t’ does not name a type427 285 | __vpcs __f64x2_t _ZGVnN2vv_pow (__f64x2_t, __f64x2_t);428 | ^~~~~~~~~429/home/nerves/.nerves/artifacts/nerves_system_rpi5-2.1.2/staging/usr/include/bits/math-vector.h:286:8: error: ‘__f64x2_t’ does not name a type430 286 | __vpcs __f64x2_t _ZGVnN2v_rsqrt (__f64x2_t);431 | ^~~~~~~~~432/home/nerves/.nerves/artifacts/nerves_system_rpi5-2.1.2/staging/usr/include/bits/math-vector.h:287:8: error: ‘__f64x2_t’ does not name a type433 287 | __vpcs __f64x2_t _ZGVnN2v_sin (__f64x2_t);434 | ^~~~~~~~~435/home/nerves/.nerves/artifacts/nerves_system_rpi5-2.1.2/staging/usr/include/bits/math-vector.h:288:8: error: ‘__f64x2_t’ does not name a type436 288 | __vpcs __f64x2_t _ZGVnN2v_sinh (__f64x2_t);437 | ^~~~~~~~~438/home/nerves/.nerves/artifacts/nerves_system_rpi5-2.1.2/staging/usr/include/bits/math-vector.h:289:8: error: ‘__f64x2_t’ does not name a type439 289 | __vpcs __f64x2_t _ZGVnN2v_sinpi (__f64x2_t);440 | ^~~~~~~~~441/home/nerves/.nerves/artifacts/nerves_system_rpi5-2.1.2/staging/usr/include/bits/math-vector.h:290:8: error: ‘__f64x2_t’ does not name a type442 290 | __vpcs __f64x2_t _ZGVnN2v_tan (__f64x2_t);443 | ^~~~~~~~~444/home/nerves/.nerves/artifacts/nerves_system_rpi5-2.1.2/staging/usr/include/bits/math-vector.h:291:8: error: ‘__f64x2_t’ does not name a type445 291 | __vpcs __f64x2_t _ZGVnN2v_tanh (__f64x2_t);446 | ^~~~~~~~~447/home/nerves/.nerves/artifacts/nerves_system_rpi5-2.1.2/staging/usr/include/bits/math-vector.h:292:8: error: ‘__f64x2_t’ does not name a type448 292 | __vpcs __f64x2_t _ZGVnN2v_tanpi (__f64x2_t);449 | ^~~~~~~~~450/home/nerves/.nerves/artifacts/nerves_system_rpi5-2.1.2/staging/usr/include/bits/math-vector.h:299:1: error: ‘__sv_f32_t’ does not name a type451 299 | __sv_f32_t _ZGVsMxvv_atan2f (__sv_f32_t, __sv_f32_t, __sv_bool_t);452 | ^~~~~~~~~~453/home/nerves/.nerves/artifacts/nerves_system_rpi5-2.1.2/staging/usr/include/bits/math-vector.h:300:1: error: ‘__sv_f32_t’ does not name a type454 300 | __sv_f32_t _ZGVsMxvv_atan2pif (__sv_f32_t, __sv_f32_t, __sv_bool_t);455 | ^~~~~~~~~~456/home/nerves/.nerves/artifacts/nerves_system_rpi5-2.1.2/staging/usr/include/bits/math-vector.h:301:1: error: ‘__sv_f32_t’ does not name a type457 301 | __sv_f32_t _ZGVsMxv_acosf (__sv_f32_t, __sv_bool_t);458 | ^~~~~~~~~~459/home/nerves/.nerves/artifacts/nerves_system_rpi5-2.1.2/staging/usr/include/bits/math-vector.h:302:1: error: ‘__sv_f32_t’ does not name a type460 302 | __sv_f32_t _ZGVsMxv_acoshf (__sv_f32_t, __sv_bool_t);461 | ^~~~~~~~~~462/home/nerves/.nerves/artifacts/nerves_system_rpi5-2.1.2/staging/usr/include/bits/math-vector.h:303:1: error: ‘__sv_f32_t’ does not name a type463 303 | __sv_f32_t _ZGVsMxv_acospif (__sv_f32_t, __sv_bool_t);464 | ^~~~~~~~~~465/home/nerves/.nerves/artifacts/nerves_system_rpi5-2.1.2/staging/usr/include/bits/math-vector.h:304:1: error: ‘__sv_f32_t’ does not name a type466 304 | __sv_f32_t _ZGVsMxv_asinf (__sv_f32_t, __sv_bool_t);467 | ^~~~~~~~~~468/home/nerves/.nerves/artifacts/nerves_system_rpi5-2.1.2/staging/usr/include/bits/math-vector.h:305:1: error: ‘__sv_f32_t’ does not name a type469 305 | __sv_f32_t _ZGVsMxv_asinhf (__sv_f32_t, __sv_bool_t);470 | ^~~~~~~~~~471/home/nerves/.nerves/artifacts/nerves_system_rpi5-2.1.2/staging/usr/include/bits/math-vector.h:306:1: error: ‘__sv_f32_t’ does not name a type472 306 | __sv_f32_t _ZGVsMxv_asinpif (__sv_f32_t, __sv_bool_t);473 | ^~~~~~~~~~474/home/nerves/.nerves/artifacts/nerves_system_rpi5-2.1.2/staging/usr/include/bits/math-vector.h:307:1: error: ‘__sv_f32_t’ does not name a type475 307 | __sv_f32_t _ZGVsMxv_atanf (__sv_f32_t, __sv_bool_t);476 | ^~~~~~~~~~477/home/nerves/.nerves/artifacts/nerves_system_rpi5-2.1.2/staging/usr/include/bits/math-vector.h:308:1: error: ‘__sv_f32_t’ does not name a type478 308 | __sv_f32_t _ZGVsMxv_atanhf (__sv_f32_t, __sv_bool_t);479 | ^~~~~~~~~~480/home/nerves/.nerves/artifacts/nerves_system_rpi5-2.1.2/staging/usr/include/bits/math-vector.h:309:1: error: ‘__sv_f32_t’ does not name a type481 309 | __sv_f32_t _ZGVsMxv_atanpif (__sv_f32_t, __sv_bool_t);482 | ^~~~~~~~~~483/home/nerves/.nerves/artifacts/nerves_system_rpi5-2.1.2/staging/usr/include/bits/math-vector.h:310:1: error: ‘__sv_f32_t’ does not name a type484 310 | __sv_f32_t _ZGVsMxv_cbrtf (__sv_f32_t, __sv_bool_t);485 | ^~~~~~~~~~486/home/nerves/.nerves/artifacts/nerves_system_rpi5-2.1.2/staging/usr/include/bits/math-vector.h:311:1: error: ‘__sv_f32_t’ does not name a type487 311 | __sv_f32_t _ZGVsMxv_cosf (__sv_f32_t, __sv_bool_t);488 | ^~~~~~~~~~489/home/nerves/.nerves/artifacts/nerves_system_rpi5-2.1.2/staging/usr/include/bits/math-vector.h:312:1: error: ‘__sv_f32_t’ does not name a type490 312 | __sv_f32_t _ZGVsMxv_coshf (__sv_f32_t, __sv_bool_t);491 | ^~~~~~~~~~492/home/nerves/.nerves/artifacts/nerves_system_rpi5-2.1.2/staging/usr/include/bits/math-vector.h:313:1: error: ‘__sv_f32_t’ does not name a type493 313 | __sv_f32_t _ZGVsMxv_cospif (__sv_f32_t, __sv_bool_t);494 | ^~~~~~~~~~495/home/nerves/.nerves/artifacts/nerves_system_rpi5-2.1.2/staging/usr/include/bits/math-vector.h:314:1: error: ‘__sv_f32_t’ does not name a type496 314 | __sv_f32_t _ZGVsMxv_erff (__sv_f32_t, __sv_bool_t);497 | ^~~~~~~~~~498/home/nerves/.nerves/artifacts/nerves_system_rpi5-2.1.2/staging/usr/include/bits/math-vector.h:315:1: error: ‘__sv_f32_t’ does not name a type499 315 | __sv_f32_t _ZGVsMxv_erfcf (__sv_f32_t, __sv_bool_t);500 | ^~~~~~~~~~501/home/nerves/.nerves/artifacts/nerves_system_rpi5-2.1.2/staging/usr/include/bits/math-vector.h:316:1: error: ‘__sv_f32_t’ does not name a type502 316 | __sv_f32_t _ZGVsMxv_expf (__sv_f32_t, __sv_bool_t);503 | ^~~~~~~~~~504/home/nerves/.nerves/artifacts/nerves_system_rpi5-2.1.2/staging/usr/include/bits/math-vector.h:317:1: error: ‘__sv_f32_t’ does not name a type505 317 | __sv_f32_t _ZGVsMxv_exp10f (__sv_f32_t, __sv_bool_t);506 | ^~~~~~~~~~507/home/nerves/.nerves/artifacts/nerves_system_rpi5-2.1.2/staging/usr/include/bits/math-vector.h:318:1: error: ‘__sv_f32_t’ does not name a type508 318 | __sv_f32_t _ZGVsMxv_exp2f (__sv_f32_t, __sv_bool_t);509 | ^~~~~~~~~~510/home/nerves/.nerves/artifacts/nerves_system_rpi5-2.1.2/staging/usr/include/bits/math-vector.h:319:1: error: ‘__sv_f32_t’ does not name a type511 319 | __sv_f32_t _ZGVsMxv_expm1f (__sv_f32_t, __sv_bool_t);512 | ^~~~~~~~~~513/home/nerves/.nerves/artifacts/nerves_system_rpi5-2.1.2/staging/usr/include/bits/math-vector.h:320:1: error: ‘__sv_f32_t’ does not name a type514 320 | __sv_f32_t _ZGVsMxv_exp2m1f (__sv_f32_t, __sv_bool_t);515 | ^~~~~~~~~~516/home/nerves/.nerves/artifacts/nerves_system_rpi5-2.1.2/staging/usr/include/bits/math-vector.h:321:1: error: ‘__sv_f32_t’ does not name a type517 321 | __sv_f32_t _ZGVsMxv_exp10m1f (__sv_f32_t, __sv_bool_t);518 | ^~~~~~~~~~519/home/nerves/.nerves/artifacts/nerves_system_rpi5-2.1.2/staging/usr/include/bits/math-vector.h:322:1: error: ‘__sv_f32_t’ does not name a type520 322 | __sv_f32_t _ZGVsMxvv_hypotf (__sv_f32_t, __sv_f32_t, __sv_bool_t);521 | ^~~~~~~~~~522/home/nerves/.nerves/artifacts/nerves_system_rpi5-2.1.2/staging/usr/include/bits/math-vector.h:323:1: error: ‘__sv_f32_t’ does not name a type523 323 | __sv_f32_t _ZGVsMxv_logf (__sv_f32_t, __sv_bool_t);524 | ^~~~~~~~~~525/home/nerves/.nerves/artifacts/nerves_system_rpi5-2.1.2/staging/usr/include/bits/math-vector.h:324:1: error: ‘__sv_f32_t’ does not name a type526 324 | __sv_f32_t _ZGVsMxv_log10f (__sv_f32_t, __sv_bool_t);527 | ^~~~~~~~~~528/home/nerves/.nerves/artifacts/nerves_system_rpi5-2.1.2/staging/usr/include/bits/math-vector.h:325:1: error: ‘__sv_f32_t’ does not name a type529 325 | __sv_f32_t _ZGVsMxv_log10p1f (__sv_f32_t, __sv_bool_t);530 | ^~~~~~~~~~531/home/nerves/.nerves/artifacts/nerves_system_rpi5-2.1.2/staging/usr/include/bits/math-vector.h:326:1: error: ‘__sv_f32_t’ does not name a type532 326 | __sv_f32_t _ZGVsMxv_log1pf (__sv_f32_t, __sv_bool_t);533 | ^~~~~~~~~~534/home/nerves/.nerves/artifacts/nerves_system_rpi5-2.1.2/staging/usr/include/bits/math-vector.h:327:1: error: ‘__sv_f32_t’ does not name a type535 327 | __sv_f32_t _ZGVsMxv_log2f (__sv_f32_t, __sv_bool_t);536 | ^~~~~~~~~~537/home/nerves/.nerves/artifacts/nerves_system_rpi5-2.1.2/staging/usr/include/bits/math-vector.h:328:1: error: ‘__sv_f32_t’ does not name a type538 328 | __sv_f32_t _ZGVsMxv_log2p1f (__sv_f32_t, __sv_bool_t);539 | ^~~~~~~~~~540/home/nerves/.nerves/artifacts/nerves_system_rpi5-2.1.2/staging/usr/include/bits/math-vector.h:329:1: error: ‘__sv_f32_t’ does not name a type541 329 | __sv_f32_t _ZGVsMxv_logp1f (__sv_f32_t, __sv_bool_t);542 | ^~~~~~~~~~543/home/nerves/.nerves/artifacts/nerves_system_rpi5-2.1.2/staging/usr/include/bits/math-vector.h:330:1: error: ‘__sv_f32_t’ does not name a type544 330 | __sv_f32_t _ZGVsMxvv_powf (__sv_f32_t, __sv_f32_t, __sv_bool_t);545 | ^~~~~~~~~~546/home/nerves/.nerves/artifacts/nerves_system_rpi5-2.1.2/staging/usr/include/bits/math-vector.h:331:1: error: ‘__sv_f32_t’ does not name a type547 331 | __sv_f32_t _ZGVsMxv_rsqrtf (__sv_f32_t, __sv_bool_t);548 | ^~~~~~~~~~549/home/nerves/.nerves/artifacts/nerves_system_rpi5-2.1.2/staging/usr/include/bits/math-vector.h:332:1: error: ‘__sv_f32_t’ does not name a type550 332 | __sv_f32_t _ZGVsMxv_sinf (__sv_f32_t, __sv_bool_t);551 | ^~~~~~~~~~552/home/nerves/.nerves/artifacts/nerves_system_rpi5-2.1.2/staging/usr/include/bits/math-vector.h:333:1: error: ‘__sv_f32_t’ does not name a type553 333 | __sv_f32_t _ZGVsMxv_sinhf (__sv_f32_t, __sv_bool_t);554 | ^~~~~~~~~~555/home/nerves/.nerves/artifacts/nerves_system_rpi5-2.1.2/staging/usr/include/bits/math-vector.h:334:1: error: ‘__sv_f32_t’ does not name a type556 334 | __sv_f32_t _ZGVsMxv_sinpif (__sv_f32_t, __sv_bool_t);557 | ^~~~~~~~~~558/home/nerves/.nerves/artifacts/nerves_system_rpi5-2.1.2/staging/usr/include/bits/math-vector.h:335:1: error: ‘__sv_f32_t’ does not name a type559 335 | __sv_f32_t _ZGVsMxv_tanf (__sv_f32_t, __sv_bool_t);560 | ^~~~~~~~~~561/home/nerves/.nerves/artifacts/nerves_system_rpi5-2.1.2/staging/usr/include/bits/math-vector.h:336:1: error: ‘__sv_f32_t’ does not name a type562 336 | __sv_f32_t _ZGVsMxv_tanhf (__sv_f32_t, __sv_bool_t);563 | ^~~~~~~~~~564/home/nerves/.nerves/artifacts/nerves_system_rpi5-2.1.2/staging/usr/include/bits/math-vector.h:337:1: error: ‘__sv_f32_t’ does not name a type565 337 | __sv_f32_t _ZGVsMxv_tanpif (__sv_f32_t, __sv_bool_t);566 | ^~~~~~~~~~567/home/nerves/.nerves/artifacts/nerves_system_rpi5-2.1.2/staging/usr/include/bits/math-vector.h:339:1: error: ‘__sv_f64_t’ does not name a type; did you mean ‘__off64_t’?568 339 | __sv_f64_t _ZGVsMxvv_atan2 (__sv_f64_t, __sv_f64_t, __sv_bool_t);569 | ^~~~~~~~~~570 | __off64_t571/home/nerves/.nerves/artifacts/nerves_system_rpi5-2.1.2/staging/usr/include/bits/math-vector.h:340:1: error: ‘__sv_f64_t’ does not name a type; did you mean ‘__off64_t’?572 340 | __sv_f64_t _ZGVsMxvv_atan2pi (__sv_f64_t, __sv_f64_t, __sv_bool_t);573 | ^~~~~~~~~~574 | __off64_t575/home/nerves/.nerves/artifacts/nerves_system_rpi5-2.1.2/staging/usr/include/bits/math-vector.h:341:1: error: ‘__sv_f64_t’ does not name a type; did you mean ‘__off64_t’?576 341 | __sv_f64_t _ZGVsMxv_acos (__sv_f64_t, __sv_bool_t);577 | ^~~~~~~~~~578 | __off64_t579/home/nerves/.nerves/artifacts/nerves_system_rpi5-2.1.2/staging/usr/include/bits/math-vector.h:342:1: error: ‘__sv_f64_t’ does not name a type; did you mean ‘__off64_t’?580 342 | __sv_f64_t _ZGVsMxv_acosh (__sv_f64_t, __sv_bool_t);581 | ^~~~~~~~~~582 | __off64_t583/home/nerves/.nerves/artifacts/nerves_system_rpi5-2.1.2/staging/usr/include/bits/math-vector.h:343:1: error: ‘__sv_f64_t’ does not name a type; did you mean ‘__off64_t’?584 343 | __sv_f64_t _ZGVsMxv_acospi (__sv_f64_t, __sv_bool_t);585 | ^~~~~~~~~~586 | __off64_t587/home/nerves/.nerves/artifacts/nerves_system_rpi5-2.1.2/staging/usr/include/bits/math-vector.h:344:1: error: ‘__sv_f64_t’ does not name a type; did you mean ‘__off64_t’?588 344 | __sv_f64_t _ZGVsMxv_asin (__sv_f64_t, __sv_bool_t);589 | ^~~~~~~~~~590 | __off64_t591/home/nerves/.nerves/artifacts/nerves_system_rpi5-2.1.2/staging/usr/include/bits/math-vector.h:345:1: error: ‘__sv_f64_t’ does not name a type; did you mean ‘__off64_t’?592 345 | __sv_f64_t _ZGVsMxv_asinh (__sv_f64_t, __sv_bool_t);593 | ^~~~~~~~~~594 | __off64_t595/home/nerves/.nerves/artifacts/nerves_system_rpi5-2.1.2/staging/usr/include/bits/math-vector.h:346:1: error: ‘__sv_f64_t’ does not name a type; did you mean ‘__off64_t’?596 346 | __sv_f64_t _ZGVsMxv_asinpi (__sv_f64_t, __sv_bool_t);597 | ^~~~~~~~~~598 | __off64_t599/home/nerves/.nerves/artifacts/nerves_system_rpi5-2.1.2/staging/usr/include/bits/math-vector.h:347:1: error: ‘__sv_f64_t’ does not name a type; did you mean ‘__off64_t’?600 347 | __sv_f64_t _ZGVsMxv_atan (__sv_f64_t, __sv_bool_t);601 | ^~~~~~~~~~602 | __off64_t603/home/nerves/.nerves/artifacts/nerves_system_rpi5-2.1.2/staging/usr/include/bits/math-vector.h:348:1: error: ‘__sv_f64_t’ does not name a type; did you mean ‘__off64_t’?604 348 | __sv_f64_t _ZGVsMxv_atanh (__sv_f64_t, __sv_bool_t);605 | ^~~~~~~~~~606 | __off64_t607/home/nerves/.nerves/artifacts/nerves_system_rpi5-2.1.2/staging/usr/include/bits/math-vector.h:349:1: error: ‘__sv_f64_t’ does not name a type; did you mean ‘__off64_t’?608 349 | __sv_f64_t _ZGVsMxv_atanpi (__sv_f64_t, __sv_bool_t);609 | ^~~~~~~~~~610 | __off64_t611/home/nerves/.nerves/artifacts/nerves_system_rpi5-2.1.2/staging/usr/include/bits/math-vector.h:350:1: error: ‘__sv_f64_t’ does not name a type; did you mean ‘__off64_t’?612 350 | __sv_f64_t _ZGVsMxv_cbrt (__sv_f64_t, __sv_bool_t);613 | ^~~~~~~~~~614 | __off64_t615/home/nerves/.nerves/artifacts/nerves_system_rpi5-2.1.2/staging/usr/include/bits/math-vector.h:351:1: error: ‘__sv_f64_t’ does not name a type; did you mean ‘__off64_t’?616 351 | __sv_f64_t _ZGVsMxv_cos (__sv_f64_t, __sv_bool_t);617 | ^~~~~~~~~~618 | __off64_t619/home/nerves/.nerves/artifacts/nerves_system_rpi5-2.1.2/staging/usr/include/bits/math-vector.h:352:1: error: ‘__sv_f64_t’ does not name a type; did you mean ‘__off64_t’?620 352 | __sv_f64_t _ZGVsMxv_cosh (__sv_f64_t, __sv_bool_t);621 | ^~~~~~~~~~622 | __off64_t623/home/nerves/.nerves/artifacts/nerves_system_rpi5-2.1.2/staging/usr/include/bits/math-vector.h:353:1: error: ‘__sv_f64_t’ does not name a type; did you mean ‘__off64_t’?624 353 | __sv_f64_t _ZGVsMxv_cospi (__sv_f64_t, __sv_bool_t);625 | ^~~~~~~~~~626 | __off64_t627/home/nerves/.nerves/artifacts/nerves_system_rpi5-2.1.2/staging/usr/include/bits/math-vector.h:354:1: error: ‘__sv_f64_t’ does not name a type; did you mean ‘__off64_t’?628 354 | __sv_f64_t _ZGVsMxv_erf (__sv_f64_t, __sv_bool_t);629 | ^~~~~~~~~~630 | __off64_t631/home/nerves/.nerves/artifacts/nerves_system_rpi5-2.1.2/staging/usr/include/bits/math-vector.h:355:1: error: ‘__sv_f64_t’ does not name a type; did you mean ‘__off64_t’?632 355 | __sv_f64_t _ZGVsMxv_erfc (__sv_f64_t, __sv_bool_t);633 | ^~~~~~~~~~634 | __off64_t635/home/nerves/.nerves/artifacts/nerves_system_rpi5-2.1.2/staging/usr/include/bits/math-vector.h:356:1: error: ‘__sv_f64_t’ does not name a type; did you mean ‘__off64_t’?636 356 | __sv_f64_t _ZGVsMxv_exp (__sv_f64_t, __sv_bool_t);637 | ^~~~~~~~~~638 | __off64_t639/home/nerves/.nerves/artifacts/nerves_system_rpi5-2.1.2/staging/usr/include/bits/math-vector.h:357:1: error: ‘__sv_f64_t’ does not name a type; did you mean ‘__off64_t’?640 357 | __sv_f64_t _ZGVsMxv_exp10 (__sv_f64_t, __sv_bool_t);641 | ^~~~~~~~~~642 | __off64_t643/home/nerves/.nerves/artifacts/nerves_system_rpi5-2.1.2/staging/usr/include/bits/math-vector.h:358:1: error: ‘__sv_f64_t’ does not name a type; did you mean ‘__off64_t’?644 358 | __sv_f64_t _ZGVsMxv_exp2 (__sv_f64_t, __sv_bool_t);645 | ^~~~~~~~~~646 | __off64_t647/home/nerves/.nerves/artifacts/nerves_system_rpi5-2.1.2/staging/usr/include/bits/math-vector.h:359:1: error: ‘__sv_f64_t’ does not name a type; did you mean ‘__off64_t’?648 359 | __sv_f64_t _ZGVsMxv_expm1 (__sv_f64_t, __sv_bool_t);649 | ^~~~~~~~~~650 | __off64_t651/home/nerves/.nerves/artifacts/nerves_system_rpi5-2.1.2/staging/usr/include/bits/math-vector.h:360:1: error: ‘__sv_f64_t’ does not name a type; did you mean ‘__off64_t’?652 360 | __sv_f64_t _ZGVsMxv_exp2m1 (__sv_f64_t, __sv_bool_t);653 | ^~~~~~~~~~654 | __off64_t655/home/nerves/.nerves/artifacts/nerves_system_rpi5-2.1.2/staging/usr/include/bits/math-vector.h:361:1: error: ‘__sv_f64_t’ does not name a type; did you mean ‘__off64_t’?656 361 | __sv_f64_t _ZGVsMxv_exp10m1 (__sv_f64_t, __sv_bool_t);657 | ^~~~~~~~~~658 | __off64_t659/home/nerves/.nerves/artifacts/nerves_system_rpi5-2.1.2/staging/usr/include/bits/math-vector.h:362:1: error: ‘__sv_f64_t’ does not name a type; did you mean ‘__off64_t’?660 362 | __sv_f64_t _ZGVsMxvv_hypot (__sv_f64_t, __sv_f64_t, __sv_bool_t);661 | ^~~~~~~~~~662 | __off64_t663/home/nerves/.nerves/artifacts/nerves_system_rpi5-2.1.2/staging/usr/include/bits/math-vector.h:363:1: error: ‘__sv_f64_t’ does not name a type; did you mean ‘__off64_t’?664 363 | __sv_f64_t _ZGVsMxv_log (__sv_f64_t, __sv_bool_t);665 | ^~~~~~~~~~666 | __off64_t667/home/nerves/.nerves/artifacts/nerves_system_rpi5-2.1.2/staging/usr/include/bits/math-vector.h:364:1: error: ‘__sv_f64_t’ does not name a type; did you mean ‘__off64_t’?668 364 | __sv_f64_t _ZGVsMxv_log10 (__sv_f64_t, __sv_bool_t);669 | ^~~~~~~~~~670 | __off64_t671/home/nerves/.nerves/artifacts/nerves_system_rpi5-2.1.2/staging/usr/include/bits/math-vector.h:365:1: error: ‘__sv_f64_t’ does not name a type; did you mean ‘__off64_t’?672 365 | __sv_f64_t _ZGVsMxv_log10p1 (__sv_f64_t, __sv_bool_t);673 | ^~~~~~~~~~674 | __off64_t675/home/nerves/.nerves/artifacts/nerves_system_rpi5-2.1.2/staging/usr/include/bits/math-vector.h:366:1: error: ‘__sv_f64_t’ does not name a type; did you mean ‘__off64_t’?676 366 | __sv_f64_t _ZGVsMxv_log1p (__sv_f64_t, __sv_bool_t);677 | ^~~~~~~~~~678 | __off64_t679/home/nerves/.nerves/artifacts/nerves_system_rpi5-2.1.2/staging/usr/include/bits/math-vector.h:367:1: error: ‘__sv_f64_t’ does not name a type; did you mean ‘__off64_t’?680 367 | __sv_f64_t _ZGVsMxv_log2 (__sv_f64_t, __sv_bool_t);681 | ^~~~~~~~~~682 | __off64_t683/home/nerves/.nerves/artifacts/nerves_system_rpi5-2.1.2/staging/usr/include/bits/math-vector.h:368:1: error: ‘__sv_f64_t’ does not name a type; did you mean ‘__off64_t’?684 368 | __sv_f64_t _ZGVsMxv_log2p1 (__sv_f64_t, __sv_bool_t);685 | ^~~~~~~~~~686 | __off64_t687/home/nerves/.nerves/artifacts/nerves_system_rpi5-2.1.2/staging/usr/include/bits/math-vector.h:369:1: error: ‘__sv_f64_t’ does not name a type; did you mean ‘__off64_t’?688 369 | __sv_f64_t _ZGVsMxv_logp1 (__sv_f64_t, __sv_bool_t);689 | ^~~~~~~~~~690 | __off64_t691/home/nerves/.nerves/artifacts/nerves_system_rpi5-2.1.2/staging/usr/include/bits/math-vector.h:370:1: error: ‘__sv_f64_t’ does not name a type; did you mean ‘__off64_t’?692 370 | __sv_f64_t _ZGVsMxvv_pow (__sv_f64_t, __sv_f64_t, __sv_bool_t);693 | ^~~~~~~~~~694 | __off64_t695/home/nerves/.nerves/artifacts/nerves_system_rpi5-2.1.2/staging/usr/include/bits/math-vector.h:371:1: error: ‘__sv_f64_t’ does not name a type; did you mean ‘__off64_t’?696 371 | __sv_f64_t _ZGVsMxv_rsqrt (__sv_f64_t, __sv_bool_t);697 | ^~~~~~~~~~698 | __off64_t699/home/nerves/.nerves/artifacts/nerves_system_rpi5-2.1.2/staging/usr/include/bits/math-vector.h:372:1: error: ‘__sv_f64_t’ does not name a type; did you mean ‘__off64_t’?700 372 | __sv_f64_t _ZGVsMxv_sin (__sv_f64_t, __sv_bool_t);701 | ^~~~~~~~~~702 | __off64_t703/home/nerves/.nerves/artifacts/nerves_system_rpi5-2.1.2/staging/usr/include/bits/math-vector.h:373:1: error: ‘__sv_f64_t’ does not name a type; did you mean ‘__off64_t’?704 373 | __sv_f64_t _ZGVsMxv_sinh (__sv_f64_t, __sv_bool_t);705 | ^~~~~~~~~~706 | __off64_t707/home/nerves/.nerves/artifacts/nerves_system_rpi5-2.1.2/staging/usr/include/bits/math-vector.h:374:1: error: ‘__sv_f64_t’ does not name a type; did you mean ‘__off64_t’?708 374 | __sv_f64_t _ZGVsMxv_sinpi (__sv_f64_t, __sv_bool_t);709 | ^~~~~~~~~~710 | __off64_t711/home/nerves/.nerves/artifacts/nerves_system_rpi5-2.1.2/staging/usr/include/bits/math-vector.h:375:1: error: ‘__sv_f64_t’ does not name a type; did you mean ‘__off64_t’?712 375 | __sv_f64_t _ZGVsMxv_tan (__sv_f64_t, __sv_bool_t);713 | ^~~~~~~~~~714 | __off64_t715/home/nerves/.nerves/artifacts/nerves_system_rpi5-2.1.2/staging/usr/include/bits/math-vector.h:376:1: error: ‘__sv_f64_t’ does not name a type; did you mean ‘__off64_t’?716 376 | __sv_f64_t _ZGVsMxv_tanh (__sv_f64_t, __sv_bool_t);717 | ^~~~~~~~~~718 | __off64_t719/home/nerves/.nerves/artifacts/nerves_system_rpi5-2.1.2/staging/usr/include/bits/math-vector.h:377:1: error: ‘__sv_f64_t’ does not name a type; did you mean ‘__off64_t’?720 377 | __sv_f64_t _ZGVsMxv_tanpi (__sv_f64_t, __sv_bool_t);721 | ^~~~~~~~~~722 | __off64_t723make: *** [<builtin>: priv/boostnif.o] Error 1724could not compile dependency :exboost, "mix compile" failed. Errors may have been logged above. You can recompile this dependency with "mix deps.compile exboost --force", update it with "mix deps.update exboost" or clean it with "mix deps.clean exboost"725==> nerves_compatibility_test726** (Mix) Could not compile with "make" (exit status: 2).727You need to have gcc and make installed. If you are using728Ubuntu or any other Debian-based system, install the packages729"build-essential". Also install "erlang-dev" package if not730included in your Erlang/OTP version. If you're on Fedora, run731"dnf group install 'Development Tools'".732