Build log
nerves_system_x86_64
chi2fit 3.1.0 · fail · run chi2fit-3.1.0-1790958590310
204 of 204 lines
1Resolving Hex dependencies...2Resolution completed in 0.116s3Unchanged:4 chi2fit 3.1.05 circular_buffer 1.1.06 combine 0.10.07 csv 3.2.28 elixir_make 0.10.09 exboost 0.3.910 expo 1.1.111 gettext 0.26.212 interactive_cmd 0.1.413 nerves 2.0.0-pre.214 nerves_discovery 0.1.515 nerves_logging 0.2.416 nerves_runtime 0.13.1317 nerves_system_bbb 2.30.218 nerves_system_br 1.34.419 nerves_system_mangopi_mq_pro 0.17.220 nerves_system_qemu_aarch64 0.4.221 nerves_system_rpi0 2.1.222 nerves_system_rpi4 2.1.223 nerves_system_rpi5 2.1.224 nerves_system_trellis 0.5.025 nerves_system_x86_64 1.34.226 nerves_toolchain_aarch64_nerves_linux_gnu 15.3.127 nerves_toolchain_armv6_nerves_linux_gnueabihf 15.3.128 nerves_toolchain_armv7_nerves_linux_gnueabihf 15.3.129 nerves_toolchain_riscv64_nerves_linux_gnu 15.3.130 nerves_toolchain_x86_64_nerves_linux_musl 15.3.131 nerves_uevent 0.1.732 property_table 0.3.433 ring_logger 0.11.734 tablet 0.3.335 timex 3.7.1336 toolshed 0.5.037 tzdata 1.2.238 uboot_env 1.0.239* Getting chi2fit (Hex package)40* Getting nerves (Hex package)41* Getting ring_logger (Hex package)42* Getting toolshed (Hex package)43* Getting nerves_runtime (Hex package)44* Getting nerves_system_bbb (Hex package)45* Getting nerves_system_mangopi_mq_pro (Hex package)46* Getting nerves_system_qemu_aarch64 (Hex package)47* Getting nerves_system_rpi0 (Hex package)48* Getting nerves_system_rpi4 (Hex package)49* Getting nerves_system_rpi5 (Hex package)50* Getting nerves_system_trellis (Hex package)51* Getting nerves_system_x86_64 (Hex package)52* Getting nerves_system_br (Hex package)53* Getting nerves_toolchain_x86_64_nerves_linux_musl (Hex package)54* Getting nerves_toolchain_armv7_nerves_linux_gnueabihf (Hex package)55* Getting nerves_toolchain_aarch64_nerves_linux_gnu (Hex package)56* Getting nerves_toolchain_armv6_nerves_linux_gnueabihf (Hex package)57* Getting nerves_toolchain_riscv64_nerves_linux_gnu (Hex package)58* Getting nerves_logging (Hex package)59* Getting nerves_uevent (Hex package)60* Getting uboot_env (Hex package)61* Getting elixir_make (Hex package)62* Getting property_table (Hex package)63* Getting circular_buffer (Hex package)64* Getting interactive_cmd (Hex package)65* Getting nerves_discovery (Hex package)66* Getting tablet (Hex package)67* Getting csv (Hex package)68* Getting exboost (Hex package)69* Getting timex (Hex package)70* Getting tzdata (Hex package)71* Getting combine (Hex package)72* Getting gettext (Hex package)73* Getting expo (Hex package)74==> combine75Compiling 6 files (.ex)76 warning: the variable "n" (context Combine.Parsers.Binary) is accessed inside size(...) of a bitstring but it was defined outside of the match. You must precede it with the pin operator77 │78 26 │ <<bits::bitstring-size(n), rest::bitstring>> ->79 │ ~80 │81 └─ lib/combine/parsers/binary.ex:26:30: Combine.Parsers.Binary.bits_impl/28283 warning: the variable "bits_size" (context Combine.Parsers.Binary) is accessed inside size(...) of a bitstring but it was defined outside of the match. You must precede it with the pin operator84 │85 48 │ <<bits::bitstring-size(bits_size), rest::bitstring>> ->86 │ ~87 │88 └─ lib/combine/parsers/binary.ex:48:30: Combine.Parsers.Binary.bytes_impl/28990 warning: the variable "size" (context Combine.Parsers.Binary) is accessed inside size(...) of a bitstring but it was defined outside of the match. You must precede it with the pin operator91 │92 70 │ <<int::big-unsigned-size(size), rest::bitstring>> ->93 │ ~94 │95 └─ lib/combine/parsers/binary.ex:70:36: Combine.Parsers.Binary.uint_impl/39697 warning: the variable "size" (context Combine.Parsers.Binary) is accessed inside size(...) of a bitstring but it was defined outside of the match. You must precede it with the pin operator98 │99 77 │ <<int::little-unsigned-size(size), rest::bitstring>> ->100 │ ~101 │102 └─ lib/combine/parsers/binary.ex:77:39: Combine.Parsers.Binary.uint_impl/3103104 warning: the variable "size" (context Combine.Parsers.Binary) is accessed inside size(...) of a bitstring but it was defined outside of the match. You must precede it with the pin operator105 │106 101 │ <<int::big-signed-size(size), rest::bitstring>> ->107 │ ~108 │109 └─ lib/combine/parsers/binary.ex:101:34: Combine.Parsers.Binary.int_impl/3110111 warning: the variable "size" (context Combine.Parsers.Binary) is accessed inside size(...) of a bitstring but it was defined outside of the match. You must precede it with the pin operator112 │113 108 │ <<int::little-signed-size(size), rest::bitstring>> ->114 │ ~115 │116 └─ lib/combine/parsers/binary.ex:108:37: Combine.Parsers.Binary.int_impl/3117118 warning: the variable "size" (context Combine.Parsers.Binary) is accessed inside size(...) of a bitstring but it was defined outside of the match. You must precede it with the pin operator119 │120 128 │ <<num::float-size(size), rest::bitstring>> ->121 │ ~122 │123 └─ lib/combine/parsers/binary.ex:128:25: Combine.Parsers.Binary.float_impl/2124125 warning: the variable "byte_size" (context Combine.Parsers.Text) is accessed inside size(...) of a bitstring but it was defined outside of the match. You must precede it with the pin operator126 │127 432 │ <<^expected::binary-size(byte_size), rest::binary>> ->128 │ ~129 │130 └─ lib/combine/parsers/text.ex:432:34: Combine.Parsers.Text.string_impl/2131132 warning: the following clause is redundant:133134 defp word_of_impl(%Combine.ParserState{...} = state, _pattern)135136 it has type:137138 dynamic(%Combine.ParserState{status: :ok}), dynamic()139140 previous clauses have already matched on the following types:141142 %Combine.ParserState{status: :error}, term()143 %Combine.ParserState{status: :ok}, term()144145 │146 488 │ defp word_of_impl(%ParserState{status: :ok} = state, _pattern) do147 │ ~148 │149 └─ lib/combine/parsers/text.ex:488:8: Combine.Parsers.Text.word_of_impl/2150151Generated combine app152==> tzdata153Compiling 18 files (.ex)154Generated tzdata app155==> csv156Compiling 7 files (.ex)157 warning: default arguments in protocol definitions is deprecated158 │159 11 │ def encode(data, env \\ [])160 │ ~~~~~~~~~~~~~~~~~~~~~~~~~~~161 │162 └─ lib/csv/encoding/encode.ex:11: CSV.Encode (module)163164 warning: protocols can only define functions without implementation via def/1, found: encode/1165 │166 1 │ defprotocol CSV.Encode do167 │ ~~~~~~~~~~~~~~~~~~~~~~~~~168 │169 └─ lib/csv/encoding/encode.ex:1: CSV.Encode (module)170171Generated csv app172==> exboost173c++ -I/usr/local/lib/erlang/erts-17.1/include -I/usr/local/include -fPIC -g -O3 -flto -mtune=generic -Wno-write-strings -D_LARGEFILE_SOURCE -D_LARGEFILE64_SOURCE -D_FILE_OFFSET_BITS=64 --sysroot /home/nerves/.nerves/artifacts/nerves_system_x86_64-1.34.2/staging x86_64 -c -o priv/boostnif.o priv/boostnif.c174In file included from /usr/include/x86_64-linux-gnu/c++/13/bits/c++config.h:679,175 from /usr/include/c++/13/cstdlib:41,176 from /usr/include/c++/13/stdlib.h:36,177 from /usr/local/lib/erlang/erts-17.1/include/erl_nif.h:93,178 from priv/boostnif.c:30:179/usr/include/x86_64-linux-gnu/c++/13/bits/os_defines.h:44:19: error: missing binary operator before token "("180 44 | #if __GLIBC_PREREQ(2,15) && defined(_GNU_SOURCE)181 | ^182/usr/include/x86_64-linux-gnu/c++/13/bits/os_defines.h:55:19: error: missing binary operator before token "("183 55 | #if __GLIBC_PREREQ(2, 26) \184 | ^185/usr/include/x86_64-linux-gnu/c++/13/bits/os_defines.h:66:20: error: missing binary operator before token "("186 66 | # if __GLIBC_PREREQ(2, 27)187 | ^188/usr/include/x86_64-linux-gnu/c++/13/bits/os_defines.h:78:20: error: missing binary operator before token "("189 78 | # if __GLIBC_PREREQ(2, 34)190 | ^191priv/boostnif.c:32:10: fatal error: boost/math/special_functions.hpp: No such file or directory192 32 | #include <boost/math/special_functions.hpp>193 | ^~~~~~~~~~~~~~~~~~~~~~~~~~~~~~~~~~194compilation terminated.195make: *** [<builtin>: priv/boostnif.o] Error 1196could not compile dependency :exboost, "mix compile" failed. Errors may have been logged above. You can recompile this dependency with "mix deps.compile exboost --force", update it with "mix deps.update exboost" or clean it with "mix deps.clean exboost"197==> nerves_compatibility_test198** (Mix) Could not compile with "make" (exit status: 2).199You need to have gcc and make installed. If you are using200Ubuntu or any other Debian-based system, install the packages201"build-essential". Also install "erlang-dev" package if not202included in your Erlang/OTP version. If you're on Fedora, run203"dnf group install 'Development Tools'".204