chi2fit_nb

Build log

nerves_system_rpi4

chi2fit_nb 0.1.0 · fail · run chi2fit_nb-0.1.0-1790959173226
762 of 762 lines
1Resolving Hex dependencies...2Resolution completed in 0.206s3Unchanged:4  chi2fit 2.1.75  chi2fit_nb 0.1.06  circular_buffer 1.1.07  combine 0.10.08  csv 3.2.29  earmark_parser 1.4.4610  elixir_make 0.10.011  ex_doc 0.40.412  exboost 0.3.913  expo 1.1.114  gettext 0.26.215  gnuplot 1.19.10416  graphvix 1.1.017  interactive_cmd 0.1.418  makeup 1.2.219  makeup_elixir 1.0.120  makeup_erlang 1.1.021  nerves 2.0.0-pre.222  nerves_discovery 0.1.523  nerves_logging 0.2.424  nerves_runtime 0.13.1325  nerves_system_bbb 2.30.226  nerves_system_br 1.34.427  nerves_system_mangopi_mq_pro 0.17.228  nerves_system_qemu_aarch64 0.4.229  nerves_system_rpi0 2.1.230  nerves_system_rpi4 2.1.231  nerves_system_rpi5 2.1.232  nerves_system_trellis 0.5.033  nerves_system_x86_64 1.34.234  nerves_toolchain_aarch64_nerves_linux_gnu 15.3.135  nerves_toolchain_armv6_nerves_linux_gnueabihf 15.3.136  nerves_toolchain_armv7_nerves_linux_gnueabihf 15.3.137  nerves_toolchain_riscv64_nerves_linux_gnu 15.3.138  nerves_toolchain_x86_64_nerves_linux_musl 15.3.139  nerves_uevent 0.1.740  nimble_parsec 1.4.241  property_table 0.3.442  ring_logger 0.11.743  stream_data 1.4.044  tablet 0.3.345  timex 3.7.1346  toolshed 0.5.047  tzdata 1.2.248  uboot_env 1.0.249* Getting chi2fit_nb (Hex package)50* Getting nerves (Hex package)51* Getting ring_logger (Hex package)52* Getting toolshed (Hex package)53* Getting nerves_runtime (Hex package)54* Getting nerves_system_bbb (Hex package)55* Getting nerves_system_mangopi_mq_pro (Hex package)56* Getting nerves_system_qemu_aarch64 (Hex package)57* Getting nerves_system_rpi0 (Hex package)58* Getting nerves_system_rpi4 (Hex package)59* Getting nerves_system_rpi5 (Hex package)60* Getting nerves_system_trellis (Hex package)61* Getting nerves_system_x86_64 (Hex package)62* Getting nerves_system_br (Hex package)63* Getting nerves_toolchain_x86_64_nerves_linux_musl (Hex package)64* Getting nerves_toolchain_armv7_nerves_linux_gnueabihf (Hex package)65* Getting nerves_toolchain_aarch64_nerves_linux_gnu (Hex package)66* Getting nerves_toolchain_armv6_nerves_linux_gnueabihf (Hex package)67* Getting nerves_toolchain_riscv64_nerves_linux_gnu (Hex package)68* Getting nerves_logging (Hex package)69* Getting nerves_uevent (Hex package)70* Getting uboot_env (Hex package)71* Getting elixir_make (Hex package)72* Getting property_table (Hex package)73* Getting circular_buffer (Hex package)74* Getting interactive_cmd (Hex package)75* Getting nerves_discovery (Hex package)76* Getting tablet (Hex package)77* Getting chi2fit (Hex package)78* Getting ex_doc (Hex package)79* Getting gnuplot (Hex package)80* Getting graphvix (Hex package)81* Getting stream_data (Hex package)82* Getting earmark_parser (Hex package)83* Getting makeup_elixir (Hex package)84* Getting makeup_erlang (Hex package)85* Getting makeup (Hex package)86* Getting nimble_parsec (Hex package)87* Getting csv (Hex package)88* Getting exboost (Hex package)89* Getting timex (Hex package)90* Getting tzdata (Hex package)91* Getting combine (Hex package)92* Getting gettext (Hex package)93* Getting expo (Hex package)94You have added/upgraded packages you could sponsor, run `mix hex.sponsor` to learn more95==> nerves_system_br96Generated nerves_system_br app97==> earmark_parser98Compiling 2 files (.xrl)99Compiling 1 file (.yrl)100Compiling 3 files (.erl)101Compiling 32 files (.ex)102Generated earmark_parser app103==> stream_data104Compiling 3 files (.ex)105Generated stream_data app106==> combine107Compiling 6 files (.ex)108    warning: the variable "n" (context Combine.Parsers.Binary) is accessed inside size(...) of a bitstring but it was defined outside of the match. You must precede it with the pin operator109    │110 26 │       <<bits::bitstring-size(n), rest::bitstring>> ->111    │                              ~112    │113    └─ lib/combine/parsers/binary.ex:26:30: Combine.Parsers.Binary.bits_impl/2114115    warning: the variable "bits_size" (context Combine.Parsers.Binary) is accessed inside size(...) of a bitstring but it was defined outside of the match. You must precede it with the pin operator116    │117 48 │       <<bits::bitstring-size(bits_size), rest::bitstring>> ->118    │                              ~119    │120    └─ lib/combine/parsers/binary.ex:48:30: Combine.Parsers.Binary.bytes_impl/2121122    warning: the variable "size" (context Combine.Parsers.Binary) is accessed inside size(...) of a bitstring but it was defined outside of the match. You must precede it with the pin operator123    │124 70 │           <<int::big-unsigned-size(size), rest::bitstring>> ->125    │                                    ~126    │127    └─ lib/combine/parsers/binary.ex:70:36: Combine.Parsers.Binary.uint_impl/3128129    warning: the variable "size" (context Combine.Parsers.Binary) is accessed inside size(...) of a bitstring but it was defined outside of the match. You must precede it with the pin operator130    │131 77 │           <<int::little-unsigned-size(size), rest::bitstring>> ->132    │                                       ~133    │134    └─ lib/combine/parsers/binary.ex:77:39: Combine.Parsers.Binary.uint_impl/3135136     warning: the variable "size" (context Combine.Parsers.Binary) is accessed inside size(...) of a bitstring but it was defined outside of the match. You must precede it with the pin operator137     │138 101 │           <<int::big-signed-size(size), rest::bitstring>> ->139     │                                  ~140     │141     └─ lib/combine/parsers/binary.ex:101:34: Combine.Parsers.Binary.int_impl/3142143     warning: the variable "size" (context Combine.Parsers.Binary) is accessed inside size(...) of a bitstring but it was defined outside of the match. You must precede it with the pin operator144     │145 108 │           <<int::little-signed-size(size), rest::bitstring>> ->146     │                                     ~147     │148     └─ lib/combine/parsers/binary.ex:108:37: Combine.Parsers.Binary.int_impl/3149150     warning: the variable "size" (context Combine.Parsers.Binary) is accessed inside size(...) of a bitstring but it was defined outside of the match. You must precede it with the pin operator151     │152 128 │       <<num::float-size(size), rest::bitstring>> ->153     │                         ~154     │155     └─ lib/combine/parsers/binary.ex:128:25: Combine.Parsers.Binary.float_impl/2156157     warning: the variable "byte_size" (context Combine.Parsers.Text) is accessed inside size(...) of a bitstring but it was defined outside of the match. You must precede it with the pin operator158     │159 432 │         <<^expected::binary-size(byte_size), rest::binary>> ->160     │                                  ~161     │162     └─ lib/combine/parsers/text.ex:432:34: Combine.Parsers.Text.string_impl/2163164     warning: the following clause is redundant:165166         defp word_of_impl(%Combine.ParserState{...} = state, _pattern)167168     it has type:169170         dynamic(%Combine.ParserState{status: :ok}), dynamic()171172     previous clauses have already matched on the following types:173174         %Combine.ParserState{status: :error}, term()175         %Combine.ParserState{status: :ok}, term()176177     │178 488 │   defp word_of_impl(%ParserState{status: :ok} = state, _pattern) do179     │        ~180     │181     └─ lib/combine/parsers/text.ex:488:8: Combine.Parsers.Text.word_of_impl/2182183Generated combine app184==> circular_buffer185Compiling 1 file (.ex)186Generated circular_buffer app187==> tzdata188Compiling 18 files (.ex)189Generated tzdata app190==> csv191Compiling 7 files (.ex)192    warning: default arguments in protocol definitions is deprecated193    │194 11 │   def encode(data, env \\ [])195    │   ~~~~~~~~~~~~~~~~~~~~~~~~~~~196    │197    └─ lib/csv/encoding/encode.ex:11: CSV.Encode (module)198199    warning: protocols can only define functions without implementation via def/1, found: encode/1200    │201  1 │ defprotocol CSV.Encode do202    │ ~~~~~~~~~~~~~~~~~~~~~~~~~203    │204    └─ lib/csv/encoding/encode.ex:1: CSV.Encode (module)205206Generated csv app207==> tablet208Compiling 2 files (.ex)209Generated tablet app210==> elixir_make211Compiling 8 files (.ex)212Generated elixir_make app213==> nerves_logging214 CC kmsg_tailer.o215 LD kmsg_tailer216Compiling 5 files (.ex)217Generated nerves_logging app218==> exboost219c++ -I/usr/local/lib/erlang/erts-17.1/include -I/usr/local/include -fPIC -g -O3 -flto -mtune=generic -Wno-write-strings -D_LARGEFILE_SOURCE -D_LARGEFILE64_SOURCE -D_FILE_OFFSET_BITS=64 --sysroot /home/nerves/.nerves/artifacts/nerves_system_rpi4-2.1.2/staging aarch64 -c -o priv/boostnif.o priv/boostnif.c220In file included from /home/nerves/.nerves/artifacts/nerves_system_rpi4-2.1.2/staging/usr/include/math.h:37,221                 from /usr/include/c++/13/cmath:47,222                 from /usr/include/c++/13/complex:44,223                 from /home/nerves/.nerves/artifacts/nerves_system_rpi4-2.1.2/staging/usr/include/boost/math/special_functions/math_fwd.hpp:27,224                 from /home/nerves/.nerves/artifacts/nerves_system_rpi4-2.1.2/staging/usr/include/boost/math/special_functions/airy.hpp:11,225                 from /home/nerves/.nerves/artifacts/nerves_system_rpi4-2.1.2/staging/usr/include/boost/math/special_functions.hpp:15,226                 from priv/boostnif.c:32:227/home/nerves/.nerves/artifacts/nerves_system_rpi4-2.1.2/staging/usr/include/bits/math-vector.h:192:9: error: ‘__Float32x4_t’ does not name a type; did you mean ‘_Float32x’?228  192 | typedef __Float32x4_t __f32x4_t;229      |         ^~~~~~~~~~~~~230      |         _Float32x231/home/nerves/.nerves/artifacts/nerves_system_rpi4-2.1.2/staging/usr/include/bits/math-vector.h:193:9: error: ‘__Float64x2_t’ does not name a type; did you mean ‘_Float64x’?232  193 | typedef __Float64x2_t __f64x2_t;233      |         ^~~~~~~~~~~~~234      |         _Float64x235/home/nerves/.nerves/artifacts/nerves_system_rpi4-2.1.2/staging/usr/include/bits/math-vector.h:202:9: error: ‘__SVFloat32_t’ does not name a type; did you mean ‘_Float32x’?236  202 | typedef __SVFloat32_t __sv_f32_t;237      |         ^~~~~~~~~~~~~238      |         _Float32x239/home/nerves/.nerves/artifacts/nerves_system_rpi4-2.1.2/staging/usr/include/bits/math-vector.h:203:9: error: ‘__SVFloat64_t’ does not name a type; did you mean ‘_Float64x’?240  203 | typedef __SVFloat64_t __sv_f64_t;241      |         ^~~~~~~~~~~~~242      |         _Float64x243/home/nerves/.nerves/artifacts/nerves_system_rpi4-2.1.2/staging/usr/include/bits/math-vector.h:204:9: error: ‘__SVBool_t’ does not name a type244  204 | typedef __SVBool_t __sv_bool_t;245      |         ^~~~~~~~~~246/home/nerves/.nerves/artifacts/nerves_system_rpi4-2.1.2/staging/usr/include/bits/math-vector.h:214:8: error: ‘__f32x4_t’ does not name a type247  214 | __vpcs __f32x4_t _ZGVnN4vv_atan2f (__f32x4_t, __f32x4_t);248      |        ^~~~~~~~~249/home/nerves/.nerves/artifacts/nerves_system_rpi4-2.1.2/staging/usr/include/bits/math-vector.h:215:8: error: ‘__f32x4_t’ does not name a type250  215 | __vpcs __f32x4_t _ZGVnN4vv_atan2pif (__f32x4_t, __f32x4_t);251      |        ^~~~~~~~~252/home/nerves/.nerves/artifacts/nerves_system_rpi4-2.1.2/staging/usr/include/bits/math-vector.h:216:8: error: ‘__f32x4_t’ does not name a type253  216 | __vpcs __f32x4_t _ZGVnN4v_acosf (__f32x4_t);254      |        ^~~~~~~~~255/home/nerves/.nerves/artifacts/nerves_system_rpi4-2.1.2/staging/usr/include/bits/math-vector.h:217:8: error: ‘__f32x4_t’ does not name a type256  217 | __vpcs __f32x4_t _ZGVnN4v_acoshf (__f32x4_t);257      |        ^~~~~~~~~258/home/nerves/.nerves/artifacts/nerves_system_rpi4-2.1.2/staging/usr/include/bits/math-vector.h:218:8: error: ‘__f32x4_t’ does not name a type259  218 | __vpcs __f32x4_t _ZGVnN4v_acospif (__f32x4_t);260      |        ^~~~~~~~~261/home/nerves/.nerves/artifacts/nerves_system_rpi4-2.1.2/staging/usr/include/bits/math-vector.h:219:8: error: ‘__f32x4_t’ does not name a type262  219 | __vpcs __f32x4_t _ZGVnN4v_asinf (__f32x4_t);263      |        ^~~~~~~~~264/home/nerves/.nerves/artifacts/nerves_system_rpi4-2.1.2/staging/usr/include/bits/math-vector.h:220:8: error: ‘__f32x4_t’ does not name a type265  220 | __vpcs __f32x4_t _ZGVnN4v_asinhf (__f32x4_t);266      |        ^~~~~~~~~267/home/nerves/.nerves/artifacts/nerves_system_rpi4-2.1.2/staging/usr/include/bits/math-vector.h:221:8: error: ‘__f32x4_t’ does not name a type268  221 | __vpcs __f32x4_t _ZGVnN4v_asinpif (__f32x4_t);269      |        ^~~~~~~~~270/home/nerves/.nerves/artifacts/nerves_system_rpi4-2.1.2/staging/usr/include/bits/math-vector.h:222:8: error: ‘__f32x4_t’ does not name a type271  222 | __vpcs __f32x4_t _ZGVnN4v_atanf (__f32x4_t);272      |        ^~~~~~~~~273/home/nerves/.nerves/artifacts/nerves_system_rpi4-2.1.2/staging/usr/include/bits/math-vector.h:223:8: error: ‘__f32x4_t’ does not name a type274  223 | __vpcs __f32x4_t _ZGVnN4v_atanhf (__f32x4_t);275      |        ^~~~~~~~~276/home/nerves/.nerves/artifacts/nerves_system_rpi4-2.1.2/staging/usr/include/bits/math-vector.h:224:8: error: ‘__f32x4_t’ does not name a type277  224 | __vpcs __f32x4_t _ZGVnN4v_atanpif (__f32x4_t);278      |        ^~~~~~~~~279/home/nerves/.nerves/artifacts/nerves_system_rpi4-2.1.2/staging/usr/include/bits/math-vector.h:225:8: error: ‘__f32x4_t’ does not name a type280  225 | __vpcs __f32x4_t _ZGVnN4v_cbrtf (__f32x4_t);281      |        ^~~~~~~~~282/home/nerves/.nerves/artifacts/nerves_system_rpi4-2.1.2/staging/usr/include/bits/math-vector.h:226:8: error: ‘__f32x4_t’ does not name a type283  226 | __vpcs __f32x4_t _ZGVnN4v_cosf (__f32x4_t);284      |        ^~~~~~~~~285/home/nerves/.nerves/artifacts/nerves_system_rpi4-2.1.2/staging/usr/include/bits/math-vector.h:227:8: error: ‘__f32x4_t’ does not name a type286  227 | __vpcs __f32x4_t _ZGVnN4v_coshf (__f32x4_t);287      |        ^~~~~~~~~288/home/nerves/.nerves/artifacts/nerves_system_rpi4-2.1.2/staging/usr/include/bits/math-vector.h:228:8: error: ‘__f32x4_t’ does not name a type289  228 | __vpcs __f32x4_t _ZGVnN4v_cospif (__f32x4_t);290      |        ^~~~~~~~~291/home/nerves/.nerves/artifacts/nerves_system_rpi4-2.1.2/staging/usr/include/bits/math-vector.h:229:8: error: ‘__f32x4_t’ does not name a type292  229 | __vpcs __f32x4_t _ZGVnN4v_erff (__f32x4_t);293      |        ^~~~~~~~~294/home/nerves/.nerves/artifacts/nerves_system_rpi4-2.1.2/staging/usr/include/bits/math-vector.h:230:8: error: ‘__f32x4_t’ does not name a type295  230 | __vpcs __f32x4_t _ZGVnN4v_erfcf (__f32x4_t);296      |        ^~~~~~~~~297/home/nerves/.nerves/artifacts/nerves_system_rpi4-2.1.2/staging/usr/include/bits/math-vector.h:231:8: error: ‘__f32x4_t’ does not name a type298  231 | __vpcs __f32x4_t _ZGVnN4v_expf (__f32x4_t);299      |        ^~~~~~~~~300/home/nerves/.nerves/artifacts/nerves_system_rpi4-2.1.2/staging/usr/include/bits/math-vector.h:232:8: error: ‘__f32x4_t’ does not name a type301  232 | __vpcs __f32x4_t _ZGVnN4v_exp10f (__f32x4_t);302      |        ^~~~~~~~~303/home/nerves/.nerves/artifacts/nerves_system_rpi4-2.1.2/staging/usr/include/bits/math-vector.h:233:8: error: ‘__f32x4_t’ does not name a type304  233 | __vpcs __f32x4_t _ZGVnN4v_exp2f (__f32x4_t);305      |        ^~~~~~~~~306/home/nerves/.nerves/artifacts/nerves_system_rpi4-2.1.2/staging/usr/include/bits/math-vector.h:234:8: error: ‘__f32x4_t’ does not name a type307  234 | __vpcs __f32x4_t _ZGVnN4v_expm1f (__f32x4_t);308      |        ^~~~~~~~~309/home/nerves/.nerves/artifacts/nerves_system_rpi4-2.1.2/staging/usr/include/bits/math-vector.h:235:8: error: ‘__f32x4_t’ does not name a type310  235 | __vpcs __f32x4_t _ZGVnN4v_exp2m1f (__f32x4_t);311      |        ^~~~~~~~~312/home/nerves/.nerves/artifacts/nerves_system_rpi4-2.1.2/staging/usr/include/bits/math-vector.h:236:8: error: ‘__f32x4_t’ does not name a type313  236 | __vpcs __f32x4_t _ZGVnN4v_exp10m1f (__f32x4_t);314      |        ^~~~~~~~~315/home/nerves/.nerves/artifacts/nerves_system_rpi4-2.1.2/staging/usr/include/bits/math-vector.h:237:8: error: ‘__f32x4_t’ does not name a type316  237 | __vpcs __f32x4_t _ZGVnN4vv_hypotf (__f32x4_t, __f32x4_t);317      |        ^~~~~~~~~318/home/nerves/.nerves/artifacts/nerves_system_rpi4-2.1.2/staging/usr/include/bits/math-vector.h:238:8: error: ‘__f32x4_t’ does not name a type319  238 | __vpcs __f32x4_t _ZGVnN4v_logf (__f32x4_t);320      |        ^~~~~~~~~321/home/nerves/.nerves/artifacts/nerves_system_rpi4-2.1.2/staging/usr/include/bits/math-vector.h:239:8: error: ‘__f32x4_t’ does not name a type322  239 | __vpcs __f32x4_t _ZGVnN4v_log10f (__f32x4_t);323      |        ^~~~~~~~~324/home/nerves/.nerves/artifacts/nerves_system_rpi4-2.1.2/staging/usr/include/bits/math-vector.h:240:8: error: ‘__f32x4_t’ does not name a type325  240 | __vpcs __f32x4_t _ZGVnN4v_log10p1f (__f32x4_t);326      |        ^~~~~~~~~327/home/nerves/.nerves/artifacts/nerves_system_rpi4-2.1.2/staging/usr/include/bits/math-vector.h:241:8: error: ‘__f32x4_t’ does not name a type328  241 | __vpcs __f32x4_t _ZGVnN4v_log1pf (__f32x4_t);329      |        ^~~~~~~~~330/home/nerves/.nerves/artifacts/nerves_system_rpi4-2.1.2/staging/usr/include/bits/math-vector.h:242:8: error: ‘__f32x4_t’ does not name a type331  242 | __vpcs __f32x4_t _ZGVnN4v_log2f (__f32x4_t);332      |        ^~~~~~~~~333/home/nerves/.nerves/artifacts/nerves_system_rpi4-2.1.2/staging/usr/include/bits/math-vector.h:243:8: error: ‘__f32x4_t’ does not name a type334  243 | __vpcs __f32x4_t _ZGVnN4v_log2p1f (__f32x4_t);335      |        ^~~~~~~~~336/home/nerves/.nerves/artifacts/nerves_system_rpi4-2.1.2/staging/usr/include/bits/math-vector.h:244:8: error: ‘__f32x4_t’ does not name a type337  244 | __vpcs __f32x4_t _ZGVnN4v_logp1f (__f32x4_t);338      |        ^~~~~~~~~339/home/nerves/.nerves/artifacts/nerves_system_rpi4-2.1.2/staging/usr/include/bits/math-vector.h:245:8: error: ‘__f32x4_t’ does not name a type340  245 | __vpcs __f32x4_t _ZGVnN4vv_powf (__f32x4_t, __f32x4_t);341      |        ^~~~~~~~~342/home/nerves/.nerves/artifacts/nerves_system_rpi4-2.1.2/staging/usr/include/bits/math-vector.h:246:8: error: ‘__f32x4_t’ does not name a type343  246 | __vpcs __f32x4_t _ZGVnN4v_rsqrtf (__f32x4_t);344      |        ^~~~~~~~~345/home/nerves/.nerves/artifacts/nerves_system_rpi4-2.1.2/staging/usr/include/bits/math-vector.h:247:8: error: ‘__f32x4_t’ does not name a type346  247 | __vpcs __f32x4_t _ZGVnN4v_sinf (__f32x4_t);347      |        ^~~~~~~~~348/home/nerves/.nerves/artifacts/nerves_system_rpi4-2.1.2/staging/usr/include/bits/math-vector.h:248:8: error: ‘__f32x4_t’ does not name a type349  248 | __vpcs __f32x4_t _ZGVnN4v_sinhf (__f32x4_t);350      |        ^~~~~~~~~351/home/nerves/.nerves/artifacts/nerves_system_rpi4-2.1.2/staging/usr/include/bits/math-vector.h:249:8: error: ‘__f32x4_t’ does not name a type352  249 | __vpcs __f32x4_t _ZGVnN4v_sinpif (__f32x4_t);353      |        ^~~~~~~~~354/home/nerves/.nerves/artifacts/nerves_system_rpi4-2.1.2/staging/usr/include/bits/math-vector.h:250:8: error: ‘__f32x4_t’ does not name a type355  250 | __vpcs __f32x4_t _ZGVnN4v_tanf (__f32x4_t);356      |        ^~~~~~~~~357/home/nerves/.nerves/artifacts/nerves_system_rpi4-2.1.2/staging/usr/include/bits/math-vector.h:251:8: error: ‘__f32x4_t’ does not name a type358  251 | __vpcs __f32x4_t _ZGVnN4v_tanhf (__f32x4_t);359      |        ^~~~~~~~~360/home/nerves/.nerves/artifacts/nerves_system_rpi4-2.1.2/staging/usr/include/bits/math-vector.h:252:8: error: ‘__f32x4_t’ does not name a type361  252 | __vpcs __f32x4_t _ZGVnN4v_tanpif (__f32x4_t);362      |        ^~~~~~~~~363/home/nerves/.nerves/artifacts/nerves_system_rpi4-2.1.2/staging/usr/include/bits/math-vector.h:254:8: error: ‘__f64x2_t’ does not name a type364  254 | __vpcs __f64x2_t _ZGVnN2vv_atan2 (__f64x2_t, __f64x2_t);365      |        ^~~~~~~~~366/home/nerves/.nerves/artifacts/nerves_system_rpi4-2.1.2/staging/usr/include/bits/math-vector.h:255:8: error: ‘__f64x2_t’ does not name a type367  255 | __vpcs __f64x2_t _ZGVnN2vv_atan2pi (__f64x2_t, __f64x2_t);368      |        ^~~~~~~~~369/home/nerves/.nerves/artifacts/nerves_system_rpi4-2.1.2/staging/usr/include/bits/math-vector.h:256:8: error: ‘__f64x2_t’ does not name a type370  256 | __vpcs __f64x2_t _ZGVnN2v_acos (__f64x2_t);371      |        ^~~~~~~~~372/home/nerves/.nerves/artifacts/nerves_system_rpi4-2.1.2/staging/usr/include/bits/math-vector.h:257:8: error: ‘__f64x2_t’ does not name a type373  257 | __vpcs __f64x2_t _ZGVnN2v_acosh (__f64x2_t);374      |        ^~~~~~~~~375/home/nerves/.nerves/artifacts/nerves_system_rpi4-2.1.2/staging/usr/include/bits/math-vector.h:258:8: error: ‘__f64x2_t’ does not name a type376  258 | __vpcs __f64x2_t _ZGVnN2v_acospi (__f64x2_t);377      |        ^~~~~~~~~378/home/nerves/.nerves/artifacts/nerves_system_rpi4-2.1.2/staging/usr/include/bits/math-vector.h:259:8: error: ‘__f64x2_t’ does not name a type379  259 | __vpcs __f64x2_t _ZGVnN2v_asin (__f64x2_t);380      |        ^~~~~~~~~381/home/nerves/.nerves/artifacts/nerves_system_rpi4-2.1.2/staging/usr/include/bits/math-vector.h:260:8: error: ‘__f64x2_t’ does not name a type382  260 | __vpcs __f64x2_t _ZGVnN2v_asinh (__f64x2_t);383      |        ^~~~~~~~~384/home/nerves/.nerves/artifacts/nerves_system_rpi4-2.1.2/staging/usr/include/bits/math-vector.h:261:8: error: ‘__f64x2_t’ does not name a type385  261 | __vpcs __f64x2_t _ZGVnN2v_asinpi (__f64x2_t);386      |        ^~~~~~~~~387/home/nerves/.nerves/artifacts/nerves_system_rpi4-2.1.2/staging/usr/include/bits/math-vector.h:262:8: error: ‘__f64x2_t’ does not name a type388  262 | __vpcs __f64x2_t _ZGVnN2v_atan (__f64x2_t);389      |        ^~~~~~~~~390/home/nerves/.nerves/artifacts/nerves_system_rpi4-2.1.2/staging/usr/include/bits/math-vector.h:263:8: error: ‘__f64x2_t’ does not name a type391  263 | __vpcs __f64x2_t _ZGVnN2v_atanh (__f64x2_t);392      |        ^~~~~~~~~393/home/nerves/.nerves/artifacts/nerves_system_rpi4-2.1.2/staging/usr/include/bits/math-vector.h:264:8: error: ‘__f64x2_t’ does not name a type394  264 | __vpcs __f64x2_t _ZGVnN2v_atanpi (__f64x2_t);395      |        ^~~~~~~~~396/home/nerves/.nerves/artifacts/nerves_system_rpi4-2.1.2/staging/usr/include/bits/math-vector.h:265:8: error: ‘__f64x2_t’ does not name a type397  265 | __vpcs __f64x2_t _ZGVnN2v_cbrt (__f64x2_t);398      |        ^~~~~~~~~399/home/nerves/.nerves/artifacts/nerves_system_rpi4-2.1.2/staging/usr/include/bits/math-vector.h:266:8: error: ‘__f64x2_t’ does not name a type400  266 | __vpcs __f64x2_t _ZGVnN2v_cos (__f64x2_t);401      |        ^~~~~~~~~402/home/nerves/.nerves/artifacts/nerves_system_rpi4-2.1.2/staging/usr/include/bits/math-vector.h:267:8: error: ‘__f64x2_t’ does not name a type403  267 | __vpcs __f64x2_t _ZGVnN2v_cosh (__f64x2_t);404      |        ^~~~~~~~~405/home/nerves/.nerves/artifacts/nerves_system_rpi4-2.1.2/staging/usr/include/bits/math-vector.h:268:8: error: ‘__f64x2_t’ does not name a type406  268 | __vpcs __f64x2_t _ZGVnN2v_cospi (__f64x2_t);407      |        ^~~~~~~~~408/home/nerves/.nerves/artifacts/nerves_system_rpi4-2.1.2/staging/usr/include/bits/math-vector.h:269:8: error: ‘__f64x2_t’ does not name a type409  269 | __vpcs __f64x2_t _ZGVnN2v_erf (__f64x2_t);410      |        ^~~~~~~~~411/home/nerves/.nerves/artifacts/nerves_system_rpi4-2.1.2/staging/usr/include/bits/math-vector.h:270:8: error: ‘__f64x2_t’ does not name a type412  270 | __vpcs __f64x2_t _ZGVnN2v_erfc (__f64x2_t);413      |        ^~~~~~~~~414/home/nerves/.nerves/artifacts/nerves_system_rpi4-2.1.2/staging/usr/include/bits/math-vector.h:271:8: error: ‘__f64x2_t’ does not name a type415  271 | __vpcs __f64x2_t _ZGVnN2v_exp (__f64x2_t);416      |        ^~~~~~~~~417/home/nerves/.nerves/artifacts/nerves_system_rpi4-2.1.2/staging/usr/include/bits/math-vector.h:272:8: error: ‘__f64x2_t’ does not name a type418  272 | __vpcs __f64x2_t _ZGVnN2v_exp10 (__f64x2_t);419      |        ^~~~~~~~~420/home/nerves/.nerves/artifacts/nerves_system_rpi4-2.1.2/staging/usr/include/bits/math-vector.h:273:8: error: ‘__f64x2_t’ does not name a type421  273 | __vpcs __f64x2_t _ZGVnN2v_exp2 (__f64x2_t);422      |        ^~~~~~~~~423/home/nerves/.nerves/artifacts/nerves_system_rpi4-2.1.2/staging/usr/include/bits/math-vector.h:274:8: error: ‘__f64x2_t’ does not name a type424  274 | __vpcs __f64x2_t _ZGVnN2v_expm1 (__f64x2_t);425      |        ^~~~~~~~~426/home/nerves/.nerves/artifacts/nerves_system_rpi4-2.1.2/staging/usr/include/bits/math-vector.h:275:8: error: ‘__f64x2_t’ does not name a type427  275 | __vpcs __f64x2_t _ZGVnN2v_exp2m1 (__f64x2_t);428      |        ^~~~~~~~~429/home/nerves/.nerves/artifacts/nerves_system_rpi4-2.1.2/staging/usr/include/bits/math-vector.h:276:8: error: ‘__f64x2_t’ does not name a type430  276 | __vpcs __f64x2_t _ZGVnN2v_exp10m1 (__f64x2_t);431      |        ^~~~~~~~~432/home/nerves/.nerves/artifacts/nerves_system_rpi4-2.1.2/staging/usr/include/bits/math-vector.h:277:8: error: ‘__f64x2_t’ does not name a type433  277 | __vpcs __f64x2_t _ZGVnN2vv_hypot (__f64x2_t, __f64x2_t);434      |        ^~~~~~~~~435/home/nerves/.nerves/artifacts/nerves_system_rpi4-2.1.2/staging/usr/include/bits/math-vector.h:278:8: error: ‘__f64x2_t’ does not name a type436  278 | __vpcs __f64x2_t _ZGVnN2v_log (__f64x2_t);437      |        ^~~~~~~~~438/home/nerves/.nerves/artifacts/nerves_system_rpi4-2.1.2/staging/usr/include/bits/math-vector.h:279:8: error: ‘__f64x2_t’ does not name a type439  279 | __vpcs __f64x2_t _ZGVnN2v_log10 (__f64x2_t);440      |        ^~~~~~~~~441/home/nerves/.nerves/artifacts/nerves_system_rpi4-2.1.2/staging/usr/include/bits/math-vector.h:280:8: error: ‘__f64x2_t’ does not name a type442  280 | __vpcs __f64x2_t _ZGVnN2v_log10p1 (__f64x2_t);443      |        ^~~~~~~~~444/home/nerves/.nerves/artifacts/nerves_system_rpi4-2.1.2/staging/usr/include/bits/math-vector.h:281:8: error: ‘__f64x2_t’ does not name a type445  281 | __vpcs __f64x2_t _ZGVnN2v_log1p (__f64x2_t);446      |        ^~~~~~~~~447/home/nerves/.nerves/artifacts/nerves_system_rpi4-2.1.2/staging/usr/include/bits/math-vector.h:282:8: error: ‘__f64x2_t’ does not name a type448  282 | __vpcs __f64x2_t _ZGVnN2v_log2 (__f64x2_t);449      |        ^~~~~~~~~450/home/nerves/.nerves/artifacts/nerves_system_rpi4-2.1.2/staging/usr/include/bits/math-vector.h:283:8: error: ‘__f64x2_t’ does not name a type451  283 | __vpcs __f64x2_t _ZGVnN2v_log2p1 (__f64x2_t);452      |        ^~~~~~~~~453/home/nerves/.nerves/artifacts/nerves_system_rpi4-2.1.2/staging/usr/include/bits/math-vector.h:284:8: error: ‘__f64x2_t’ does not name a type454  284 | __vpcs __f64x2_t _ZGVnN2v_logp1 (__f64x2_t);455      |        ^~~~~~~~~456/home/nerves/.nerves/artifacts/nerves_system_rpi4-2.1.2/staging/usr/include/bits/math-vector.h:285:8: error: ‘__f64x2_t’ does not name a type457  285 | __vpcs __f64x2_t _ZGVnN2vv_pow (__f64x2_t, __f64x2_t);458      |        ^~~~~~~~~459/home/nerves/.nerves/artifacts/nerves_system_rpi4-2.1.2/staging/usr/include/bits/math-vector.h:286:8: error: ‘__f64x2_t’ does not name a type460  286 | __vpcs __f64x2_t _ZGVnN2v_rsqrt (__f64x2_t);461      |        ^~~~~~~~~462/home/nerves/.nerves/artifacts/nerves_system_rpi4-2.1.2/staging/usr/include/bits/math-vector.h:287:8: error: ‘__f64x2_t’ does not name a type463  287 | __vpcs __f64x2_t _ZGVnN2v_sin (__f64x2_t);464      |        ^~~~~~~~~465/home/nerves/.nerves/artifacts/nerves_system_rpi4-2.1.2/staging/usr/include/bits/math-vector.h:288:8: error: ‘__f64x2_t’ does not name a type466  288 | __vpcs __f64x2_t _ZGVnN2v_sinh (__f64x2_t);467      |        ^~~~~~~~~468/home/nerves/.nerves/artifacts/nerves_system_rpi4-2.1.2/staging/usr/include/bits/math-vector.h:289:8: error: ‘__f64x2_t’ does not name a type469  289 | __vpcs __f64x2_t _ZGVnN2v_sinpi (__f64x2_t);470      |        ^~~~~~~~~471/home/nerves/.nerves/artifacts/nerves_system_rpi4-2.1.2/staging/usr/include/bits/math-vector.h:290:8: error: ‘__f64x2_t’ does not name a type472  290 | __vpcs __f64x2_t _ZGVnN2v_tan (__f64x2_t);473      |        ^~~~~~~~~474/home/nerves/.nerves/artifacts/nerves_system_rpi4-2.1.2/staging/usr/include/bits/math-vector.h:291:8: error: ‘__f64x2_t’ does not name a type475  291 | __vpcs __f64x2_t _ZGVnN2v_tanh (__f64x2_t);476      |        ^~~~~~~~~477/home/nerves/.nerves/artifacts/nerves_system_rpi4-2.1.2/staging/usr/include/bits/math-vector.h:292:8: error: ‘__f64x2_t’ does not name a type478  292 | __vpcs __f64x2_t _ZGVnN2v_tanpi (__f64x2_t);479      |        ^~~~~~~~~480/home/nerves/.nerves/artifacts/nerves_system_rpi4-2.1.2/staging/usr/include/bits/math-vector.h:299:1: error: ‘__sv_f32_t’ does not name a type481  299 | __sv_f32_t _ZGVsMxvv_atan2f (__sv_f32_t, __sv_f32_t, __sv_bool_t);482      | ^~~~~~~~~~483/home/nerves/.nerves/artifacts/nerves_system_rpi4-2.1.2/staging/usr/include/bits/math-vector.h:300:1: error: ‘__sv_f32_t’ does not name a type484  300 | __sv_f32_t _ZGVsMxvv_atan2pif (__sv_f32_t, __sv_f32_t, __sv_bool_t);485      | ^~~~~~~~~~486/home/nerves/.nerves/artifacts/nerves_system_rpi4-2.1.2/staging/usr/include/bits/math-vector.h:301:1: error: ‘__sv_f32_t’ does not name a type487  301 | __sv_f32_t _ZGVsMxv_acosf (__sv_f32_t, __sv_bool_t);488      | ^~~~~~~~~~489/home/nerves/.nerves/artifacts/nerves_system_rpi4-2.1.2/staging/usr/include/bits/math-vector.h:302:1: error: ‘__sv_f32_t’ does not name a type490  302 | __sv_f32_t _ZGVsMxv_acoshf (__sv_f32_t, __sv_bool_t);491      | ^~~~~~~~~~492/home/nerves/.nerves/artifacts/nerves_system_rpi4-2.1.2/staging/usr/include/bits/math-vector.h:303:1: error: ‘__sv_f32_t’ does not name a type493  303 | __sv_f32_t _ZGVsMxv_acospif (__sv_f32_t, __sv_bool_t);494      | ^~~~~~~~~~495/home/nerves/.nerves/artifacts/nerves_system_rpi4-2.1.2/staging/usr/include/bits/math-vector.h:304:1: error: ‘__sv_f32_t’ does not name a type496  304 | __sv_f32_t _ZGVsMxv_asinf (__sv_f32_t, __sv_bool_t);497      | ^~~~~~~~~~498/home/nerves/.nerves/artifacts/nerves_system_rpi4-2.1.2/staging/usr/include/bits/math-vector.h:305:1: error: ‘__sv_f32_t’ does not name a type499  305 | __sv_f32_t _ZGVsMxv_asinhf (__sv_f32_t, __sv_bool_t);500      | ^~~~~~~~~~501/home/nerves/.nerves/artifacts/nerves_system_rpi4-2.1.2/staging/usr/include/bits/math-vector.h:306:1: error: ‘__sv_f32_t’ does not name a type502  306 | __sv_f32_t _ZGVsMxv_asinpif (__sv_f32_t, __sv_bool_t);503      | ^~~~~~~~~~504/home/nerves/.nerves/artifacts/nerves_system_rpi4-2.1.2/staging/usr/include/bits/math-vector.h:307:1: error: ‘__sv_f32_t’ does not name a type505  307 | __sv_f32_t _ZGVsMxv_atanf (__sv_f32_t, __sv_bool_t);506      | ^~~~~~~~~~507/home/nerves/.nerves/artifacts/nerves_system_rpi4-2.1.2/staging/usr/include/bits/math-vector.h:308:1: error: ‘__sv_f32_t’ does not name a type508  308 | __sv_f32_t _ZGVsMxv_atanhf (__sv_f32_t, __sv_bool_t);509      | ^~~~~~~~~~510/home/nerves/.nerves/artifacts/nerves_system_rpi4-2.1.2/staging/usr/include/bits/math-vector.h:309:1: error: ‘__sv_f32_t’ does not name a type511  309 | __sv_f32_t _ZGVsMxv_atanpif (__sv_f32_t, __sv_bool_t);512      | ^~~~~~~~~~513/home/nerves/.nerves/artifacts/nerves_system_rpi4-2.1.2/staging/usr/include/bits/math-vector.h:310:1: error: ‘__sv_f32_t’ does not name a type514  310 | __sv_f32_t _ZGVsMxv_cbrtf (__sv_f32_t, __sv_bool_t);515      | ^~~~~~~~~~516/home/nerves/.nerves/artifacts/nerves_system_rpi4-2.1.2/staging/usr/include/bits/math-vector.h:311:1: error: ‘__sv_f32_t’ does not name a type517  311 | __sv_f32_t _ZGVsMxv_cosf (__sv_f32_t, __sv_bool_t);518      | ^~~~~~~~~~519/home/nerves/.nerves/artifacts/nerves_system_rpi4-2.1.2/staging/usr/include/bits/math-vector.h:312:1: error: ‘__sv_f32_t’ does not name a type520  312 | __sv_f32_t _ZGVsMxv_coshf (__sv_f32_t, __sv_bool_t);521      | ^~~~~~~~~~522/home/nerves/.nerves/artifacts/nerves_system_rpi4-2.1.2/staging/usr/include/bits/math-vector.h:313:1: error: ‘__sv_f32_t’ does not name a type523  313 | __sv_f32_t _ZGVsMxv_cospif (__sv_f32_t, __sv_bool_t);524      | ^~~~~~~~~~525/home/nerves/.nerves/artifacts/nerves_system_rpi4-2.1.2/staging/usr/include/bits/math-vector.h:314:1: error: ‘__sv_f32_t’ does not name a type526  314 | __sv_f32_t _ZGVsMxv_erff (__sv_f32_t, __sv_bool_t);527      | ^~~~~~~~~~528/home/nerves/.nerves/artifacts/nerves_system_rpi4-2.1.2/staging/usr/include/bits/math-vector.h:315:1: error: ‘__sv_f32_t’ does not name a type529  315 | __sv_f32_t _ZGVsMxv_erfcf (__sv_f32_t, __sv_bool_t);530      | ^~~~~~~~~~531/home/nerves/.nerves/artifacts/nerves_system_rpi4-2.1.2/staging/usr/include/bits/math-vector.h:316:1: error: ‘__sv_f32_t’ does not name a type532  316 | __sv_f32_t _ZGVsMxv_expf (__sv_f32_t, __sv_bool_t);533      | ^~~~~~~~~~534/home/nerves/.nerves/artifacts/nerves_system_rpi4-2.1.2/staging/usr/include/bits/math-vector.h:317:1: error: ‘__sv_f32_t’ does not name a type535  317 | __sv_f32_t _ZGVsMxv_exp10f (__sv_f32_t, __sv_bool_t);536      | ^~~~~~~~~~537/home/nerves/.nerves/artifacts/nerves_system_rpi4-2.1.2/staging/usr/include/bits/math-vector.h:318:1: error: ‘__sv_f32_t’ does not name a type538  318 | __sv_f32_t _ZGVsMxv_exp2f (__sv_f32_t, __sv_bool_t);539      | ^~~~~~~~~~540/home/nerves/.nerves/artifacts/nerves_system_rpi4-2.1.2/staging/usr/include/bits/math-vector.h:319:1: error: ‘__sv_f32_t’ does not name a type541  319 | __sv_f32_t _ZGVsMxv_expm1f (__sv_f32_t, __sv_bool_t);542      | ^~~~~~~~~~543/home/nerves/.nerves/artifacts/nerves_system_rpi4-2.1.2/staging/usr/include/bits/math-vector.h:320:1: error: ‘__sv_f32_t’ does not name a type544  320 | __sv_f32_t _ZGVsMxv_exp2m1f (__sv_f32_t, __sv_bool_t);545      | ^~~~~~~~~~546/home/nerves/.nerves/artifacts/nerves_system_rpi4-2.1.2/staging/usr/include/bits/math-vector.h:321:1: error: ‘__sv_f32_t’ does not name a type547  321 | __sv_f32_t _ZGVsMxv_exp10m1f (__sv_f32_t, __sv_bool_t);548      | ^~~~~~~~~~549/home/nerves/.nerves/artifacts/nerves_system_rpi4-2.1.2/staging/usr/include/bits/math-vector.h:322:1: error: ‘__sv_f32_t’ does not name a type550  322 | __sv_f32_t _ZGVsMxvv_hypotf (__sv_f32_t, __sv_f32_t, __sv_bool_t);551      | ^~~~~~~~~~552/home/nerves/.nerves/artifacts/nerves_system_rpi4-2.1.2/staging/usr/include/bits/math-vector.h:323:1: error: ‘__sv_f32_t’ does not name a type553  323 | __sv_f32_t _ZGVsMxv_logf (__sv_f32_t, __sv_bool_t);554      | ^~~~~~~~~~555/home/nerves/.nerves/artifacts/nerves_system_rpi4-2.1.2/staging/usr/include/bits/math-vector.h:324:1: error: ‘__sv_f32_t’ does not name a type556  324 | __sv_f32_t _ZGVsMxv_log10f (__sv_f32_t, __sv_bool_t);557      | ^~~~~~~~~~558/home/nerves/.nerves/artifacts/nerves_system_rpi4-2.1.2/staging/usr/include/bits/math-vector.h:325:1: error: ‘__sv_f32_t’ does not name a type559  325 | __sv_f32_t _ZGVsMxv_log10p1f (__sv_f32_t, __sv_bool_t);560      | ^~~~~~~~~~561/home/nerves/.nerves/artifacts/nerves_system_rpi4-2.1.2/staging/usr/include/bits/math-vector.h:326:1: error: ‘__sv_f32_t’ does not name a type562  326 | __sv_f32_t _ZGVsMxv_log1pf (__sv_f32_t, __sv_bool_t);563      | ^~~~~~~~~~564/home/nerves/.nerves/artifacts/nerves_system_rpi4-2.1.2/staging/usr/include/bits/math-vector.h:327:1: error: ‘__sv_f32_t’ does not name a type565  327 | __sv_f32_t _ZGVsMxv_log2f (__sv_f32_t, __sv_bool_t);566      | ^~~~~~~~~~567/home/nerves/.nerves/artifacts/nerves_system_rpi4-2.1.2/staging/usr/include/bits/math-vector.h:328:1: error: ‘__sv_f32_t’ does not name a type568  328 | __sv_f32_t _ZGVsMxv_log2p1f (__sv_f32_t, __sv_bool_t);569      | ^~~~~~~~~~570/home/nerves/.nerves/artifacts/nerves_system_rpi4-2.1.2/staging/usr/include/bits/math-vector.h:329:1: error: ‘__sv_f32_t’ does not name a type571  329 | __sv_f32_t _ZGVsMxv_logp1f (__sv_f32_t, __sv_bool_t);572      | ^~~~~~~~~~573/home/nerves/.nerves/artifacts/nerves_system_rpi4-2.1.2/staging/usr/include/bits/math-vector.h:330:1: error: ‘__sv_f32_t’ does not name a type574  330 | __sv_f32_t _ZGVsMxvv_powf (__sv_f32_t, __sv_f32_t, __sv_bool_t);575      | ^~~~~~~~~~576/home/nerves/.nerves/artifacts/nerves_system_rpi4-2.1.2/staging/usr/include/bits/math-vector.h:331:1: error: ‘__sv_f32_t’ does not name a type577  331 | __sv_f32_t _ZGVsMxv_rsqrtf (__sv_f32_t, __sv_bool_t);578      | ^~~~~~~~~~579/home/nerves/.nerves/artifacts/nerves_system_rpi4-2.1.2/staging/usr/include/bits/math-vector.h:332:1: error: ‘__sv_f32_t’ does not name a type580  332 | __sv_f32_t _ZGVsMxv_sinf (__sv_f32_t, __sv_bool_t);581      | ^~~~~~~~~~582/home/nerves/.nerves/artifacts/nerves_system_rpi4-2.1.2/staging/usr/include/bits/math-vector.h:333:1: error: ‘__sv_f32_t’ does not name a type583  333 | __sv_f32_t _ZGVsMxv_sinhf (__sv_f32_t, __sv_bool_t);584      | ^~~~~~~~~~585/home/nerves/.nerves/artifacts/nerves_system_rpi4-2.1.2/staging/usr/include/bits/math-vector.h:334:1: error: ‘__sv_f32_t’ does not name a type586  334 | __sv_f32_t _ZGVsMxv_sinpif (__sv_f32_t, __sv_bool_t);587      | ^~~~~~~~~~588/home/nerves/.nerves/artifacts/nerves_system_rpi4-2.1.2/staging/usr/include/bits/math-vector.h:335:1: error: ‘__sv_f32_t’ does not name a type589  335 | __sv_f32_t _ZGVsMxv_tanf (__sv_f32_t, __sv_bool_t);590      | ^~~~~~~~~~591/home/nerves/.nerves/artifacts/nerves_system_rpi4-2.1.2/staging/usr/include/bits/math-vector.h:336:1: error: ‘__sv_f32_t’ does not name a type592  336 | __sv_f32_t _ZGVsMxv_tanhf (__sv_f32_t, __sv_bool_t);593      | ^~~~~~~~~~594/home/nerves/.nerves/artifacts/nerves_system_rpi4-2.1.2/staging/usr/include/bits/math-vector.h:337:1: error: ‘__sv_f32_t’ does not name a type595  337 | __sv_f32_t _ZGVsMxv_tanpif (__sv_f32_t, __sv_bool_t);596      | ^~~~~~~~~~597/home/nerves/.nerves/artifacts/nerves_system_rpi4-2.1.2/staging/usr/include/bits/math-vector.h:339:1: error: ‘__sv_f64_t’ does not name a type; did you mean ‘__off64_t’?598  339 | __sv_f64_t _ZGVsMxvv_atan2 (__sv_f64_t, __sv_f64_t, __sv_bool_t);599      | ^~~~~~~~~~600      | __off64_t601/home/nerves/.nerves/artifacts/nerves_system_rpi4-2.1.2/staging/usr/include/bits/math-vector.h:340:1: error: ‘__sv_f64_t’ does not name a type; did you mean ‘__off64_t’?602  340 | __sv_f64_t _ZGVsMxvv_atan2pi (__sv_f64_t, __sv_f64_t, __sv_bool_t);603      | ^~~~~~~~~~604      | __off64_t605/home/nerves/.nerves/artifacts/nerves_system_rpi4-2.1.2/staging/usr/include/bits/math-vector.h:341:1: error: ‘__sv_f64_t’ does not name a type; did you mean ‘__off64_t’?606  341 | __sv_f64_t _ZGVsMxv_acos (__sv_f64_t, __sv_bool_t);607      | ^~~~~~~~~~608      | __off64_t609/home/nerves/.nerves/artifacts/nerves_system_rpi4-2.1.2/staging/usr/include/bits/math-vector.h:342:1: error: ‘__sv_f64_t’ does not name a type; did you mean ‘__off64_t’?610  342 | __sv_f64_t _ZGVsMxv_acosh (__sv_f64_t, __sv_bool_t);611      | ^~~~~~~~~~612      | __off64_t613/home/nerves/.nerves/artifacts/nerves_system_rpi4-2.1.2/staging/usr/include/bits/math-vector.h:343:1: error: ‘__sv_f64_t’ does not name a type; did you mean ‘__off64_t’?614  343 | __sv_f64_t _ZGVsMxv_acospi (__sv_f64_t, __sv_bool_t);615      | ^~~~~~~~~~616      | __off64_t617/home/nerves/.nerves/artifacts/nerves_system_rpi4-2.1.2/staging/usr/include/bits/math-vector.h:344:1: error: ‘__sv_f64_t’ does not name a type; did you mean ‘__off64_t’?618  344 | __sv_f64_t _ZGVsMxv_asin (__sv_f64_t, __sv_bool_t);619      | ^~~~~~~~~~620      | __off64_t621/home/nerves/.nerves/artifacts/nerves_system_rpi4-2.1.2/staging/usr/include/bits/math-vector.h:345:1: error: ‘__sv_f64_t’ does not name a type; did you mean ‘__off64_t’?622  345 | __sv_f64_t _ZGVsMxv_asinh (__sv_f64_t, __sv_bool_t);623      | ^~~~~~~~~~624      | __off64_t625/home/nerves/.nerves/artifacts/nerves_system_rpi4-2.1.2/staging/usr/include/bits/math-vector.h:346:1: error: ‘__sv_f64_t’ does not name a type; did you mean ‘__off64_t’?626  346 | __sv_f64_t _ZGVsMxv_asinpi (__sv_f64_t, __sv_bool_t);627      | ^~~~~~~~~~628      | __off64_t629/home/nerves/.nerves/artifacts/nerves_system_rpi4-2.1.2/staging/usr/include/bits/math-vector.h:347:1: error: ‘__sv_f64_t’ does not name a type; did you mean ‘__off64_t’?630  347 | __sv_f64_t _ZGVsMxv_atan (__sv_f64_t, __sv_bool_t);631      | ^~~~~~~~~~632      | __off64_t633/home/nerves/.nerves/artifacts/nerves_system_rpi4-2.1.2/staging/usr/include/bits/math-vector.h:348:1: error: ‘__sv_f64_t’ does not name a type; did you mean ‘__off64_t’?634  348 | __sv_f64_t _ZGVsMxv_atanh (__sv_f64_t, __sv_bool_t);635      | ^~~~~~~~~~636      | __off64_t637/home/nerves/.nerves/artifacts/nerves_system_rpi4-2.1.2/staging/usr/include/bits/math-vector.h:349:1: error: ‘__sv_f64_t’ does not name a type; did you mean ‘__off64_t’?638  349 | __sv_f64_t _ZGVsMxv_atanpi (__sv_f64_t, __sv_bool_t);639      | ^~~~~~~~~~640      | __off64_t641/home/nerves/.nerves/artifacts/nerves_system_rpi4-2.1.2/staging/usr/include/bits/math-vector.h:350:1: error: ‘__sv_f64_t’ does not name a type; did you mean ‘__off64_t’?642  350 | __sv_f64_t _ZGVsMxv_cbrt (__sv_f64_t, __sv_bool_t);643      | ^~~~~~~~~~644      | __off64_t645/home/nerves/.nerves/artifacts/nerves_system_rpi4-2.1.2/staging/usr/include/bits/math-vector.h:351:1: error: ‘__sv_f64_t’ does not name a type; did you mean ‘__off64_t’?646  351 | __sv_f64_t _ZGVsMxv_cos (__sv_f64_t, __sv_bool_t);647      | ^~~~~~~~~~648      | __off64_t649/home/nerves/.nerves/artifacts/nerves_system_rpi4-2.1.2/staging/usr/include/bits/math-vector.h:352:1: error: ‘__sv_f64_t’ does not name a type; did you mean ‘__off64_t’?650  352 | __sv_f64_t _ZGVsMxv_cosh (__sv_f64_t, __sv_bool_t);651      | ^~~~~~~~~~652      | __off64_t653/home/nerves/.nerves/artifacts/nerves_system_rpi4-2.1.2/staging/usr/include/bits/math-vector.h:353:1: error: ‘__sv_f64_t’ does not name a type; did you mean ‘__off64_t’?654  353 | __sv_f64_t _ZGVsMxv_cospi (__sv_f64_t, __sv_bool_t);655      | ^~~~~~~~~~656      | __off64_t657/home/nerves/.nerves/artifacts/nerves_system_rpi4-2.1.2/staging/usr/include/bits/math-vector.h:354:1: error: ‘__sv_f64_t’ does not name a type; did you mean ‘__off64_t’?658  354 | __sv_f64_t _ZGVsMxv_erf (__sv_f64_t, __sv_bool_t);659      | ^~~~~~~~~~660      | __off64_t661/home/nerves/.nerves/artifacts/nerves_system_rpi4-2.1.2/staging/usr/include/bits/math-vector.h:355:1: error: ‘__sv_f64_t’ does not name a type; did you mean ‘__off64_t’?662  355 | __sv_f64_t _ZGVsMxv_erfc (__sv_f64_t, __sv_bool_t);663      | ^~~~~~~~~~664      | __off64_t665/home/nerves/.nerves/artifacts/nerves_system_rpi4-2.1.2/staging/usr/include/bits/math-vector.h:356:1: error: ‘__sv_f64_t’ does not name a type; did you mean ‘__off64_t’?666  356 | __sv_f64_t _ZGVsMxv_exp (__sv_f64_t, __sv_bool_t);667      | ^~~~~~~~~~668      | __off64_t669/home/nerves/.nerves/artifacts/nerves_system_rpi4-2.1.2/staging/usr/include/bits/math-vector.h:357:1: error: ‘__sv_f64_t’ does not name a type; did you mean ‘__off64_t’?670  357 | __sv_f64_t _ZGVsMxv_exp10 (__sv_f64_t, __sv_bool_t);671      | ^~~~~~~~~~672      | __off64_t673/home/nerves/.nerves/artifacts/nerves_system_rpi4-2.1.2/staging/usr/include/bits/math-vector.h:358:1: error: ‘__sv_f64_t’ does not name a type; did you mean ‘__off64_t’?674  358 | __sv_f64_t _ZGVsMxv_exp2 (__sv_f64_t, __sv_bool_t);675      | ^~~~~~~~~~676      | __off64_t677/home/nerves/.nerves/artifacts/nerves_system_rpi4-2.1.2/staging/usr/include/bits/math-vector.h:359:1: error: ‘__sv_f64_t’ does not name a type; did you mean ‘__off64_t’?678  359 | __sv_f64_t _ZGVsMxv_expm1 (__sv_f64_t, __sv_bool_t);679      | ^~~~~~~~~~680      | __off64_t681/home/nerves/.nerves/artifacts/nerves_system_rpi4-2.1.2/staging/usr/include/bits/math-vector.h:360:1: error: ‘__sv_f64_t’ does not name a type; did you mean ‘__off64_t’?682  360 | __sv_f64_t _ZGVsMxv_exp2m1 (__sv_f64_t, __sv_bool_t);683      | ^~~~~~~~~~684      | __off64_t685/home/nerves/.nerves/artifacts/nerves_system_rpi4-2.1.2/staging/usr/include/bits/math-vector.h:361:1: error: ‘__sv_f64_t’ does not name a type; did you mean ‘__off64_t’?686  361 | __sv_f64_t _ZGVsMxv_exp10m1 (__sv_f64_t, __sv_bool_t);687      | ^~~~~~~~~~688      | __off64_t689/home/nerves/.nerves/artifacts/nerves_system_rpi4-2.1.2/staging/usr/include/bits/math-vector.h:362:1: error: ‘__sv_f64_t’ does not name a type; did you mean ‘__off64_t’?690  362 | __sv_f64_t _ZGVsMxvv_hypot (__sv_f64_t, __sv_f64_t, __sv_bool_t);691      | ^~~~~~~~~~692      | __off64_t693/home/nerves/.nerves/artifacts/nerves_system_rpi4-2.1.2/staging/usr/include/bits/math-vector.h:363:1: error: ‘__sv_f64_t’ does not name a type; did you mean ‘__off64_t’?694  363 | __sv_f64_t _ZGVsMxv_log (__sv_f64_t, __sv_bool_t);695      | ^~~~~~~~~~696      | __off64_t697/home/nerves/.nerves/artifacts/nerves_system_rpi4-2.1.2/staging/usr/include/bits/math-vector.h:364:1: error: ‘__sv_f64_t’ does not name a type; did you mean ‘__off64_t’?698  364 | __sv_f64_t _ZGVsMxv_log10 (__sv_f64_t, __sv_bool_t);699      | ^~~~~~~~~~700      | __off64_t701/home/nerves/.nerves/artifacts/nerves_system_rpi4-2.1.2/staging/usr/include/bits/math-vector.h:365:1: error: ‘__sv_f64_t’ does not name a type; did you mean ‘__off64_t’?702  365 | __sv_f64_t _ZGVsMxv_log10p1 (__sv_f64_t, __sv_bool_t);703      | ^~~~~~~~~~704      | __off64_t705/home/nerves/.nerves/artifacts/nerves_system_rpi4-2.1.2/staging/usr/include/bits/math-vector.h:366:1: error: ‘__sv_f64_t’ does not name a type; did you mean ‘__off64_t’?706  366 | __sv_f64_t _ZGVsMxv_log1p (__sv_f64_t, __sv_bool_t);707      | ^~~~~~~~~~708      | __off64_t709/home/nerves/.nerves/artifacts/nerves_system_rpi4-2.1.2/staging/usr/include/bits/math-vector.h:367:1: error: ‘__sv_f64_t’ does not name a type; did you mean ‘__off64_t’?710  367 | __sv_f64_t _ZGVsMxv_log2 (__sv_f64_t, __sv_bool_t);711      | ^~~~~~~~~~712      | __off64_t713/home/nerves/.nerves/artifacts/nerves_system_rpi4-2.1.2/staging/usr/include/bits/math-vector.h:368:1: error: ‘__sv_f64_t’ does not name a type; did you mean ‘__off64_t’?714  368 | __sv_f64_t _ZGVsMxv_log2p1 (__sv_f64_t, __sv_bool_t);715      | ^~~~~~~~~~716      | __off64_t717/home/nerves/.nerves/artifacts/nerves_system_rpi4-2.1.2/staging/usr/include/bits/math-vector.h:369:1: error: ‘__sv_f64_t’ does not name a type; did you mean ‘__off64_t’?718  369 | __sv_f64_t _ZGVsMxv_logp1 (__sv_f64_t, __sv_bool_t);719      | ^~~~~~~~~~720      | __off64_t721/home/nerves/.nerves/artifacts/nerves_system_rpi4-2.1.2/staging/usr/include/bits/math-vector.h:370:1: error: ‘__sv_f64_t’ does not name a type; did you mean ‘__off64_t’?722  370 | __sv_f64_t _ZGVsMxvv_pow (__sv_f64_t, __sv_f64_t, __sv_bool_t);723      | ^~~~~~~~~~724      | __off64_t725/home/nerves/.nerves/artifacts/nerves_system_rpi4-2.1.2/staging/usr/include/bits/math-vector.h:371:1: error: ‘__sv_f64_t’ does not name a type; did you mean ‘__off64_t’?726  371 | __sv_f64_t _ZGVsMxv_rsqrt (__sv_f64_t, __sv_bool_t);727      | ^~~~~~~~~~728      | __off64_t729/home/nerves/.nerves/artifacts/nerves_system_rpi4-2.1.2/staging/usr/include/bits/math-vector.h:372:1: error: ‘__sv_f64_t’ does not name a type; did you mean ‘__off64_t’?730  372 | __sv_f64_t _ZGVsMxv_sin (__sv_f64_t, __sv_bool_t);731      | ^~~~~~~~~~732      | __off64_t733/home/nerves/.nerves/artifacts/nerves_system_rpi4-2.1.2/staging/usr/include/bits/math-vector.h:373:1: error: ‘__sv_f64_t’ does not name a type; did you mean ‘__off64_t’?734  373 | __sv_f64_t _ZGVsMxv_sinh (__sv_f64_t, __sv_bool_t);735      | ^~~~~~~~~~736      | __off64_t737/home/nerves/.nerves/artifacts/nerves_system_rpi4-2.1.2/staging/usr/include/bits/math-vector.h:374:1: error: ‘__sv_f64_t’ does not name a type; did you mean ‘__off64_t’?738  374 | __sv_f64_t _ZGVsMxv_sinpi (__sv_f64_t, __sv_bool_t);739      | ^~~~~~~~~~740      | __off64_t741/home/nerves/.nerves/artifacts/nerves_system_rpi4-2.1.2/staging/usr/include/bits/math-vector.h:375:1: error: ‘__sv_f64_t’ does not name a type; did you mean ‘__off64_t’?742  375 | __sv_f64_t _ZGVsMxv_tan (__sv_f64_t, __sv_bool_t);743      | ^~~~~~~~~~744      | __off64_t745/home/nerves/.nerves/artifacts/nerves_system_rpi4-2.1.2/staging/usr/include/bits/math-vector.h:376:1: error: ‘__sv_f64_t’ does not name a type; did you mean ‘__off64_t’?746  376 | __sv_f64_t _ZGVsMxv_tanh (__sv_f64_t, __sv_bool_t);747      | ^~~~~~~~~~748      | __off64_t749/home/nerves/.nerves/artifacts/nerves_system_rpi4-2.1.2/staging/usr/include/bits/math-vector.h:377:1: error: ‘__sv_f64_t’ does not name a type; did you mean ‘__off64_t’?750  377 | __sv_f64_t _ZGVsMxv_tanpi (__sv_f64_t, __sv_bool_t);751      | ^~~~~~~~~~752      | __off64_t753make: *** [<builtin>: priv/boostnif.o] Error 1754could not compile dependency :exboost, "mix compile" failed. Errors may have been logged above. You can recompile this dependency with "mix deps.compile exboost --force", update it with "mix deps.update exboost" or clean it with "mix deps.clean exboost"755==> nerves_compatibility_test756** (Mix) Could not compile with "make" (exit status: 2).757You need to have gcc and make installed. If you are using758Ubuntu or any other Debian-based system, install the packages759"build-essential". Also install "erlang-dev" package if not760included in your Erlang/OTP version. If you're on Fedora, run761"dnf group install 'Development Tools'".762