ecsv

Build log

host

ecsv 1.4.2 · fail · run ecsv-1.4.2-1791168670740
55 of 55 lines
1Resolving Hex dependencies...2Resolution completed in 0.17s3Unchanged:4  circular_buffer 1.1.05  ecsv 1.4.26  elixir_make 0.6.37  interactive_cmd 0.1.48  nerves 2.0.0-pre.29  nerves_discovery 0.1.510  nerves_logging 0.2.411  nerves_runtime 0.13.1312  nerves_system_bbb 2.30.213  nerves_system_br 1.34.414  nerves_system_mangopi_mq_pro 0.17.215  nerves_system_qemu_aarch64 0.4.216  nerves_system_rpi0 2.1.217  nerves_system_rpi4 2.1.218  nerves_system_rpi5 2.1.219  nerves_system_trellis 0.5.020  nerves_system_x86_64 1.34.221  nerves_toolchain_aarch64_nerves_linux_gnu 15.3.122  nerves_toolchain_armv6_nerves_linux_gnueabihf 15.3.123  nerves_toolchain_armv7_nerves_linux_gnueabihf 15.3.124  nerves_toolchain_riscv64_nerves_linux_gnu 15.3.125  nerves_toolchain_x86_64_nerves_linux_musl 15.3.126  nerves_uevent 0.1.727  property_table 0.3.428  ring_logger 0.11.729  tablet 0.3.330  toolshed 0.5.031  uboot_env 1.0.232All dependencies have been fetched33==> ecsv34cc -O3 -std=c99 -finline-functions -Wall -Wextra -g -fvisibility=hidden -fPIC -I /usr/local/lib/erlang/erts-17.1/include  -c -o /work/proj/deps/ecsv/c_src/ecsv_parser.o /work/proj/deps/ecsv/c_src/ecsv_parser.c35cc -O3 -std=c99 -finline-functions -Wall -Wextra -g -fvisibility=hidden -fPIC -I /usr/local/lib/erlang/erts-17.1/include  -c -o /work/proj/deps/ecsv/c_src/ecsv_writer.o /work/proj/deps/ecsv/c_src/ecsv_writer.c36/work/proj/deps/ecsv/c_src/ecsv_writer.c:6:10: fatal error: csv.h: No such file or directory37    6 | #include <csv.h>38      |          ^~~~~~~39compilation terminated.40/work/proj/deps/ecsv/c_src/ecsv_parser.c:6:10: fatal error: csv.h: No such file or directory41    6 | #include <csv.h>42      |          ^~~~~~~43compilation terminated.44make: *** [c_src/Makefile:66: /work/proj/deps/ecsv/c_src/ecsv_parser.o] Error 145make: *** Waiting for unfinished jobs....46make: *** [c_src/Makefile:66: /work/proj/deps/ecsv/c_src/ecsv_writer.o] Error 147could not compile dependency :ecsv, "mix compile" failed. Errors may have been logged above. You can recompile this dependency with "mix deps.compile ecsv --force", update it with "mix deps.update ecsv" or clean it with "mix deps.clean ecsv"48==> nerves_compatibility_test49** (Mix) Could not compile with "make" (exit status: 2).50You need to have gcc and make installed. If you are using51Ubuntu or any other Debian-based system, install the packages52"build-essential". Also install "erlang-dev" package if not53included in your Erlang/OTP version. If you're on Fedora, run54"dnf group install 'Development Tools'".55