Build log
host
elixir_libxl 0.4.0 · fail · run elixir_libxl-0.4.0-1791170586792
58 of 58 lines
1Resolving Hex dependencies...2Resolution completed in 0.393s3Unchanged:4 circular_buffer 1.1.05 elixir_libxl 0.4.06 elixir_make 0.10.07 interactive_cmd 0.1.48 nerves 2.0.0-pre.29 nerves_discovery 0.1.510 nerves_logging 0.2.411 nerves_runtime 0.13.1312 nerves_system_bbb 2.30.213 nerves_system_br 1.34.414 nerves_system_mangopi_mq_pro 0.17.215 nerves_system_qemu_aarch64 0.4.216 nerves_system_rpi0 2.1.217 nerves_system_rpi4 2.1.218 nerves_system_rpi5 2.1.219 nerves_system_trellis 0.5.020 nerves_system_x86_64 1.34.221 nerves_toolchain_aarch64_nerves_linux_gnu 15.3.122 nerves_toolchain_armv6_nerves_linux_gnueabihf 15.3.123 nerves_toolchain_armv7_nerves_linux_gnueabihf 15.3.124 nerves_toolchain_riscv64_nerves_linux_gnu 15.3.125 nerves_toolchain_x86_64_nerves_linux_musl 15.3.126 nerves_uevent 0.1.727 property_table 0.3.428 ring_logger 0.11.729 tablet 0.3.330 toolshed 0.5.031 uboot_env 1.0.232All dependencies have been fetched33==> elixir_libxl34mkdir -p /work/proj/_build/host/lib/elixir_libxl/obj35cc -c -std=c11 -fpic -D_UNICODE -DUNICODE -I/usr/local/lib/erlang/usr/include -I/usr/include -I/usr/local/include -o /work/proj/_build/host/lib/elixir_libxl/obj/Autofilter.o c_src/Autofilter.c36cc -c -std=c11 -fpic -D_UNICODE -DUNICODE -I/usr/local/lib/erlang/usr/include -I/usr/include -I/usr/local/include -o /work/proj/_build/host/lib/elixir_libxl/obj/Book.o c_src/Book.c37In file included from c_src/Book.c:1:38c_src/types.h:4:10: fatal error: libxl.h: No such file or directory39 4 | #include "libxl.h"40 | ^~~~~~~~~41compilation terminated.42In file included from c_src/Autofilter.c:1:43c_src/types.h:4:10: fatal error: libxl.h: No such file or directory44 4 | #include "libxl.h"45 | ^~~~~~~~~46compilation terminated.47make: *** [Makefile:26: /work/proj/_build/host/lib/elixir_libxl/obj/Book.o] Error 148make: *** Waiting for unfinished jobs....49make: *** [Makefile:26: /work/proj/_build/host/lib/elixir_libxl/obj/Autofilter.o] Error 150could not compile dependency :elixir_libxl, "mix compile" failed. Errors may have been logged above. You can recompile this dependency with "mix deps.compile elixir_libxl --force", update it with "mix deps.update elixir_libxl" or clean it with "mix deps.clean elixir_libxl"51==> nerves_compatibility_test52** (Mix) Could not compile with "make" (exit status: 2).53You need to have gcc and make installed. If you are using54Ubuntu or any other Debian-based system, install the packages55"build-essential". Also install "erlang-dev" package if not56included in your Erlang/OTP version. If you're on Fedora, run57"dnf group install 'Development Tools'".58