Build log
nerves_system_mangopi_mq_pro
emqtt 1.16.1 · fail · run emqtt-1.16.1-1789560443264
472 of 472 lines
1Resolving Hex dependencies...2Resolution completed in 0.345s3Unchanged:4 circular_buffer 1.1.05 cowlib 2.20.0 VULNERABLE!6 EEF-CVE-2026-43971 (MEDIUM)7 aka: CVE-2026-439718 Link Header Directive Smuggling via Unescaped target/rel/Attribute Keys in cow_link:link/19 https://osv.dev/vulnerability/EEF-CVE-2026-439711011 EEF-CVE-2026-43966 (MEDIUM)12 aka: CVE-2026-43966, GHSA-w4f7-4cxr-rv3c13 HTTP Response Splitting via Non-VCHAR Bytes in cow_http_struct_hd:escape_string/214 https://osv.dev/vulnerability/EEF-CVE-2026-439661516 EEF-CVE-2026-43969 (LOW)17 aka: CVE-2026-43969, GHSA-g2wm-735q-3f5618 Cookie Request Header Injection via Unvalidated Encoder in cow_cookie:cookie/119 https://osv.dev/vulnerability/EEF-CVE-2026-4396920 elixir_make 0.10.021 emqtt 1.16.122 getopt 1.0.323 gun 2.6.0 VULNERABLE!24 GHSA-w4f7-4cxr-rv3c (MEDIUM)25 aka: CVE-2026-43966, EEF-CVE-2026-4396626 cowboy and gun affected by an HTTP Request/Response Splitting vulnerability27 https://osv.dev/vulnerability/GHSA-w4f7-4cxr-rv3c28 interactive_cmd 0.1.429 jason 1.4.530 nerves 1.15.031 nerves_discovery 0.1.532 nerves_logging 0.2.433 nerves_runtime 0.13.1334 nerves_system_bbb 2.30.235 nerves_system_br 1.34.436 nerves_system_mangopi_mq_pro 0.17.237 nerves_system_qemu_aarch64 0.4.238 nerves_system_rpi 2.1.239 nerves_system_rpi0 2.1.240 nerves_system_rpi0_2 2.1.241 nerves_system_rpi2 2.1.242 nerves_system_rpi3 2.1.243 nerves_system_rpi4 2.1.244 nerves_system_rpi5 2.1.245 nerves_system_x86_64 1.34.246 nerves_toolchain_aarch64_nerves_linux_gnu 15.3.147 nerves_toolchain_armv6_nerves_linux_gnueabihf 15.3.148 nerves_toolchain_armv7_nerves_linux_gnueabihf 15.3.149 nerves_toolchain_riscv64_nerves_linux_gnu 15.3.150 nerves_toolchain_x86_64_nerves_linux_musl 15.3.151 nerves_uevent 0.1.752 property_table 0.3.453 quicer 0.2.1554 ring_logger 0.11.755 shoehorn 0.9.356 snabbkaffe 1.0.1057 tablet 0.3.358 toolshed 0.5.059 uboot_env 1.0.260* Getting emqtt (Hex package)61* Getting nerves (Hex package)62* Getting shoehorn (Hex package)63* Getting ring_logger (Hex package)64* Getting toolshed (Hex package)65* Getting nerves_runtime (Hex package)66* Getting nerves_system_bbb (Hex package)67* Getting nerves_system_mangopi_mq_pro (Hex package)68* Getting nerves_system_qemu_aarch64 (Hex package)69* Getting nerves_system_rpi (Hex package)70* Getting nerves_system_rpi0 (Hex package)71* Getting nerves_system_rpi0_2 (Hex package)72* Getting nerves_system_rpi2 (Hex package)73* Getting nerves_system_rpi3 (Hex package)74* Getting nerves_system_rpi4 (Hex package)75* Getting nerves_system_rpi5 (Hex package)76* Getting nerves_system_x86_64 (Hex package)77* Getting nerves_system_br (Hex package)78* Getting nerves_toolchain_x86_64_nerves_linux_musl (Hex package)79* Getting nerves_toolchain_aarch64_nerves_linux_gnu (Hex package)80* Getting nerves_toolchain_armv7_nerves_linux_gnueabihf (Hex package)81* Getting nerves_toolchain_armv6_nerves_linux_gnueabihf (Hex package)82* Getting nerves_toolchain_riscv64_nerves_linux_gnu (Hex package)83* Getting nerves_logging (Hex package)84* Getting nerves_uevent (Hex package)85* Getting uboot_env (Hex package)86* Getting elixir_make (Hex package)87* Getting property_table (Hex package)88* Getting circular_buffer (Hex package)89* Getting interactive_cmd (Hex package)90* Getting jason (Hex package)91* Getting nerves_discovery (Hex package)92* Getting tablet (Hex package)93* Getting cowlib (Hex package)94* Getting getopt (Hex package)95* Getting gun (Hex package)96* Getting quicer (Hex package)97* Getting snabbkaffe (Hex package)98Found packages with security advisories, see above for details99You have added/upgraded packages you could sponsor, run `mix hex.sponsor` to learn more100==> jason101Compiling 10 files (.ex)102Generated jason app103==> tablet104Compiling 2 files (.ex)105Generated tablet app106==> elixir_make107Compiling 8 files (.ex)108Generated elixir_make app109==> nerves_discovery110Compiling 5 files (.ex)111Generated nerves_discovery app112==> interactive_cmd113Compiling 1 file (.ex)114Generated interactive_cmd app115==> nerves116HOST_CC port.o117HOST_LD port118Compiling 55 files (.ex)119Generated nerves app120==> nerves_compatibility_test121122Nerves environment123 MIX_TARGET: mangopi_mq_pro124 MIX_ENV: prod125126Checking for prebuilt Nerves artifacts...127 Found nerves_system_mangopi_mq_pro in cache128 /home/nerves/.nerves/artifacts/nerves_system_mangopi_mq_pro-portable-0.17.2129 Found nerves_toolchain_riscv64_nerves_linux_gnu in cache130 /home/nerves/.nerves/artifacts/nerves_toolchain_riscv64_nerves_linux_gnu-linux_x86_64-15.3.1131==> jason132Compiling 10 files (.ex)133Compiling lib/decoder.ex (it's taking more than 10s)134Generated jason app135==> tablet136Compiling 2 files (.ex)137Generated tablet app138==> elixir_make139Compiling 8 files (.ex)140Generated elixir_make app141==> nerves_discovery142Compiling 5 files (.ex)143Generated nerves_discovery app144==> interactive_cmd145Compiling 1 file (.ex)146Generated interactive_cmd app147==> nerves148HOST_CC port.o149HOST_LD port150Compiling 55 files (.ex)151Generated nerves app152==> nerves_system_br153Generated nerves_system_br app154==> nerves_toolchain_riscv64_nerves_linux_gnu155Compiling 1 file (.ex)156Generated nerves_toolchain_riscv64_nerves_linux_gnu app157==> nerves_system_mangopi_mq_pro158Generated nerves_system_mangopi_mq_pro app159==> nerves_compatibility_test160161Nerves environment162 MIX_TARGET: mangopi_mq_pro163 MIX_ENV: prod164165==> circular_buffer166Compiling 1 file (.ex)167Generated circular_buffer app168==> nerves_compatibility_test169===> Analyzing applications...170===> Compiling getopt171===> Analyzing applications...172===> Compiling snabbkaffe173==> nerves_logging174 CC kmsg_tailer.o175 LD kmsg_tailer176Compiling 5 files (.ex)177Generated nerves_logging app178==> nerves_compatibility_test179===> Analyzing applications...180===> Compiling cowlib181===> Analyzing applications...182===> Compiling gun183==> ring_logger184Compiling 7 files (.ex)185Generated ring_logger app186==> shoehorn187Compiling 8 files (.ex)188Generated shoehorn app189==> nerves_compatibility_test190./build.sh 'v2.3.8'191Cloning into 'msquic'...192Note: switching to 'e453ade8d9b35f53290fdbd111738f86150253a1'.193194You are in 'detached HEAD' state. You can look around, make experimental195changes and commit them, and you can discard any commits you make in this196state without impacting any branches by switching back to a branch.197198If you want to create a new branch to retain commits you create, you may199do so (now or later) by using -c with the switch command. Example:200201 git switch -c <new-branch-name>202203Or undo this operation with:204205 git switch -206207Turn off this advice by setting config variable advice.detachedHead to false208209Updating files: 91% (894/979)Updating files: 92% (901/979)Updating files: 93% (911/979)Updating files: 94% (921/979)Updating files: 95% (931/979)Updating files: 96% (940/979)Updating files: 97% (950/979)Updating files: 98% (960/979)Updating files: 99% (970/979)Updating files: 100% (979/979)Updating files: 100% (979/979), done.210Submodule 'submodules/clog' (https://github.com/microsoft/CLOG.git) registered for path 'submodules/clog'211Submodule 'submodules/googletest' (https://github.com/google/googletest) registered for path 'submodules/googletest'212Submodule 'submodules/openssl' (https://github.com/quictls/openssl.git) registered for path 'submodules/openssl'213Submodule 'submodules/openssl3' (https://github.com/quictls/openssl.git) registered for path 'submodules/openssl3'214Submodule 'submodules/xdp-for-windows' (https://github.com/microsoft/xdp-for-windows.git) registered for path 'submodules/xdp-for-windows'215Cloning into '/work/proj/deps_mangopi_mq_pro/quicer/msquic/submodules/clog'...216Cloning into '/work/proj/deps_mangopi_mq_pro/quicer/msquic/submodules/googletest'...217Cloning into '/work/proj/deps_mangopi_mq_pro/quicer/msquic/submodules/openssl'...218Cloning into '/work/proj/deps_mangopi_mq_pro/quicer/msquic/submodules/openssl3'...219Cloning into '/work/proj/deps_mangopi_mq_pro/quicer/msquic/submodules/xdp-for-windows'...220From https://github.com/microsoft/CLOG221 * branch ca6e640fbf7f53ec9de915f1f4d852c10d874d13 -> FETCH_HEAD222Submodule path 'submodules/clog': checked out 'ca6e640fbf7f53ec9de915f1f4d852c10d874d13'223From https://github.com/google/googletest224 * branch 563ebf1769af08d448765c31064260e1a16fcced -> FETCH_HEAD225Submodule path 'submodules/googletest': checked out '563ebf1769af08d448765c31064260e1a16fcced'226From https://github.com/quictls/openssl227 * branch 612d8e44d687e4b71c4724319d7aa27a733bcbca -> FETCH_HEAD228Submodule path 'submodules/openssl': checked out '612d8e44d687e4b71c4724319d7aa27a733bcbca'229Submodule 'boringssl' (https://boringssl.googlesource.com/boringssl) registered for path 'submodules/openssl/boringssl'230Submodule 'krb5' (https://github.com/krb5/krb5) registered for path 'submodules/openssl/krb5'231Submodule 'pyca.cryptography' (https://github.com/pyca/cryptography.git) registered for path 'submodules/openssl/pyca-cryptography'232Submodule 'wycheproof' (https://github.com/google/wycheproof) registered for path 'submodules/openssl/wycheproof'233Cloning into '/work/proj/deps_mangopi_mq_pro/quicer/msquic/submodules/openssl/boringssl'...234Cloning into '/work/proj/deps_mangopi_mq_pro/quicer/msquic/submodules/openssl/krb5'...235Cloning into '/work/proj/deps_mangopi_mq_pro/quicer/msquic/submodules/openssl/pyca-cryptography'...236Cloning into '/work/proj/deps_mangopi_mq_pro/quicer/msquic/submodules/openssl/wycheproof'...237From https://boringssl.googlesource.com/boringssl238 * branch 2070f8ad9151dc8f3a73bffaa146b5e6937a583f -> FETCH_HEAD239Submodule path 'submodules/openssl/boringssl': checked out '2070f8ad9151dc8f3a73bffaa146b5e6937a583f'240From https://github.com/krb5/krb5241 * branch 890ca2f401924cdcb88f493950b04700bbe52db3 -> FETCH_HEAD242Submodule path 'submodules/openssl/krb5': checked out '890ca2f401924cdcb88f493950b04700bbe52db3'243From https://github.com/pyca/cryptography244 * branch fa84d185c0fefa7d612759e02a26def2f948fe34 -> FETCH_HEAD245Submodule path 'submodules/openssl/pyca-cryptography': checked out 'fa84d185c0fefa7d612759e02a26def2f948fe34'246From https://github.com/google/wycheproof247 * branch 2196000605e45d91097147c9c71f26b72af58003 -> FETCH_HEAD248Submodule path 'submodules/openssl/wycheproof': checked out '2196000605e45d91097147c9c71f26b72af58003'249From https://github.com/quictls/openssl250 * branch 330feef3dcb69d95cd752d54cb9254b366bdc7cf -> FETCH_HEAD251Submodule path 'submodules/openssl3': checked out '330feef3dcb69d95cd752d54cb9254b366bdc7cf'252Submodule 'gost-engine' (https://github.com/gost-engine/engine) registered for path 'submodules/openssl3/gost-engine'253Submodule 'krb5' (https://github.com/krb5/krb5) registered for path 'submodules/openssl3/krb5'254Submodule 'oqs-provider' (https://github.com/open-quantum-safe/oqs-provider.git) registered for path 'submodules/openssl3/oqs-provider'255Submodule 'pyca.cryptography' (https://github.com/pyca/cryptography.git) registered for path 'submodules/openssl3/pyca-cryptography'256Submodule 'python-ecdsa' (https://github.com/tlsfuzzer/python-ecdsa) registered for path 'submodules/openssl3/python-ecdsa'257Submodule 'tlsfuzzer' (https://github.com/tlsfuzzer/tlsfuzzer) registered for path 'submodules/openssl3/tlsfuzzer'258Submodule 'tlslite-ng' (https://github.com/tlsfuzzer/tlslite-ng) registered for path 'submodules/openssl3/tlslite-ng'259Submodule 'wycheproof' (https://github.com/google/wycheproof) registered for path 'submodules/openssl3/wycheproof'260Cloning into '/work/proj/deps_mangopi_mq_pro/quicer/msquic/submodules/openssl3/gost-engine'...261Cloning into '/work/proj/deps_mangopi_mq_pro/quicer/msquic/submodules/openssl3/krb5'...262Cloning into '/work/proj/deps_mangopi_mq_pro/quicer/msquic/submodules/openssl3/oqs-provider'...263Cloning into '/work/proj/deps_mangopi_mq_pro/quicer/msquic/submodules/openssl3/pyca-cryptography'...264Cloning into '/work/proj/deps_mangopi_mq_pro/quicer/msquic/submodules/openssl3/python-ecdsa'...265Cloning into '/work/proj/deps_mangopi_mq_pro/quicer/msquic/submodules/openssl3/tlsfuzzer'...266Cloning into '/work/proj/deps_mangopi_mq_pro/quicer/msquic/submodules/openssl3/tlslite-ng'...267Cloning into '/work/proj/deps_mangopi_mq_pro/quicer/msquic/submodules/openssl3/wycheproof'...268From https://github.com/gost-engine/engine269 * branch 2a8a5e0ecaa3e3d6f4ec722a49aa72476755c2b7 -> FETCH_HEAD270Submodule path 'submodules/openssl3/gost-engine': checked out '2a8a5e0ecaa3e3d6f4ec722a49aa72476755c2b7'271Submodule 'libprov' (https://github.com/provider-corner/libprov.git) registered for path 'submodules/openssl3/gost-engine/libprov'272Cloning into '/work/proj/deps_mangopi_mq_pro/quicer/msquic/submodules/openssl3/gost-engine/libprov'...273From https://github.com/provider-corner/libprov274 * branch 8a126e09547630ef900177625626b6156052f0ee -> FETCH_HEAD275Submodule path 'submodules/openssl3/gost-engine/libprov': checked out '8a126e09547630ef900177625626b6156052f0ee'276From https://github.com/krb5/krb5277 * branch aa9b4a2a64046afd2fab7cb49c346295874a5fb6 -> FETCH_HEAD278Submodule path 'submodules/openssl3/krb5': checked out 'aa9b4a2a64046afd2fab7cb49c346295874a5fb6'279From https://github.com/open-quantum-safe/oqs-provider280 * branch 3f3d8a8cf331c73a26fe93a598273997cb54eb4f -> FETCH_HEAD281Submodule path 'submodules/openssl3/oqs-provider': checked out '3f3d8a8cf331c73a26fe93a598273997cb54eb4f'282From https://github.com/pyca/cryptography283 * branch c18d0567386414efa3caef7ed586c4ca75bf3a8b -> FETCH_HEAD284Submodule path 'submodules/openssl3/pyca-cryptography': checked out 'c18d0567386414efa3caef7ed586c4ca75bf3a8b'285From https://github.com/tlsfuzzer/python-ecdsa286 * branch 4de8d5bf89089d1140eb99aa5d7eb2dc8e6337b6 -> FETCH_HEAD287Submodule path 'submodules/openssl3/python-ecdsa': checked out '4de8d5bf89089d1140eb99aa5d7eb2dc8e6337b6'288From https://github.com/tlsfuzzer/tlsfuzzer289 * branch dbd56c149072e656ca8d6a43a59588f3e7513da2 -> FETCH_HEAD290Submodule path 'submodules/openssl3/tlsfuzzer': checked out 'dbd56c149072e656ca8d6a43a59588f3e7513da2'291From https://github.com/tlsfuzzer/tlslite-ng292 * branch 771e9f59d639dbb0e2fa8e646c8e588405d3903e -> FETCH_HEAD293Submodule path 'submodules/openssl3/tlslite-ng': checked out '771e9f59d639dbb0e2fa8e646c8e588405d3903e'294From https://github.com/google/wycheproof295 * branch 2196000605e45d91097147c9c71f26b72af58003 -> FETCH_HEAD296Submodule path 'submodules/openssl3/wycheproof': checked out '2196000605e45d91097147c9c71f26b72af58003'297From https://github.com/microsoft/xdp-for-windows298 * branch 51bba848b1a7c571c7eb7226977a6f24c0abffd3 -> FETCH_HEAD299Submodule path 'submodules/xdp-for-windows': checked out '51bba848b1a7c571c7eb7226977a6f24c0abffd3'300Submodule 'submodules/ndis-driver-library' (https://github.com/microsoft/ndis-driver-library) registered for path 'submodules/xdp-for-windows/submodules/ndis-driver-library'301Submodule 'submodules/net-offloads' (https://github.com/microsoft/net-offloads.git) registered for path 'submodules/xdp-for-windows/submodules/net-offloads'302Submodule 'submodules/wil' (https://github.com/microsoft/wil) registered for path 'submodules/xdp-for-windows/submodules/wil'303Cloning into '/work/proj/deps_mangopi_mq_pro/quicer/msquic/submodules/xdp-for-windows/submodules/ndis-driver-library'...304Cloning into '/work/proj/deps_mangopi_mq_pro/quicer/msquic/submodules/xdp-for-windows/submodules/net-offloads'...305Cloning into '/work/proj/deps_mangopi_mq_pro/quicer/msquic/submodules/xdp-for-windows/submodules/wil'...306From https://github.com/microsoft/ndis-driver-library307 * branch 6bf878da1a54bf471d4d934cef6e26355860d386 -> FETCH_HEAD308Submodule path 'submodules/xdp-for-windows/submodules/ndis-driver-library': checked out '6bf878da1a54bf471d4d934cef6e26355860d386'309From https://github.com/microsoft/net-offloads310 * branch 02dbf4e58e3b7f752ba3d97d17c36d4cd5fdc490 -> FETCH_HEAD311Submodule path 'submodules/xdp-for-windows/submodules/net-offloads': checked out '02dbf4e58e3b7f752ba3d97d17c36d4cd5fdc490'312From https://github.com/microsoft/wil313 * branch ae986e12b2fa722ba70e9761ae6897565293cbea -> FETCH_HEAD314Submodule path 'submodules/xdp-for-windows/submodules/wil': checked out 'ae986e12b2fa722ba70e9761ae6897565293cbea'315Patching Msquic 2.3.8316Patch patches/12edf3725475d4a99e5598df3289bace47b8f56e.patch already exists, skipping download317patching file src/inc/msquic_posix.h318Patch patches/e0201eb4e007e7524aef007be67f2281f949f102.patch already exists, skipping download319patching file src/core/binding.c320Patch patches/b16a14a72e8c74407ee4a079a1f57efe0246f739.patch already exists, skipping download321patching file src/generated/stdout/quic_trace.c322Patch patches/9261dacc1dd9a67f6fa8d5fbe663082508b4c605.patch already exists, skipping download323patching file src/platform/datapath_epoll.c324-- The C compiler identification is GNU 15.3.0325-- The CXX compiler identification is GNU 15.3.0326-- Detecting C compiler ABI info327-- Detecting C compiler ABI info - done328-- Check for working C compiler: /home/nerves/.nerves/artifacts/nerves_toolchain_riscv64_nerves_linux_gnu-linux_x86_64-15.3.1/bin/riscv64-nerves-linux-gnu-gcc - skipped329-- Detecting C compile features330-- Detecting C compile features - done331-- Detecting CXX compiler ABI info332-- Detecting CXX compiler ABI info - done333-- Check for working CXX compiler: /home/nerves/.nerves/artifacts/nerves_toolchain_riscv64_nerves_linux_gnu-linux_x86_64-15.3.1/bin/riscv64-nerves-linux-gnu-g++ - skipped334-- Detecting CXX compile features335-- Detecting CXX compile features - done336-- CMAKE Version: 3.28.3337-- Source Dir: /work/proj/deps_mangopi_mq_pro/quicer/msquic338-- Host System name: Linux339-- Setting policy 0091340-- System name: Linux341-- System version: 342-- Platform version: 343-- Build type: RelWithDebInfo344-- QUIC Platform: linux345-- Version Build ID: 0346-- Version Suffix: -private347-- Looking for _SC_PHYS_PAGES348-- Looking for _SC_PHYS_PAGES - found349-- Looking for sysconf350-- Looking for sysconf - found351-- Looking for UDP_SEGMENT352-- Looking for UDP_SEGMENT - found353-- Looking for SO_ATTACH_REUSEPORT_CBPF354-- Looking for SO_ATTACH_REUSEPORT_CBPF - found355-- Looking for sendmmsg356-- Looking for sendmmsg - found357-- Enabling OpenSsl configuration tests358-- Enabling CA file tests359-- QUIC_ENABLE_LOGGING is false. Disabling logging360-- Found libatomic: /home/nerves/.nerves/artifacts/nerves_system_mangopi_mq_pro-portable-0.17.2/staging/lib/libatomic.so361-- libnuma not found. If build fails, install libnuma362-- Enabling shared ephemeral port work around363-- Configuring for OpenSSL 1.1364-- Setting openssldir to /usr/lib/ssl365-- Configuring OpenSSL: /work/proj/deps_mangopi_mq_pro/quicer/msquic/submodules/openssl/config;CC=/home/nerves/.nerves/artifacts/nerves_toolchain_riscv64_nerves_linux_gnu-linux_x86_64-15.3.1/bin/riscv64-nerves-linux-gnu-gcc;CXX=/home/nerves/.nerves/artifacts/nerves_toolchain_riscv64_nerves_linux_gnu-linux_x86_64-15.3.1/bin/riscv64-nerves-linux-gnu-g++ enable-tls1_3;no-makedepend;no-dgram;no-ssl3;no-psk;no-srp;no-zlib;no-egd;no-idea;no-rc5;no-rc4;no-afalgeng;no-comp;no-cms;no-ct;no-srp;no-srtp;no-ts;no-gost;no-dso;no-ec2m;no-tls1;no-tls1_1;no-tls1_2;no-dtls;no-dtls1;no-dtls1_2;no-ssl;no-ssl3-method;no-tls1-method;no-tls1_1-method;no-tls1_2-method;no-dtls1-method;no-dtls1_2-method;no-siphash;no-whirlpool;no-aria;no-bf;no-blake2;no-sm2;no-sm3;no-sm4;no-camellia;no-cast;no-md4;no-mdc2;no-ocb;no-rc2;no-rmd160;no-scrypt;no-seed;no-weak-ssl-ciphers;no-shared;no-tests;--openssldir="/usr/lib/ssl";--prefix=/work/proj/deps_mangopi_mq_pro/quicer/c_build/_deps/opensslquic-build/openssl366-- Performing Test CMAKE_HAVE_LIBC_PTHREAD367-- Performing Test CMAKE_HAVE_LIBC_PTHREAD - Success368-- Found Threads: TRUE 369-- Configuring for OpenSSL370-- Configuring done (16.4s)371-- Generating done (0.3s)372-- Build files have been written to: /work/proj/deps_mangopi_mq_pro/quicer/c_build373make[1]: warning: -j6 forced in submake: resetting jobserver mode.374make[1]: Entering directory '/work/proj/deps_mangopi_mq_pro/quicer/c_build'375make[2]: Entering directory '/work/proj/deps_mangopi_mq_pro/quicer/c_build'376make[3]: Entering directory '/work/proj/deps_mangopi_mq_pro/quicer/c_build'377make[3]: Entering directory '/work/proj/deps_mangopi_mq_pro/quicer/c_build'378make[3]: Leaving directory '/work/proj/deps_mangopi_mq_pro/quicer/c_build'379make[3]: Leaving directory '/work/proj/deps_mangopi_mq_pro/quicer/c_build'380make[3]: Entering directory '/work/proj/deps_mangopi_mq_pro/quicer/c_build'381make[3]: Entering directory '/work/proj/deps_mangopi_mq_pro/quicer/c_build'382[ 2%] Building C object msquic/src/core/CMakeFiles/core.dir/ack_tracker.c.o383[ 1%] Building C object msquic/src/core/CMakeFiles/core.dir/binding.c.o384[ 3%] Building C object msquic/src/core/CMakeFiles/core.dir/congestion_control.c.o385[ 4%] Building C object msquic/src/core/CMakeFiles/core.dir/api.c.o386[ 5%] OpenSSL configure387[ 6%] Building C object msquic/src/core/CMakeFiles/core.dir/configuration.c.o388[ 7%] Building C object msquic/src/core/CMakeFiles/core.dir/connection.c.o389[ 8%] Building C object msquic/src/core/CMakeFiles/core.dir/crypto.c.o390[ 10%] Building C object msquic/src/core/CMakeFiles/core.dir/crypto_tls.c.o391Operating system: x86_64-whatever-linux2392[ 11%] Building C object msquic/src/core/CMakeFiles/core.dir/cubic.c.o393[ 12%] Building C object msquic/src/core/CMakeFiles/core.dir/bbr.c.o394[ 13%] Building C object msquic/src/core/CMakeFiles/core.dir/datagram.c.o395Configuring OpenSSL version 1.1.1w+quic (0x1010117fL) for linux-x86_64396Using os-specific seed configuration397[ 14%] Building C object msquic/src/core/CMakeFiles/core.dir/frame.c.o398[ 15%] Building C object msquic/src/core/CMakeFiles/core.dir/library.c.o399[ 16%] Building C object msquic/src/core/CMakeFiles/core.dir/listener.c.o400[ 17%] Building C object msquic/src/core/CMakeFiles/core.dir/lookup.c.o401[ 19%] Building C object msquic/src/core/CMakeFiles/core.dir/loss_detection.c.o402[ 20%] Building C object msquic/src/core/CMakeFiles/core.dir/mtu_discovery.c.o403[ 21%] Building C object msquic/src/core/CMakeFiles/core.dir/operation.c.o404[ 22%] Building C object msquic/src/core/CMakeFiles/core.dir/packet.c.o405[ 23%] Building C object msquic/src/core/CMakeFiles/core.dir/packet_builder.c.o406[ 24%] Building C object msquic/src/core/CMakeFiles/core.dir/packet_space.c.o407[ 25%] Building C object msquic/src/core/CMakeFiles/core.dir/path.c.o408[ 26%] Building C object msquic/src/core/CMakeFiles/core.dir/range.c.o409[ 28%] Building C object msquic/src/core/CMakeFiles/core.dir/recv_buffer.c.o410[ 29%] Building C object msquic/src/core/CMakeFiles/core.dir/registration.c.o411Creating configdata.pm412Creating Makefile413[ 30%] Building C object msquic/src/core/CMakeFiles/core.dir/send.c.o414[ 31%] Building C object msquic/src/core/CMakeFiles/core.dir/send_buffer.c.o415416**********************************************************************417*** ***418*** OpenSSL has been successfully configured ***419*** ***420*** If you encounter a problem while building, please open an ***421*** issue on GitHub <https://github.com/openssl/openssl/issues> ***422*** and include the output from the following command: ***423*** ***424*** perl configdata.pm --dump ***425*** ***426*** (If you are new to OpenSSL, you might want to consult the ***427*** 'Troubleshooting' section in the INSTALL file first) ***428*** ***429**********************************************************************430[ 32%] OpenSSL build431[ 33%] Building C object msquic/src/core/CMakeFiles/core.dir/sent_packet_metadata.c.o432make[4]: Entering directory '/work/proj/deps_mangopi_mq_pro/quicer/c_build/_deps/opensslquic-build/submodules/openssl'433make[4]: warning: -j6 forced in submake: resetting jobserver mode.434[ 34%] Building C object msquic/src/core/CMakeFiles/core.dir/stream.c.o435[ 35%] Building C object msquic/src/core/CMakeFiles/core.dir/settings.c.o436[ 37%] Building C object msquic/src/core/CMakeFiles/core.dir/stream_recv.c.o437make[5]: Entering directory '/work/proj/deps_mangopi_mq_pro/quicer/c_build/_deps/opensslquic-build/submodules/openssl'438make[5]: Leaving directory '/work/proj/deps_mangopi_mq_pro/quicer/c_build/_deps/opensslquic-build/submodules/openssl'439[ 38%] Building C object msquic/src/core/CMakeFiles/core.dir/stream_send.c.o440make[5]: Entering directory '/work/proj/deps_mangopi_mq_pro/quicer/c_build/_deps/opensslquic-build/submodules/openssl'441[ 39%] Building C object msquic/src/core/CMakeFiles/core.dir/stream_set.c.o442riscv64-nerves-linux-gnu-gcc: error: unrecognized command-line option '-m64'443riscv64-nerves-linux-gnu-gcc: error: unrecognized command-line option '-m64'444make[5]: *** [Makefile:661: apps/app_rand.o] Error 1445make[5]: *** Waiting for unfinished jobs....446make[5]: *** [Makefile:663: apps/apps.o] Error 1447riscv64-nerves-linux-gnu-gcc: error: unrecognized command-line option '-m64'448make[5]: *** [Makefile:667: apps/opt.o] Error 1449riscv64-nerves-linux-gnu-gcc: error: unrecognized command-line option '-m64'450make[5]: *** [Makefile:665: apps/bf_prefix.o] Error 1451make[5]: Leaving directory '/work/proj/deps_mangopi_mq_pro/quicer/c_build/_deps/opensslquic-build/submodules/openssl'452make[4]: *** [Makefile:175: build_libs] Error 2453make[4]: Leaving directory '/work/proj/deps_mangopi_mq_pro/quicer/c_build/_deps/opensslquic-build/submodules/openssl'454make[3]: *** [_deps/opensslquic-build/CMakeFiles/OpenSSL_Target.dir/build.make:74: _deps/opensslquic-build/openssl/lib/libssl.a] Error 2455make[3]: Leaving directory '/work/proj/deps_mangopi_mq_pro/quicer/c_build'456make[2]: *** [CMakeFiles/Makefile2:265: _deps/opensslquic-build/CMakeFiles/OpenSSL_Target.dir/all] Error 2457make[2]: *** Waiting for unfinished jobs....458[ 40%] Building C object msquic/src/core/CMakeFiles/core.dir/timer_wheel.c.o459[ 41%] Building C object msquic/src/core/CMakeFiles/core.dir/worker.c.o460[ 42%] Building C object msquic/src/core/CMakeFiles/core.dir/version_neg.c.o461[ 43%] Building C object msquic/src/core/CMakeFiles/core.dir/sliding_window_extremum.c.o462[ 44%] Building C object msquic/src/core/CMakeFiles/core.dir/inline.c.o463[ 46%] Linking C static library ../../obj/Release/libcore.a464make[3]: Leaving directory '/work/proj/deps_mangopi_mq_pro/quicer/c_build'465[ 46%] Built target core466make[2]: Leaving directory '/work/proj/deps_mangopi_mq_pro/quicer/c_build'467make[1]: *** [Makefile:136: all] Error 2468make[1]: Leaving directory '/work/proj/deps_mangopi_mq_pro/quicer/c_build'469make: *** [Makefile:15: build-nif] Error 2470===> Hook for compile failed!471472** (Mix) Could not compile dependency :quicer, "/home/nerves/.mix/elixir/1-20-otp-29/rebar3 bare compile --paths /work/proj/_build/mangopi_mq_pro/lib/*/ebin" command failed. Errors may have been logged above. You can recompile this dependency with "mix deps.compile quicer --force", update it with "mix deps.update quicer" or clean it with "mix deps.clean quicer"