emqtt

Build log

nerves_system_rpi4

emqtt 1.16.1 · fail · run emqtt-1.16.1-1789560443264
470 of 470 lines
1Resolving Hex dependencies...2Resolution completed in 1.025s3Unchanged:4  circular_buffer 1.1.05  cowlib 2.20.0 VULNERABLE!6    EEF-CVE-2026-43971 (MEDIUM)7    aka: CVE-2026-439718    Link Header Directive Smuggling via Unescaped target/rel/Attribute Keys in cow_link:link/19    https://osv.dev/vulnerability/EEF-CVE-2026-439711011    EEF-CVE-2026-43966 (MEDIUM)12    aka: CVE-2026-43966, GHSA-w4f7-4cxr-rv3c13    HTTP Response Splitting via Non-VCHAR Bytes in cow_http_struct_hd:escape_string/214    https://osv.dev/vulnerability/EEF-CVE-2026-439661516    EEF-CVE-2026-43969 (LOW)17    aka: CVE-2026-43969, GHSA-g2wm-735q-3f5618    Cookie Request Header Injection via Unvalidated Encoder in cow_cookie:cookie/119    https://osv.dev/vulnerability/EEF-CVE-2026-4396920  elixir_make 0.10.021  emqtt 1.16.122  getopt 1.0.323  gun 2.6.0 VULNERABLE!24    GHSA-w4f7-4cxr-rv3c (MEDIUM)25    aka: CVE-2026-43966, EEF-CVE-2026-4396626    cowboy and gun affected by an HTTP Request/Response Splitting vulnerability27    https://osv.dev/vulnerability/GHSA-w4f7-4cxr-rv3c28  interactive_cmd 0.1.429  jason 1.4.530  nerves 1.15.031  nerves_discovery 0.1.532  nerves_logging 0.2.433  nerves_runtime 0.13.1334  nerves_system_bbb 2.30.235  nerves_system_br 1.34.436  nerves_system_mangopi_mq_pro 0.17.237  nerves_system_qemu_aarch64 0.4.238  nerves_system_rpi 2.1.239  nerves_system_rpi0 2.1.240  nerves_system_rpi0_2 2.1.241  nerves_system_rpi2 2.1.242  nerves_system_rpi3 2.1.243  nerves_system_rpi4 2.1.244  nerves_system_rpi5 2.1.245  nerves_system_x86_64 1.34.246  nerves_toolchain_aarch64_nerves_linux_gnu 15.3.147  nerves_toolchain_armv6_nerves_linux_gnueabihf 15.3.148  nerves_toolchain_armv7_nerves_linux_gnueabihf 15.3.149  nerves_toolchain_riscv64_nerves_linux_gnu 15.3.150  nerves_toolchain_x86_64_nerves_linux_musl 15.3.151  nerves_uevent 0.1.752  property_table 0.3.453  quicer 0.2.1554  ring_logger 0.11.755  shoehorn 0.9.356  snabbkaffe 1.0.1057  tablet 0.3.358  toolshed 0.5.059  uboot_env 1.0.260* Getting emqtt (Hex package)61* Getting nerves (Hex package)62* Getting shoehorn (Hex package)63* Getting ring_logger (Hex package)64* Getting toolshed (Hex package)65* Getting nerves_runtime (Hex package)66* Getting nerves_system_bbb (Hex package)67* Getting nerves_system_mangopi_mq_pro (Hex package)68* Getting nerves_system_qemu_aarch64 (Hex package)69* Getting nerves_system_rpi (Hex package)70* Getting nerves_system_rpi0 (Hex package)71* Getting nerves_system_rpi0_2 (Hex package)72* Getting nerves_system_rpi2 (Hex package)73* Getting nerves_system_rpi3 (Hex package)74* Getting nerves_system_rpi4 (Hex package)75* Getting nerves_system_rpi5 (Hex package)76* Getting nerves_system_x86_64 (Hex package)77* Getting nerves_system_br (Hex package)78* Getting nerves_toolchain_x86_64_nerves_linux_musl (Hex package)79* Getting nerves_toolchain_aarch64_nerves_linux_gnu (Hex package)80* Getting nerves_toolchain_armv7_nerves_linux_gnueabihf (Hex package)81* Getting nerves_toolchain_armv6_nerves_linux_gnueabihf (Hex package)82* Getting nerves_toolchain_riscv64_nerves_linux_gnu (Hex package)83* Getting nerves_logging (Hex package)84* Getting nerves_uevent (Hex package)85* Getting uboot_env (Hex package)86* Getting elixir_make (Hex package)87* Getting property_table (Hex package)88* Getting circular_buffer (Hex package)89* Getting interactive_cmd (Hex package)90* Getting jason (Hex package)91* Getting nerves_discovery (Hex package)92* Getting tablet (Hex package)93* Getting cowlib (Hex package)94* Getting getopt (Hex package)95* Getting gun (Hex package)96* Getting quicer (Hex package)97* Getting snabbkaffe (Hex package)98Found packages with security advisories, see above for details99You have added/upgraded packages you could sponsor, run `mix hex.sponsor` to learn more100==> jason101Compiling 10 files (.ex)102Generated jason app103==> tablet104Compiling 2 files (.ex)105Generated tablet app106==> elixir_make107Compiling 8 files (.ex)108Generated elixir_make app109==> nerves_discovery110Compiling 5 files (.ex)111Generated nerves_discovery app112==> interactive_cmd113Compiling 1 file (.ex)114Generated interactive_cmd app115==> nerves116HOST_CC port.o117HOST_LD port118Compiling 55 files (.ex)119Generated nerves app120==> nerves_compatibility_test121122Nerves environment123  MIX_TARGET:   rpi4124  MIX_ENV:      prod125126Checking for prebuilt Nerves artifacts...127  Found nerves_system_rpi4 in cache128    /home/nerves/.nerves/artifacts/nerves_system_rpi4-portable-2.1.2129  Found nerves_toolchain_aarch64_nerves_linux_gnu in cache130    /home/nerves/.nerves/artifacts/nerves_toolchain_aarch64_nerves_linux_gnu-linux_x86_64-15.3.1131==> jason132Compiling 10 files (.ex)133Generated jason app134==> tablet135Compiling 2 files (.ex)136Generated tablet app137==> elixir_make138Compiling 8 files (.ex)139Generated elixir_make app140==> nerves_discovery141Compiling 5 files (.ex)142Generated nerves_discovery app143==> interactive_cmd144Compiling 1 file (.ex)145Generated interactive_cmd app146==> nerves147HOST_CC port.o148HOST_LD port149Compiling 55 files (.ex)150Generated nerves app151==> nerves_system_br152Generated nerves_system_br app153==> nerves_toolchain_aarch64_nerves_linux_gnu154Compiling 1 file (.ex)155Generated nerves_toolchain_aarch64_nerves_linux_gnu app156==> nerves_system_rpi4157Generated nerves_system_rpi4 app158==> nerves_compatibility_test159160Nerves environment161  MIX_TARGET:   rpi4162  MIX_ENV:      prod163164==> circular_buffer165Compiling 1 file (.ex)166Generated circular_buffer app167==> nerves_compatibility_test168===> Analyzing applications...169===> Compiling getopt170===> Analyzing applications...171===> Compiling snabbkaffe172==> nerves_logging173 CC kmsg_tailer.o174 LD kmsg_tailer175Compiling 5 files (.ex)176Generated nerves_logging app177==> nerves_compatibility_test178===> Analyzing applications...179===> Compiling cowlib180===> Analyzing applications...181===> Compiling gun182==> ring_logger183Compiling 7 files (.ex)184Generated ring_logger app185==> shoehorn186Compiling 8 files (.ex)187Generated shoehorn app188==> nerves_compatibility_test189./build.sh 'v2.3.8'190Cloning into 'msquic'...191Note: switching to 'e453ade8d9b35f53290fdbd111738f86150253a1'.192193You are in 'detached HEAD' state. You can look around, make experimental194changes and commit them, and you can discard any commits you make in this195state without impacting any branches by switching back to a branch.196197If you want to create a new branch to retain commits you create, you may198do so (now or later) by using -c with the switch command. Example:199200  git switch -c <new-branch-name>201202Or undo this operation with:203204  git switch -205206Turn off this advice by setting config variable advice.detachedHead to false207208Submodule 'submodules/clog' (https://github.com/microsoft/CLOG.git) registered for path 'submodules/clog'209Submodule 'submodules/googletest' (https://github.com/google/googletest) registered for path 'submodules/googletest'210Submodule 'submodules/openssl' (https://github.com/quictls/openssl.git) registered for path 'submodules/openssl'211Submodule 'submodules/openssl3' (https://github.com/quictls/openssl.git) registered for path 'submodules/openssl3'212Submodule 'submodules/xdp-for-windows' (https://github.com/microsoft/xdp-for-windows.git) registered for path 'submodules/xdp-for-windows'213Cloning into '/work/proj/deps_rpi4/quicer/msquic/submodules/clog'...214Cloning into '/work/proj/deps_rpi4/quicer/msquic/submodules/googletest'...215Cloning into '/work/proj/deps_rpi4/quicer/msquic/submodules/openssl'...216Cloning into '/work/proj/deps_rpi4/quicer/msquic/submodules/openssl3'...217Cloning into '/work/proj/deps_rpi4/quicer/msquic/submodules/xdp-for-windows'...218From https://github.com/microsoft/CLOG219 * branch            ca6e640fbf7f53ec9de915f1f4d852c10d874d13 -> FETCH_HEAD220Submodule path 'submodules/clog': checked out 'ca6e640fbf7f53ec9de915f1f4d852c10d874d13'221From https://github.com/google/googletest222 * branch            563ebf1769af08d448765c31064260e1a16fcced -> FETCH_HEAD223Submodule path 'submodules/googletest': checked out '563ebf1769af08d448765c31064260e1a16fcced'224From https://github.com/quictls/openssl225 * branch              612d8e44d687e4b71c4724319d7aa27a733bcbca -> FETCH_HEAD226Submodule path 'submodules/openssl': checked out '612d8e44d687e4b71c4724319d7aa27a733bcbca'227Submodule 'boringssl' (https://boringssl.googlesource.com/boringssl) registered for path 'submodules/openssl/boringssl'228Submodule 'krb5' (https://github.com/krb5/krb5) registered for path 'submodules/openssl/krb5'229Submodule 'pyca.cryptography' (https://github.com/pyca/cryptography.git) registered for path 'submodules/openssl/pyca-cryptography'230Submodule 'wycheproof' (https://github.com/google/wycheproof) registered for path 'submodules/openssl/wycheproof'231Cloning into '/work/proj/deps_rpi4/quicer/msquic/submodules/openssl/boringssl'...232Cloning into '/work/proj/deps_rpi4/quicer/msquic/submodules/openssl/krb5'...233Cloning into '/work/proj/deps_rpi4/quicer/msquic/submodules/openssl/pyca-cryptography'...234Cloning into '/work/proj/deps_rpi4/quicer/msquic/submodules/openssl/wycheproof'...235From https://boringssl.googlesource.com/boringssl236 * branch            2070f8ad9151dc8f3a73bffaa146b5e6937a583f -> FETCH_HEAD237Submodule path 'submodules/openssl/boringssl': checked out '2070f8ad9151dc8f3a73bffaa146b5e6937a583f'238From https://github.com/krb5/krb5239 * branch            890ca2f401924cdcb88f493950b04700bbe52db3 -> FETCH_HEAD240Submodule path 'submodules/openssl/krb5': checked out '890ca2f401924cdcb88f493950b04700bbe52db3'241From https://github.com/pyca/cryptography242 * branch            fa84d185c0fefa7d612759e02a26def2f948fe34 -> FETCH_HEAD243Submodule path 'submodules/openssl/pyca-cryptography': checked out 'fa84d185c0fefa7d612759e02a26def2f948fe34'244From https://github.com/google/wycheproof245 * branch            2196000605e45d91097147c9c71f26b72af58003 -> FETCH_HEAD246Submodule path 'submodules/openssl/wycheproof': checked out '2196000605e45d91097147c9c71f26b72af58003'247From https://github.com/quictls/openssl248 * branch              330feef3dcb69d95cd752d54cb9254b366bdc7cf -> FETCH_HEAD249Submodule path 'submodules/openssl3': checked out '330feef3dcb69d95cd752d54cb9254b366bdc7cf'250Submodule 'gost-engine' (https://github.com/gost-engine/engine) registered for path 'submodules/openssl3/gost-engine'251Submodule 'krb5' (https://github.com/krb5/krb5) registered for path 'submodules/openssl3/krb5'252Submodule 'oqs-provider' (https://github.com/open-quantum-safe/oqs-provider.git) registered for path 'submodules/openssl3/oqs-provider'253Submodule 'pyca.cryptography' (https://github.com/pyca/cryptography.git) registered for path 'submodules/openssl3/pyca-cryptography'254Submodule 'python-ecdsa' (https://github.com/tlsfuzzer/python-ecdsa) registered for path 'submodules/openssl3/python-ecdsa'255Submodule 'tlsfuzzer' (https://github.com/tlsfuzzer/tlsfuzzer) registered for path 'submodules/openssl3/tlsfuzzer'256Submodule 'tlslite-ng' (https://github.com/tlsfuzzer/tlslite-ng) registered for path 'submodules/openssl3/tlslite-ng'257Submodule 'wycheproof' (https://github.com/google/wycheproof) registered for path 'submodules/openssl3/wycheproof'258Cloning into '/work/proj/deps_rpi4/quicer/msquic/submodules/openssl3/gost-engine'...259Cloning into '/work/proj/deps_rpi4/quicer/msquic/submodules/openssl3/krb5'...260Cloning into '/work/proj/deps_rpi4/quicer/msquic/submodules/openssl3/oqs-provider'...261Cloning into '/work/proj/deps_rpi4/quicer/msquic/submodules/openssl3/pyca-cryptography'...262Cloning into '/work/proj/deps_rpi4/quicer/msquic/submodules/openssl3/python-ecdsa'...263Cloning into '/work/proj/deps_rpi4/quicer/msquic/submodules/openssl3/tlsfuzzer'...264Cloning into '/work/proj/deps_rpi4/quicer/msquic/submodules/openssl3/tlslite-ng'...265Cloning into '/work/proj/deps_rpi4/quicer/msquic/submodules/openssl3/wycheproof'...266From https://github.com/gost-engine/engine267 * branch            2a8a5e0ecaa3e3d6f4ec722a49aa72476755c2b7 -> FETCH_HEAD268Submodule path 'submodules/openssl3/gost-engine': checked out '2a8a5e0ecaa3e3d6f4ec722a49aa72476755c2b7'269Submodule 'libprov' (https://github.com/provider-corner/libprov.git) registered for path 'submodules/openssl3/gost-engine/libprov'270Cloning into '/work/proj/deps_rpi4/quicer/msquic/submodules/openssl3/gost-engine/libprov'...271From https://github.com/provider-corner/libprov272 * branch            8a126e09547630ef900177625626b6156052f0ee -> FETCH_HEAD273Submodule path 'submodules/openssl3/gost-engine/libprov': checked out '8a126e09547630ef900177625626b6156052f0ee'274From https://github.com/krb5/krb5275 * branch            aa9b4a2a64046afd2fab7cb49c346295874a5fb6 -> FETCH_HEAD276Submodule path 'submodules/openssl3/krb5': checked out 'aa9b4a2a64046afd2fab7cb49c346295874a5fb6'277From https://github.com/open-quantum-safe/oqs-provider278 * branch            3f3d8a8cf331c73a26fe93a598273997cb54eb4f -> FETCH_HEAD279Submodule path 'submodules/openssl3/oqs-provider': checked out '3f3d8a8cf331c73a26fe93a598273997cb54eb4f'280From https://github.com/pyca/cryptography281 * branch            c18d0567386414efa3caef7ed586c4ca75bf3a8b -> FETCH_HEAD282Submodule path 'submodules/openssl3/pyca-cryptography': checked out 'c18d0567386414efa3caef7ed586c4ca75bf3a8b'283From https://github.com/tlsfuzzer/python-ecdsa284 * branch            4de8d5bf89089d1140eb99aa5d7eb2dc8e6337b6 -> FETCH_HEAD285Submodule path 'submodules/openssl3/python-ecdsa': checked out '4de8d5bf89089d1140eb99aa5d7eb2dc8e6337b6'286From https://github.com/tlsfuzzer/tlsfuzzer287 * branch            dbd56c149072e656ca8d6a43a59588f3e7513da2 -> FETCH_HEAD288Submodule path 'submodules/openssl3/tlsfuzzer': checked out 'dbd56c149072e656ca8d6a43a59588f3e7513da2'289From https://github.com/tlsfuzzer/tlslite-ng290 * branch            771e9f59d639dbb0e2fa8e646c8e588405d3903e -> FETCH_HEAD291Submodule path 'submodules/openssl3/tlslite-ng': checked out '771e9f59d639dbb0e2fa8e646c8e588405d3903e'292From https://github.com/google/wycheproof293 * branch            2196000605e45d91097147c9c71f26b72af58003 -> FETCH_HEAD294Submodule path 'submodules/openssl3/wycheproof': checked out '2196000605e45d91097147c9c71f26b72af58003'295From https://github.com/microsoft/xdp-for-windows296 * branch            51bba848b1a7c571c7eb7226977a6f24c0abffd3 -> FETCH_HEAD297Submodule path 'submodules/xdp-for-windows': checked out '51bba848b1a7c571c7eb7226977a6f24c0abffd3'298Submodule 'submodules/ndis-driver-library' (https://github.com/microsoft/ndis-driver-library) registered for path 'submodules/xdp-for-windows/submodules/ndis-driver-library'299Submodule 'submodules/net-offloads' (https://github.com/microsoft/net-offloads.git) registered for path 'submodules/xdp-for-windows/submodules/net-offloads'300Submodule 'submodules/wil' (https://github.com/microsoft/wil) registered for path 'submodules/xdp-for-windows/submodules/wil'301Cloning into '/work/proj/deps_rpi4/quicer/msquic/submodules/xdp-for-windows/submodules/ndis-driver-library'...302Cloning into '/work/proj/deps_rpi4/quicer/msquic/submodules/xdp-for-windows/submodules/net-offloads'...303Cloning into '/work/proj/deps_rpi4/quicer/msquic/submodules/xdp-for-windows/submodules/wil'...304From https://github.com/microsoft/ndis-driver-library305 * branch            6bf878da1a54bf471d4d934cef6e26355860d386 -> FETCH_HEAD306Submodule path 'submodules/xdp-for-windows/submodules/ndis-driver-library': checked out '6bf878da1a54bf471d4d934cef6e26355860d386'307From https://github.com/microsoft/net-offloads308 * branch            02dbf4e58e3b7f752ba3d97d17c36d4cd5fdc490 -> FETCH_HEAD309Submodule path 'submodules/xdp-for-windows/submodules/net-offloads': checked out '02dbf4e58e3b7f752ba3d97d17c36d4cd5fdc490'310From https://github.com/microsoft/wil311 * branch            ae986e12b2fa722ba70e9761ae6897565293cbea -> FETCH_HEAD312Submodule path 'submodules/xdp-for-windows/submodules/wil': checked out 'ae986e12b2fa722ba70e9761ae6897565293cbea'313Patching Msquic 2.3.8314Patch patches/12edf3725475d4a99e5598df3289bace47b8f56e.patch already exists, skipping download315patching file src/inc/msquic_posix.h316Patch patches/e0201eb4e007e7524aef007be67f2281f949f102.patch already exists, skipping download317patching file src/core/binding.c318Patch patches/b16a14a72e8c74407ee4a079a1f57efe0246f739.patch already exists, skipping download319patching file src/generated/stdout/quic_trace.c320Patch patches/9261dacc1dd9a67f6fa8d5fbe663082508b4c605.patch already exists, skipping download321patching file src/platform/datapath_epoll.c322-- The C compiler identification is GNU 15.3.0323-- The CXX compiler identification is GNU 15.3.0324-- Detecting C compiler ABI info325-- Detecting C compiler ABI info - done326-- Check for working C compiler: /home/nerves/.nerves/artifacts/nerves_toolchain_aarch64_nerves_linux_gnu-linux_x86_64-15.3.1/bin/aarch64-nerves-linux-gnu-gcc - skipped327-- Detecting C compile features328-- Detecting C compile features - done329-- Detecting CXX compiler ABI info330-- Detecting CXX compiler ABI info - done331-- Check for working CXX compiler: /home/nerves/.nerves/artifacts/nerves_toolchain_aarch64_nerves_linux_gnu-linux_x86_64-15.3.1/bin/aarch64-nerves-linux-gnu-g++ - skipped332-- Detecting CXX compile features333-- Detecting CXX compile features - done334-- CMAKE Version: 3.28.3335-- Source Dir: /work/proj/deps_rpi4/quicer/msquic336-- Host System name: Linux337-- Setting policy 0091338-- System name: Linux339-- System version: 340-- Platform version: 341-- Build type: RelWithDebInfo342-- QUIC Platform: linux343-- Version Build ID: 0344-- Version Suffix: -private345-- Looking for _SC_PHYS_PAGES346-- Looking for _SC_PHYS_PAGES - found347-- Looking for sysconf348-- Looking for sysconf - found349-- Looking for UDP_SEGMENT350-- Looking for UDP_SEGMENT - found351-- Looking for SO_ATTACH_REUSEPORT_CBPF352-- Looking for SO_ATTACH_REUSEPORT_CBPF - found353-- Looking for sendmmsg354-- Looking for sendmmsg - found355-- Enabling OpenSsl configuration tests356-- Enabling CA file tests357-- QUIC_ENABLE_LOGGING is false. Disabling logging358-- Found libatomic: /home/nerves/.nerves/artifacts/nerves_system_rpi4-portable-2.1.2/staging/lib/libatomic.so359-- libnuma not found. If build fails, install libnuma360-- Enabling shared ephemeral port work around361-- Configuring for OpenSSL 1.1362-- Setting openssldir to /usr/lib/ssl363-- Configuring OpenSSL: /work/proj/deps_rpi4/quicer/msquic/submodules/openssl/config;CC=/home/nerves/.nerves/artifacts/nerves_toolchain_aarch64_nerves_linux_gnu-linux_x86_64-15.3.1/bin/aarch64-nerves-linux-gnu-gcc;CXX=/home/nerves/.nerves/artifacts/nerves_toolchain_aarch64_nerves_linux_gnu-linux_x86_64-15.3.1/bin/aarch64-nerves-linux-gnu-g++ enable-tls1_3;no-makedepend;no-dgram;no-ssl3;no-psk;no-srp;no-zlib;no-egd;no-idea;no-rc5;no-rc4;no-afalgeng;no-comp;no-cms;no-ct;no-srp;no-srtp;no-ts;no-gost;no-dso;no-ec2m;no-tls1;no-tls1_1;no-tls1_2;no-dtls;no-dtls1;no-dtls1_2;no-ssl;no-ssl3-method;no-tls1-method;no-tls1_1-method;no-tls1_2-method;no-dtls1-method;no-dtls1_2-method;no-siphash;no-whirlpool;no-aria;no-bf;no-blake2;no-sm2;no-sm3;no-sm4;no-camellia;no-cast;no-md4;no-mdc2;no-ocb;no-rc2;no-rmd160;no-scrypt;no-seed;no-weak-ssl-ciphers;no-shared;no-tests;--openssldir="/usr/lib/ssl";--prefix=/work/proj/deps_rpi4/quicer/c_build/_deps/opensslquic-build/openssl364-- Performing Test CMAKE_HAVE_LIBC_PTHREAD365-- Performing Test CMAKE_HAVE_LIBC_PTHREAD - Success366-- Found Threads: TRUE  367-- Configuring for OpenSSL368-- Configuring done (18.8s)369-- Generating done (0.7s)370-- Build files have been written to: /work/proj/deps_rpi4/quicer/c_build371make[1]: warning: -j6 forced in submake: resetting jobserver mode.372make[1]: Entering directory '/work/proj/deps_rpi4/quicer/c_build'373make[2]: Entering directory '/work/proj/deps_rpi4/quicer/c_build'374make[3]: Entering directory '/work/proj/deps_rpi4/quicer/c_build'375make[3]: Entering directory '/work/proj/deps_rpi4/quicer/c_build'376make[3]: Leaving directory '/work/proj/deps_rpi4/quicer/c_build'377make[3]: Entering directory '/work/proj/deps_rpi4/quicer/c_build'378make[3]: Leaving directory '/work/proj/deps_rpi4/quicer/c_build'379[  1%] Building C object msquic/src/core/CMakeFiles/core.dir/ack_tracker.c.o380make[3]: Entering directory '/work/proj/deps_rpi4/quicer/c_build'381[  2%] Building C object msquic/src/core/CMakeFiles/core.dir/binding.c.o382[  4%] Building C object msquic/src/core/CMakeFiles/core.dir/configuration.c.o383[  5%] Building C object msquic/src/core/CMakeFiles/core.dir/api.c.o384[  3%] Building C object msquic/src/core/CMakeFiles/core.dir/congestion_control.c.o385[  6%] OpenSSL configure386[  7%] Building C object msquic/src/core/CMakeFiles/core.dir/connection.c.o387[  8%] Building C object msquic/src/core/CMakeFiles/core.dir/crypto.c.o388[ 10%] Building C object msquic/src/core/CMakeFiles/core.dir/crypto_tls.c.o389Operating system: x86_64-whatever-linux2390[ 11%] Building C object msquic/src/core/CMakeFiles/core.dir/cubic.c.o391[ 12%] Building C object msquic/src/core/CMakeFiles/core.dir/bbr.c.o392Configuring OpenSSL version 1.1.1w+quic (0x1010117fL) for linux-x86_64393Using os-specific seed configuration394[ 13%] Building C object msquic/src/core/CMakeFiles/core.dir/datagram.c.o395[ 14%] Building C object msquic/src/core/CMakeFiles/core.dir/frame.c.o396[ 15%] Building C object msquic/src/core/CMakeFiles/core.dir/library.c.o397[ 16%] Building C object msquic/src/core/CMakeFiles/core.dir/listener.c.o398[ 17%] Building C object msquic/src/core/CMakeFiles/core.dir/lookup.c.o399[ 19%] Building C object msquic/src/core/CMakeFiles/core.dir/loss_detection.c.o400[ 20%] Building C object msquic/src/core/CMakeFiles/core.dir/mtu_discovery.c.o401[ 21%] Building C object msquic/src/core/CMakeFiles/core.dir/operation.c.o402[ 22%] Building C object msquic/src/core/CMakeFiles/core.dir/packet.c.o403[ 23%] Building C object msquic/src/core/CMakeFiles/core.dir/packet_builder.c.o404[ 24%] Building C object msquic/src/core/CMakeFiles/core.dir/packet_space.c.o405[ 25%] Building C object msquic/src/core/CMakeFiles/core.dir/path.c.o406[ 26%] Building C object msquic/src/core/CMakeFiles/core.dir/range.c.o407[ 28%] Building C object msquic/src/core/CMakeFiles/core.dir/recv_buffer.c.o408[ 29%] Building C object msquic/src/core/CMakeFiles/core.dir/registration.c.o409[ 30%] Building C object msquic/src/core/CMakeFiles/core.dir/send.c.o410[ 31%] Building C object msquic/src/core/CMakeFiles/core.dir/send_buffer.c.o411[ 32%] Building C object msquic/src/core/CMakeFiles/core.dir/sent_packet_metadata.c.o412[ 33%] Building C object msquic/src/core/CMakeFiles/core.dir/settings.c.o413[ 34%] Building C object msquic/src/core/CMakeFiles/core.dir/stream.c.o414[ 35%] Building C object msquic/src/core/CMakeFiles/core.dir/stream_recv.c.o415[ 37%] Building C object msquic/src/core/CMakeFiles/core.dir/stream_send.c.o416Creating configdata.pm417Creating Makefile418[ 38%] Building C object msquic/src/core/CMakeFiles/core.dir/stream_set.c.o419[ 39%] Building C object msquic/src/core/CMakeFiles/core.dir/timer_wheel.c.o420421**********************************************************************422***                                                                ***423***   OpenSSL has been successfully configured                     ***424***                                                                ***425***   If you encounter a problem while building, please open an    ***426***   issue on GitHub <https://github.com/openssl/openssl/issues>  ***427***   and include the output from the following command:           ***428***                                                                ***429***       perl configdata.pm --dump                                ***430***                                                                ***431***   (If you are new to OpenSSL, you might want to consult the    ***432***   'Troubleshooting' section in the INSTALL file first)         ***433***                                                                ***434**********************************************************************435[ 40%] OpenSSL build436make[4]: Entering directory '/work/proj/deps_rpi4/quicer/c_build/_deps/opensslquic-build/submodules/openssl'437make[4]: warning: -j6 forced in submake: resetting jobserver mode.438[ 41%] Building C object msquic/src/core/CMakeFiles/core.dir/worker.c.o439make[5]: Entering directory '/work/proj/deps_rpi4/quicer/c_build/_deps/opensslquic-build/submodules/openssl'440make[5]: Leaving directory '/work/proj/deps_rpi4/quicer/c_build/_deps/opensslquic-build/submodules/openssl'441make[5]: Entering directory '/work/proj/deps_rpi4/quicer/c_build/_deps/opensslquic-build/submodules/openssl'442aarch64-nerves-linux-gnu-gcc: error: unrecognized command-line option '-m64'443make[5]: *** [Makefile:661: apps/app_rand.o] Error 1444make[5]: *** Waiting for unfinished jobs....445aarch64-nerves-linux-gnu-gcc: error: unrecognized command-line option '-m64'446make[5]: *** [Makefile:663: apps/apps.o] Error 1447aarch64-nerves-linux-gnu-gcc: error: unrecognized command-line option '-m64'448make[5]: *** [Makefile:665: apps/bf_prefix.o] Error 1449aarch64-nerves-linux-gnu-gcc: error: unrecognized command-line option '-m64'450make[5]: *** [Makefile:667: apps/opt.o] Error 1451make[5]: Leaving directory '/work/proj/deps_rpi4/quicer/c_build/_deps/opensslquic-build/submodules/openssl'452make[4]: *** [Makefile:175: build_libs] Error 2453make[4]: Leaving directory '/work/proj/deps_rpi4/quicer/c_build/_deps/opensslquic-build/submodules/openssl'454make[3]: *** [_deps/opensslquic-build/CMakeFiles/OpenSSL_Target.dir/build.make:74: _deps/opensslquic-build/openssl/lib/libssl.a] Error 2455make[3]: Leaving directory '/work/proj/deps_rpi4/quicer/c_build'456make[2]: *** [CMakeFiles/Makefile2:265: _deps/opensslquic-build/CMakeFiles/OpenSSL_Target.dir/all] Error 2457make[2]: *** Waiting for unfinished jobs....458[ 42%] Building C object msquic/src/core/CMakeFiles/core.dir/version_neg.c.o459[ 43%] Building C object msquic/src/core/CMakeFiles/core.dir/sliding_window_extremum.c.o460[ 44%] Building C object msquic/src/core/CMakeFiles/core.dir/inline.c.o461[ 46%] Linking C static library ../../obj/Release/libcore.a462make[3]: Leaving directory '/work/proj/deps_rpi4/quicer/c_build'463[ 46%] Built target core464make[2]: Leaving directory '/work/proj/deps_rpi4/quicer/c_build'465make[1]: *** [Makefile:136: all] Error 2466make[1]: Leaving directory '/work/proj/deps_rpi4/quicer/c_build'467make: *** [Makefile:15: build-nif] Error 2468===> Hook for compile failed!469470** (Mix) Could not compile dependency :quicer, "/home/nerves/.mix/elixir/1-20-otp-29/rebar3 bare compile --paths /work/proj/_build/rpi4/lib/*/ebin" command failed. Errors may have been logged above. You can recompile this dependency with "mix deps.compile quicer --force", update it with "mix deps.update quicer" or clean it with "mix deps.clean quicer"