emqtt

Build log

nerves_system_x86_64

emqtt 1.16.1 · fail · run emqtt-1.16.1-1789560443264
563 of 563 lines
1Resolving Hex dependencies...2Resolution completed in 1.339s3Unchanged:4  circular_buffer 1.1.05  cowlib 2.20.0 VULNERABLE!6    EEF-CVE-2026-43971 (MEDIUM)7    aka: CVE-2026-439718    Link Header Directive Smuggling via Unescaped target/rel/Attribute Keys in cow_link:link/19    https://osv.dev/vulnerability/EEF-CVE-2026-439711011    EEF-CVE-2026-43966 (MEDIUM)12    aka: CVE-2026-43966, GHSA-w4f7-4cxr-rv3c13    HTTP Response Splitting via Non-VCHAR Bytes in cow_http_struct_hd:escape_string/214    https://osv.dev/vulnerability/EEF-CVE-2026-439661516    EEF-CVE-2026-43969 (LOW)17    aka: CVE-2026-43969, GHSA-g2wm-735q-3f5618    Cookie Request Header Injection via Unvalidated Encoder in cow_cookie:cookie/119    https://osv.dev/vulnerability/EEF-CVE-2026-4396920  elixir_make 0.10.021  emqtt 1.16.122  getopt 1.0.323  gun 2.6.0 VULNERABLE!24    GHSA-w4f7-4cxr-rv3c (MEDIUM)25    aka: CVE-2026-43966, EEF-CVE-2026-4396626    cowboy and gun affected by an HTTP Request/Response Splitting vulnerability27    https://osv.dev/vulnerability/GHSA-w4f7-4cxr-rv3c28  interactive_cmd 0.1.429  jason 1.4.530  nerves 1.15.031  nerves_discovery 0.1.532  nerves_logging 0.2.433  nerves_runtime 0.13.1334  nerves_system_bbb 2.30.235  nerves_system_br 1.34.436  nerves_system_mangopi_mq_pro 0.17.237  nerves_system_qemu_aarch64 0.4.238  nerves_system_rpi 2.1.239  nerves_system_rpi0 2.1.240  nerves_system_rpi0_2 2.1.241  nerves_system_rpi2 2.1.242  nerves_system_rpi3 2.1.243  nerves_system_rpi4 2.1.244  nerves_system_rpi5 2.1.245  nerves_system_x86_64 1.34.246  nerves_toolchain_aarch64_nerves_linux_gnu 15.3.147  nerves_toolchain_armv6_nerves_linux_gnueabihf 15.3.148  nerves_toolchain_armv7_nerves_linux_gnueabihf 15.3.149  nerves_toolchain_riscv64_nerves_linux_gnu 15.3.150  nerves_toolchain_x86_64_nerves_linux_musl 15.3.151  nerves_uevent 0.1.752  property_table 0.3.453  quicer 0.2.1554  ring_logger 0.11.755  shoehorn 0.9.356  snabbkaffe 1.0.1057  tablet 0.3.358  toolshed 0.5.059  uboot_env 1.0.260* Getting emqtt (Hex package)61* Getting nerves (Hex package)62* Getting shoehorn (Hex package)63* Getting ring_logger (Hex package)64* Getting toolshed (Hex package)65* Getting nerves_runtime (Hex package)66* Getting nerves_system_bbb (Hex package)67* Getting nerves_system_mangopi_mq_pro (Hex package)68* Getting nerves_system_qemu_aarch64 (Hex package)69* Getting nerves_system_rpi (Hex package)70* Getting nerves_system_rpi0 (Hex package)71* Getting nerves_system_rpi0_2 (Hex package)72* Getting nerves_system_rpi2 (Hex package)73* Getting nerves_system_rpi3 (Hex package)74* Getting nerves_system_rpi4 (Hex package)75* Getting nerves_system_rpi5 (Hex package)76* Getting nerves_system_x86_64 (Hex package)77* Getting nerves_system_br (Hex package)78* Getting nerves_toolchain_x86_64_nerves_linux_musl (Hex package)79* Getting nerves_toolchain_aarch64_nerves_linux_gnu (Hex package)80* Getting nerves_toolchain_armv7_nerves_linux_gnueabihf (Hex package)81* Getting nerves_toolchain_armv6_nerves_linux_gnueabihf (Hex package)82* Getting nerves_toolchain_riscv64_nerves_linux_gnu (Hex package)83* Getting nerves_logging (Hex package)84* Getting nerves_uevent (Hex package)85* Getting uboot_env (Hex package)86* Getting elixir_make (Hex package)87* Getting property_table (Hex package)88* Getting circular_buffer (Hex package)89* Getting interactive_cmd (Hex package)90* Getting jason (Hex package)91* Getting nerves_discovery (Hex package)92* Getting tablet (Hex package)93* Getting cowlib (Hex package)94* Getting getopt (Hex package)95* Getting gun (Hex package)96* Getting quicer (Hex package)97* Getting snabbkaffe (Hex package)98Found packages with security advisories, see above for details99You have added/upgraded packages you could sponsor, run `mix hex.sponsor` to learn more100==> jason101Compiling 10 files (.ex)102Generated jason app103==> tablet104Compiling 2 files (.ex)105Generated tablet app106==> elixir_make107Compiling 8 files (.ex)108Generated elixir_make app109==> nerves_discovery110Compiling 5 files (.ex)111Generated nerves_discovery app112==> interactive_cmd113Compiling 1 file (.ex)114Generated interactive_cmd app115==> nerves116HOST_CC port.o117HOST_LD port118Compiling 55 files (.ex)119Generated nerves app120==> nerves_compatibility_test121122Nerves environment123  MIX_TARGET:   x86_64124  MIX_ENV:      prod125126Checking for prebuilt Nerves artifacts...127  Found nerves_system_x86_64 in cache128    /home/nerves/.nerves/artifacts/nerves_system_x86_64-portable-1.34.2129  Found nerves_toolchain_x86_64_nerves_linux_musl in cache130    /home/nerves/.nerves/artifacts/nerves_toolchain_x86_64_nerves_linux_musl-linux_x86_64-15.3.1131==> nerves132==> nerves_compatibility_test133134Nerves environment135  MIX_TARGET:   x86_64136  MIX_ENV:      prod137138===> Analyzing applications...139===> Compiling snabbkaffe140./build.sh 'v2.3.8'141Cloning into 'msquic'...142Note: switching to 'e453ade8d9b35f53290fdbd111738f86150253a1'.143144You are in 'detached HEAD' state. You can look around, make experimental145changes and commit them, and you can discard any commits you make in this146state without impacting any branches by switching back to a branch.147148If you want to create a new branch to retain commits you create, you may149do so (now or later) by using -c with the switch command. Example:150151  git switch -c <new-branch-name>152153Or undo this operation with:154155  git switch -156157Turn off this advice by setting config variable advice.detachedHead to false158159Submodule 'submodules/clog' (https://github.com/microsoft/CLOG.git) registered for path 'submodules/clog'160Submodule 'submodules/googletest' (https://github.com/google/googletest) registered for path 'submodules/googletest'161Submodule 'submodules/openssl' (https://github.com/quictls/openssl.git) registered for path 'submodules/openssl'162Submodule 'submodules/openssl3' (https://github.com/quictls/openssl.git) registered for path 'submodules/openssl3'163Submodule 'submodules/xdp-for-windows' (https://github.com/microsoft/xdp-for-windows.git) registered for path 'submodules/xdp-for-windows'164Cloning into '/work/proj/deps_x86_64/quicer/msquic/submodules/clog'...165Cloning into '/work/proj/deps_x86_64/quicer/msquic/submodules/googletest'...166Cloning into '/work/proj/deps_x86_64/quicer/msquic/submodules/openssl'...167Cloning into '/work/proj/deps_x86_64/quicer/msquic/submodules/openssl3'...168Cloning into '/work/proj/deps_x86_64/quicer/msquic/submodules/xdp-for-windows'...169From https://github.com/microsoft/CLOG170 * branch            ca6e640fbf7f53ec9de915f1f4d852c10d874d13 -> FETCH_HEAD171Submodule path 'submodules/clog': checked out 'ca6e640fbf7f53ec9de915f1f4d852c10d874d13'172From https://github.com/google/googletest173 * branch            563ebf1769af08d448765c31064260e1a16fcced -> FETCH_HEAD174Submodule path 'submodules/googletest': checked out '563ebf1769af08d448765c31064260e1a16fcced'175From https://github.com/quictls/openssl176 * branch              612d8e44d687e4b71c4724319d7aa27a733bcbca -> FETCH_HEAD177Submodule path 'submodules/openssl': checked out '612d8e44d687e4b71c4724319d7aa27a733bcbca'178Submodule 'boringssl' (https://boringssl.googlesource.com/boringssl) registered for path 'submodules/openssl/boringssl'179Submodule 'krb5' (https://github.com/krb5/krb5) registered for path 'submodules/openssl/krb5'180Submodule 'pyca.cryptography' (https://github.com/pyca/cryptography.git) registered for path 'submodules/openssl/pyca-cryptography'181Submodule 'wycheproof' (https://github.com/google/wycheproof) registered for path 'submodules/openssl/wycheproof'182Cloning into '/work/proj/deps_x86_64/quicer/msquic/submodules/openssl/boringssl'...183Cloning into '/work/proj/deps_x86_64/quicer/msquic/submodules/openssl/krb5'...184Cloning into '/work/proj/deps_x86_64/quicer/msquic/submodules/openssl/pyca-cryptography'...185Cloning into '/work/proj/deps_x86_64/quicer/msquic/submodules/openssl/wycheproof'...186From https://boringssl.googlesource.com/boringssl187 * branch            2070f8ad9151dc8f3a73bffaa146b5e6937a583f -> FETCH_HEAD188Submodule path 'submodules/openssl/boringssl': checked out '2070f8ad9151dc8f3a73bffaa146b5e6937a583f'189From https://github.com/krb5/krb5190 * branch            890ca2f401924cdcb88f493950b04700bbe52db3 -> FETCH_HEAD191Submodule path 'submodules/openssl/krb5': checked out '890ca2f401924cdcb88f493950b04700bbe52db3'192From https://github.com/pyca/cryptography193 * branch            fa84d185c0fefa7d612759e02a26def2f948fe34 -> FETCH_HEAD194Submodule path 'submodules/openssl/pyca-cryptography': checked out 'fa84d185c0fefa7d612759e02a26def2f948fe34'195From https://github.com/google/wycheproof196 * branch            2196000605e45d91097147c9c71f26b72af58003 -> FETCH_HEAD197Submodule path 'submodules/openssl/wycheproof': checked out '2196000605e45d91097147c9c71f26b72af58003'198From https://github.com/quictls/openssl199 * branch              330feef3dcb69d95cd752d54cb9254b366bdc7cf -> FETCH_HEAD200Submodule path 'submodules/openssl3': checked out '330feef3dcb69d95cd752d54cb9254b366bdc7cf'201Submodule 'gost-engine' (https://github.com/gost-engine/engine) registered for path 'submodules/openssl3/gost-engine'202Submodule 'krb5' (https://github.com/krb5/krb5) registered for path 'submodules/openssl3/krb5'203Submodule 'oqs-provider' (https://github.com/open-quantum-safe/oqs-provider.git) registered for path 'submodules/openssl3/oqs-provider'204Submodule 'pyca.cryptography' (https://github.com/pyca/cryptography.git) registered for path 'submodules/openssl3/pyca-cryptography'205Submodule 'python-ecdsa' (https://github.com/tlsfuzzer/python-ecdsa) registered for path 'submodules/openssl3/python-ecdsa'206Submodule 'tlsfuzzer' (https://github.com/tlsfuzzer/tlsfuzzer) registered for path 'submodules/openssl3/tlsfuzzer'207Submodule 'tlslite-ng' (https://github.com/tlsfuzzer/tlslite-ng) registered for path 'submodules/openssl3/tlslite-ng'208Submodule 'wycheproof' (https://github.com/google/wycheproof) registered for path 'submodules/openssl3/wycheproof'209Cloning into '/work/proj/deps_x86_64/quicer/msquic/submodules/openssl3/gost-engine'...210Cloning into '/work/proj/deps_x86_64/quicer/msquic/submodules/openssl3/krb5'...211Cloning into '/work/proj/deps_x86_64/quicer/msquic/submodules/openssl3/oqs-provider'...212Cloning into '/work/proj/deps_x86_64/quicer/msquic/submodules/openssl3/pyca-cryptography'...213Cloning into '/work/proj/deps_x86_64/quicer/msquic/submodules/openssl3/python-ecdsa'...214Cloning into '/work/proj/deps_x86_64/quicer/msquic/submodules/openssl3/tlsfuzzer'...215Cloning into '/work/proj/deps_x86_64/quicer/msquic/submodules/openssl3/tlslite-ng'...216Cloning into '/work/proj/deps_x86_64/quicer/msquic/submodules/openssl3/wycheproof'...217From https://github.com/gost-engine/engine218 * branch            2a8a5e0ecaa3e3d6f4ec722a49aa72476755c2b7 -> FETCH_HEAD219Submodule path 'submodules/openssl3/gost-engine': checked out '2a8a5e0ecaa3e3d6f4ec722a49aa72476755c2b7'220Submodule 'libprov' (https://github.com/provider-corner/libprov.git) registered for path 'submodules/openssl3/gost-engine/libprov'221Cloning into '/work/proj/deps_x86_64/quicer/msquic/submodules/openssl3/gost-engine/libprov'...222From https://github.com/provider-corner/libprov223 * branch            8a126e09547630ef900177625626b6156052f0ee -> FETCH_HEAD224Submodule path 'submodules/openssl3/gost-engine/libprov': checked out '8a126e09547630ef900177625626b6156052f0ee'225From https://github.com/krb5/krb5226 * branch            aa9b4a2a64046afd2fab7cb49c346295874a5fb6 -> FETCH_HEAD227Submodule path 'submodules/openssl3/krb5': checked out 'aa9b4a2a64046afd2fab7cb49c346295874a5fb6'228From https://github.com/open-quantum-safe/oqs-provider229 * branch            3f3d8a8cf331c73a26fe93a598273997cb54eb4f -> FETCH_HEAD230Submodule path 'submodules/openssl3/oqs-provider': checked out '3f3d8a8cf331c73a26fe93a598273997cb54eb4f'231From https://github.com/pyca/cryptography232 * branch            c18d0567386414efa3caef7ed586c4ca75bf3a8b -> FETCH_HEAD233Submodule path 'submodules/openssl3/pyca-cryptography': checked out 'c18d0567386414efa3caef7ed586c4ca75bf3a8b'234From https://github.com/tlsfuzzer/python-ecdsa235 * branch            4de8d5bf89089d1140eb99aa5d7eb2dc8e6337b6 -> FETCH_HEAD236Submodule path 'submodules/openssl3/python-ecdsa': checked out '4de8d5bf89089d1140eb99aa5d7eb2dc8e6337b6'237From https://github.com/tlsfuzzer/tlsfuzzer238 * branch            dbd56c149072e656ca8d6a43a59588f3e7513da2 -> FETCH_HEAD239Submodule path 'submodules/openssl3/tlsfuzzer': checked out 'dbd56c149072e656ca8d6a43a59588f3e7513da2'240From https://github.com/tlsfuzzer/tlslite-ng241 * branch            771e9f59d639dbb0e2fa8e646c8e588405d3903e -> FETCH_HEAD242Submodule path 'submodules/openssl3/tlslite-ng': checked out '771e9f59d639dbb0e2fa8e646c8e588405d3903e'243From https://github.com/google/wycheproof244 * branch            2196000605e45d91097147c9c71f26b72af58003 -> FETCH_HEAD245Submodule path 'submodules/openssl3/wycheproof': checked out '2196000605e45d91097147c9c71f26b72af58003'246From https://github.com/microsoft/xdp-for-windows247 * branch            51bba848b1a7c571c7eb7226977a6f24c0abffd3 -> FETCH_HEAD248Submodule path 'submodules/xdp-for-windows': checked out '51bba848b1a7c571c7eb7226977a6f24c0abffd3'249Submodule 'submodules/ndis-driver-library' (https://github.com/microsoft/ndis-driver-library) registered for path 'submodules/xdp-for-windows/submodules/ndis-driver-library'250Submodule 'submodules/net-offloads' (https://github.com/microsoft/net-offloads.git) registered for path 'submodules/xdp-for-windows/submodules/net-offloads'251Submodule 'submodules/wil' (https://github.com/microsoft/wil) registered for path 'submodules/xdp-for-windows/submodules/wil'252Cloning into '/work/proj/deps_x86_64/quicer/msquic/submodules/xdp-for-windows/submodules/ndis-driver-library'...253Cloning into '/work/proj/deps_x86_64/quicer/msquic/submodules/xdp-for-windows/submodules/net-offloads'...254Cloning into '/work/proj/deps_x86_64/quicer/msquic/submodules/xdp-for-windows/submodules/wil'...255From https://github.com/microsoft/ndis-driver-library256 * branch            6bf878da1a54bf471d4d934cef6e26355860d386 -> FETCH_HEAD257Submodule path 'submodules/xdp-for-windows/submodules/ndis-driver-library': checked out '6bf878da1a54bf471d4d934cef6e26355860d386'258From https://github.com/microsoft/net-offloads259 * branch            02dbf4e58e3b7f752ba3d97d17c36d4cd5fdc490 -> FETCH_HEAD260Submodule path 'submodules/xdp-for-windows/submodules/net-offloads': checked out '02dbf4e58e3b7f752ba3d97d17c36d4cd5fdc490'261From https://github.com/microsoft/wil262 * branch            ae986e12b2fa722ba70e9761ae6897565293cbea -> FETCH_HEAD263Submodule path 'submodules/xdp-for-windows/submodules/wil': checked out 'ae986e12b2fa722ba70e9761ae6897565293cbea'264Patching Msquic 2.3.8265Patch patches/12edf3725475d4a99e5598df3289bace47b8f56e.patch already exists, skipping download266patching file src/inc/msquic_posix.h267Patch patches/e0201eb4e007e7524aef007be67f2281f949f102.patch already exists, skipping download268patching file src/core/binding.c269Patch patches/b16a14a72e8c74407ee4a079a1f57efe0246f739.patch already exists, skipping download270patching file src/generated/stdout/quic_trace.c271Patch patches/9261dacc1dd9a67f6fa8d5fbe663082508b4c605.patch already exists, skipping download272patching file src/platform/datapath_epoll.c273-- The C compiler identification is GNU 15.3.0274-- The CXX compiler identification is GNU 15.3.0275-- Detecting C compiler ABI info276-- Detecting C compiler ABI info - done277-- Check for working C compiler: /home/nerves/.nerves/artifacts/nerves_toolchain_x86_64_nerves_linux_musl-linux_x86_64-15.3.1/bin/x86_64-nerves-linux-musl-gcc - skipped278-- Detecting C compile features279-- Detecting C compile features - done280-- Detecting CXX compiler ABI info281-- Detecting CXX compiler ABI info - done282-- Check for working CXX compiler: /home/nerves/.nerves/artifacts/nerves_toolchain_x86_64_nerves_linux_musl-linux_x86_64-15.3.1/bin/x86_64-nerves-linux-musl-g++ - skipped283-- Detecting CXX compile features284-- Detecting CXX compile features - done285-- CMAKE Version: 3.28.3286-- Source Dir: /work/proj/deps_x86_64/quicer/msquic287-- Host System name: Linux288-- Setting policy 0091289-- System name: Linux290-- System version: 291-- Platform version: 292-- Build type: RelWithDebInfo293-- QUIC Platform: linux294-- Version Build ID: 0295-- Version Suffix: -private296-- Looking for _SC_PHYS_PAGES297-- Looking for _SC_PHYS_PAGES - found298-- Looking for sysconf299-- Looking for sysconf - found300-- Looking for UDP_SEGMENT301-- Looking for UDP_SEGMENT - found302-- Looking for SO_ATTACH_REUSEPORT_CBPF303-- Looking for SO_ATTACH_REUSEPORT_CBPF - found304-- Looking for sendmmsg305-- Looking for sendmmsg - found306-- Enabling OpenSsl configuration tests307-- Enabling CA file tests308-- QUIC_ENABLE_LOGGING is false. Disabling logging309-- Found libatomic: /home/nerves/.nerves/artifacts/nerves_system_x86_64-portable-1.34.2/staging/lib/libatomic.so310-- libnuma not found. If build fails, install libnuma311-- Enabling shared ephemeral port work around312-- Configuring for OpenSSL 1.1313-- Setting openssldir to /usr/lib/ssl314-- Configuring OpenSSL: /work/proj/deps_x86_64/quicer/msquic/submodules/openssl/config;CC=/home/nerves/.nerves/artifacts/nerves_toolchain_x86_64_nerves_linux_musl-linux_x86_64-15.3.1/bin/x86_64-nerves-linux-musl-gcc;CXX=/home/nerves/.nerves/artifacts/nerves_toolchain_x86_64_nerves_linux_musl-linux_x86_64-15.3.1/bin/x86_64-nerves-linux-musl-g++ enable-tls1_3;no-makedepend;no-dgram;no-ssl3;no-psk;no-srp;no-zlib;no-egd;no-idea;no-rc5;no-rc4;no-afalgeng;no-comp;no-cms;no-ct;no-srp;no-srtp;no-ts;no-gost;no-dso;no-ec2m;no-tls1;no-tls1_1;no-tls1_2;no-dtls;no-dtls1;no-dtls1_2;no-ssl;no-ssl3-method;no-tls1-method;no-tls1_1-method;no-tls1_2-method;no-dtls1-method;no-dtls1_2-method;no-siphash;no-whirlpool;no-aria;no-bf;no-blake2;no-sm2;no-sm3;no-sm4;no-camellia;no-cast;no-md4;no-mdc2;no-ocb;no-rc2;no-rmd160;no-scrypt;no-seed;no-weak-ssl-ciphers;no-shared;no-tests;--openssldir="/usr/lib/ssl";--prefix=/work/proj/deps_x86_64/quicer/c_build/_deps/opensslquic-build/openssl315-- Performing Test CMAKE_HAVE_LIBC_PTHREAD316-- Performing Test CMAKE_HAVE_LIBC_PTHREAD - Success317-- Found Threads: TRUE  318-- Configuring for OpenSSL319-- Configuring done (10.6s)320-- Generating done (0.2s)321-- Build files have been written to: /work/proj/deps_x86_64/quicer/c_build322make[1]: warning: -j6 forced in submake: resetting jobserver mode.323make[1]: Entering directory '/work/proj/deps_x86_64/quicer/c_build'324make[2]: Entering directory '/work/proj/deps_x86_64/quicer/c_build'325make[3]: Entering directory '/work/proj/deps_x86_64/quicer/c_build'326make[3]: Entering directory '/work/proj/deps_x86_64/quicer/c_build'327make[3]: Leaving directory '/work/proj/deps_x86_64/quicer/c_build'328make[3]: Entering directory '/work/proj/deps_x86_64/quicer/c_build'329make[3]: Leaving directory '/work/proj/deps_x86_64/quicer/c_build'330make[3]: Entering directory '/work/proj/deps_x86_64/quicer/c_build'331[  1%] Building C object msquic/src/core/CMakeFiles/core.dir/ack_tracker.c.o332[  2%] OpenSSL configure333[  3%] Building C object msquic/src/core/CMakeFiles/core.dir/binding.c.o334[  4%] Building C object msquic/src/core/CMakeFiles/core.dir/api.c.o335[  5%] Building C object msquic/src/core/CMakeFiles/core.dir/configuration.c.o336[  6%] Building C object msquic/src/core/CMakeFiles/core.dir/congestion_control.c.o337[  7%] Building C object msquic/src/core/CMakeFiles/core.dir/connection.c.o338Operating system: x86_64-whatever-linux2339[  8%] Building C object msquic/src/core/CMakeFiles/core.dir/crypto.c.o340[ 10%] Building C object msquic/src/core/CMakeFiles/core.dir/crypto_tls.c.o341[ 11%] Building C object msquic/src/core/CMakeFiles/core.dir/cubic.c.o342[ 12%] Building C object msquic/src/core/CMakeFiles/core.dir/bbr.c.o343Configuring OpenSSL version 1.1.1w+quic (0x1010117fL) for linux-x86_64344Using os-specific seed configuration345[ 13%] Building C object msquic/src/core/CMakeFiles/core.dir/datagram.c.o346[ 14%] Building C object msquic/src/core/CMakeFiles/core.dir/frame.c.o347[ 15%] Building C object msquic/src/core/CMakeFiles/core.dir/library.c.o348[ 16%] Building C object msquic/src/core/CMakeFiles/core.dir/listener.c.o349[ 17%] Building C object msquic/src/core/CMakeFiles/core.dir/lookup.c.o350[ 19%] Building C object msquic/src/core/CMakeFiles/core.dir/loss_detection.c.o351[ 20%] Building C object msquic/src/core/CMakeFiles/core.dir/mtu_discovery.c.o352[ 21%] Building C object msquic/src/core/CMakeFiles/core.dir/operation.c.o353[ 22%] Building C object msquic/src/core/CMakeFiles/core.dir/packet.c.o354[ 23%] Building C object msquic/src/core/CMakeFiles/core.dir/packet_builder.c.o355[ 24%] Building C object msquic/src/core/CMakeFiles/core.dir/packet_space.c.o356[ 25%] Building C object msquic/src/core/CMakeFiles/core.dir/path.c.o357[ 26%] Building C object msquic/src/core/CMakeFiles/core.dir/recv_buffer.c.o358[ 28%] Building C object msquic/src/core/CMakeFiles/core.dir/range.c.o359[ 29%] Building C object msquic/src/core/CMakeFiles/core.dir/registration.c.o360[ 30%] Building C object msquic/src/core/CMakeFiles/core.dir/send.c.o361[ 31%] Building C object msquic/src/core/CMakeFiles/core.dir/send_buffer.c.o362[ 32%] Building C object msquic/src/core/CMakeFiles/core.dir/sent_packet_metadata.c.o363[ 33%] Building C object msquic/src/core/CMakeFiles/core.dir/settings.c.o364Creating configdata.pm365Creating Makefile366[ 34%] Building C object msquic/src/core/CMakeFiles/core.dir/stream.c.o367[ 35%] Building C object msquic/src/core/CMakeFiles/core.dir/stream_recv.c.o368[ 37%] Building C object msquic/src/core/CMakeFiles/core.dir/stream_send.c.o369370**********************************************************************371***                                                                ***372***   OpenSSL has been successfully configured                     ***373***                                                                ***374***   If you encounter a problem while building, please open an    ***375***   issue on GitHub <https://github.com/openssl/openssl/issues>  ***376***   and include the output from the following command:           ***377***                                                                ***378***       perl configdata.pm --dump                                ***379***                                                                ***380***   (If you are new to OpenSSL, you might want to consult the    ***381***   'Troubleshooting' section in the INSTALL file first)         ***382***                                                                ***383**********************************************************************384[ 38%] OpenSSL build385make[4]: Entering directory '/work/proj/deps_x86_64/quicer/c_build/_deps/opensslquic-build/submodules/openssl'386make[4]: warning: -j6 forced in submake: resetting jobserver mode.387[ 39%] Building C object msquic/src/core/CMakeFiles/core.dir/stream_set.c.o388[ 40%] Building C object msquic/src/core/CMakeFiles/core.dir/timer_wheel.c.o389[ 41%] Building C object msquic/src/core/CMakeFiles/core.dir/worker.c.o390make[5]: Entering directory '/work/proj/deps_x86_64/quicer/c_build/_deps/opensslquic-build/submodules/openssl'391make[5]: Leaving directory '/work/proj/deps_x86_64/quicer/c_build/_deps/opensslquic-build/submodules/openssl'392[ 42%] Building C object msquic/src/core/CMakeFiles/core.dir/version_neg.c.o393make[5]: Entering directory '/work/proj/deps_x86_64/quicer/c_build/_deps/opensslquic-build/submodules/openssl'394[ 43%] Building C object msquic/src/core/CMakeFiles/core.dir/sliding_window_extremum.c.o395[ 44%] Building C object msquic/src/core/CMakeFiles/core.dir/inline.c.o396[ 46%] Linking C static library ../../obj/Release/libcore.a397make[3]: Leaving directory '/work/proj/deps_x86_64/quicer/c_build'398[ 46%] Built target core399/home/nerves/.nerves/artifacts/nerves_toolchain_x86_64_nerves_linux_musl-linux_x86_64-15.3.1/bin/x86_64-nerves-linux-musl-ar: creating apps/libapps.a400/home/nerves/.nerves/artifacts/nerves_toolchain_x86_64_nerves_linux_musl-linux_x86_64-15.3.1/bin/x86_64-nerves-linux-musl-ar: creating libcrypto.a401/home/nerves/.nerves/artifacts/nerves_toolchain_x86_64_nerves_linux_musl-linux_x86_64-15.3.1/bin/x86_64-nerves-linux-musl-ar: creating libssl.a402make[5]: Leaving directory '/work/proj/deps_x86_64/quicer/c_build/_deps/opensslquic-build/submodules/openssl'403created directory `/work/proj/deps_x86_64/quicer/c_build/_deps/opensslquic-build/openssl/lib'404*** Installing runtime libraries405*** Installing development files406created directory `/work/proj/deps_x86_64/quicer/c_build/_deps/opensslquic-build/openssl/include/openssl'407install ../../../../../msquic/submodules/openssl/include/openssl/aes.h -> /work/proj/deps_x86_64/quicer/c_build/_deps/opensslquic-build/openssl/include/openssl/aes.h408install ../../../../../msquic/submodules/openssl/include/openssl/asn1.h -> /work/proj/deps_x86_64/quicer/c_build/_deps/opensslquic-build/openssl/include/openssl/asn1.h409install ../../../../../msquic/submodules/openssl/include/openssl/asn1_mac.h -> /work/proj/deps_x86_64/quicer/c_build/_deps/opensslquic-build/openssl/include/openssl/asn1_mac.h410install ../../../../../msquic/submodules/openssl/include/openssl/asn1err.h -> /work/proj/deps_x86_64/quicer/c_build/_deps/opensslquic-build/openssl/include/openssl/asn1err.h411install ../../../../../msquic/submodules/openssl/include/openssl/asn1t.h -> /work/proj/deps_x86_64/quicer/c_build/_deps/opensslquic-build/openssl/include/openssl/asn1t.h412install ../../../../../msquic/submodules/openssl/include/openssl/async.h -> /work/proj/deps_x86_64/quicer/c_build/_deps/opensslquic-build/openssl/include/openssl/async.h413install ../../../../../msquic/submodules/openssl/include/openssl/asyncerr.h -> /work/proj/deps_x86_64/quicer/c_build/_deps/opensslquic-build/openssl/include/openssl/asyncerr.h414install ../../../../../msquic/submodules/openssl/include/openssl/bio.h -> /work/proj/deps_x86_64/quicer/c_build/_deps/opensslquic-build/openssl/include/openssl/bio.h415install ../../../../../msquic/submodules/openssl/include/openssl/bioerr.h -> /work/proj/deps_x86_64/quicer/c_build/_deps/opensslquic-build/openssl/include/openssl/bioerr.h416install ../../../../../msquic/submodules/openssl/include/openssl/blowfish.h -> /work/proj/deps_x86_64/quicer/c_build/_deps/opensslquic-build/openssl/include/openssl/blowfish.h417install ../../../../../msquic/submodules/openssl/include/openssl/bn.h -> /work/proj/deps_x86_64/quicer/c_build/_deps/opensslquic-build/openssl/include/openssl/bn.h418install ../../../../../msquic/submodules/openssl/include/openssl/bnerr.h -> /work/proj/deps_x86_64/quicer/c_build/_deps/opensslquic-build/openssl/include/openssl/bnerr.h419install ../../../../../msquic/submodules/openssl/include/openssl/buffer.h -> /work/proj/deps_x86_64/quicer/c_build/_deps/opensslquic-build/openssl/include/openssl/buffer.h420install ../../../../../msquic/submodules/openssl/include/openssl/buffererr.h -> /work/proj/deps_x86_64/quicer/c_build/_deps/opensslquic-build/openssl/include/openssl/buffererr.h421install ../../../../../msquic/submodules/openssl/include/openssl/camellia.h -> /work/proj/deps_x86_64/quicer/c_build/_deps/opensslquic-build/openssl/include/openssl/camellia.h422install ../../../../../msquic/submodules/openssl/include/openssl/cast.h -> /work/proj/deps_x86_64/quicer/c_build/_deps/opensslquic-build/openssl/include/openssl/cast.h423install ../../../../../msquic/submodules/openssl/include/openssl/cmac.h -> /work/proj/deps_x86_64/quicer/c_build/_deps/opensslquic-build/openssl/include/openssl/cmac.h424install ../../../../../msquic/submodules/openssl/include/openssl/cms.h -> /work/proj/deps_x86_64/quicer/c_build/_deps/opensslquic-build/openssl/include/openssl/cms.h425install ../../../../../msquic/submodules/openssl/include/openssl/cmserr.h -> /work/proj/deps_x86_64/quicer/c_build/_deps/opensslquic-build/openssl/include/openssl/cmserr.h426install ../../../../../msquic/submodules/openssl/include/openssl/comp.h -> /work/proj/deps_x86_64/quicer/c_build/_deps/opensslquic-build/openssl/include/openssl/comp.h427install ../../../../../msquic/submodules/openssl/include/openssl/comperr.h -> /work/proj/deps_x86_64/quicer/c_build/_deps/opensslquic-build/openssl/include/openssl/comperr.h428install ../../../../../msquic/submodules/openssl/include/openssl/conf.h -> /work/proj/deps_x86_64/quicer/c_build/_deps/opensslquic-build/openssl/include/openssl/conf.h429install ../../../../../msquic/submodules/openssl/include/openssl/conf_api.h -> /work/proj/deps_x86_64/quicer/c_build/_deps/opensslquic-build/openssl/include/openssl/conf_api.h430install ../../../../../msquic/submodules/openssl/include/openssl/conferr.h -> /work/proj/deps_x86_64/quicer/c_build/_deps/opensslquic-build/openssl/include/openssl/conferr.h431install ../../../../../msquic/submodules/openssl/include/openssl/crypto.h -> /work/proj/deps_x86_64/quicer/c_build/_deps/opensslquic-build/openssl/include/openssl/crypto.h432install ../../../../../msquic/submodules/openssl/include/openssl/cryptoerr.h -> /work/proj/deps_x86_64/quicer/c_build/_deps/opensslquic-build/openssl/include/openssl/cryptoerr.h433install ../../../../../msquic/submodules/openssl/include/openssl/ct.h -> /work/proj/deps_x86_64/quicer/c_build/_deps/opensslquic-build/openssl/include/openssl/ct.h434install ../../../../../msquic/submodules/openssl/include/openssl/cterr.h -> /work/proj/deps_x86_64/quicer/c_build/_deps/opensslquic-build/openssl/include/openssl/cterr.h435install ../../../../../msquic/submodules/openssl/include/openssl/des.h -> /work/proj/deps_x86_64/quicer/c_build/_deps/opensslquic-build/openssl/include/openssl/des.h436install ../../../../../msquic/submodules/openssl/include/openssl/dh.h -> /work/proj/deps_x86_64/quicer/c_build/_deps/opensslquic-build/openssl/include/openssl/dh.h437install ../../../../../msquic/submodules/openssl/include/openssl/dherr.h -> /work/proj/deps_x86_64/quicer/c_build/_deps/opensslquic-build/openssl/include/openssl/dherr.h438install ../../../../../msquic/submodules/openssl/include/openssl/dsa.h -> /work/proj/deps_x86_64/quicer/c_build/_deps/opensslquic-build/openssl/include/openssl/dsa.h439install ../../../../../msquic/submodules/openssl/include/openssl/dsaerr.h -> /work/proj/deps_x86_64/quicer/c_build/_deps/opensslquic-build/openssl/include/openssl/dsaerr.h440install ../../../../../msquic/submodules/openssl/include/openssl/dtls1.h -> /work/proj/deps_x86_64/quicer/c_build/_deps/opensslquic-build/openssl/include/openssl/dtls1.h441install ../../../../../msquic/submodules/openssl/include/openssl/e_os2.h -> /work/proj/deps_x86_64/quicer/c_build/_deps/opensslquic-build/openssl/include/openssl/e_os2.h442install ../../../../../msquic/submodules/openssl/include/openssl/ebcdic.h -> /work/proj/deps_x86_64/quicer/c_build/_deps/opensslquic-build/openssl/include/openssl/ebcdic.h443install ../../../../../msquic/submodules/openssl/include/openssl/ec.h -> /work/proj/deps_x86_64/quicer/c_build/_deps/opensslquic-build/openssl/include/openssl/ec.h444install ../../../../../msquic/submodules/openssl/include/openssl/ecdh.h -> /work/proj/deps_x86_64/quicer/c_build/_deps/opensslquic-build/openssl/include/openssl/ecdh.h445install ../../../../../msquic/submodules/openssl/include/openssl/ecdsa.h -> /work/proj/deps_x86_64/quicer/c_build/_deps/opensslquic-build/openssl/include/openssl/ecdsa.h446install ../../../../../msquic/submodules/openssl/include/openssl/ecerr.h -> /work/proj/deps_x86_64/quicer/c_build/_deps/opensslquic-build/openssl/include/openssl/ecerr.h447install ../../../../../msquic/submodules/openssl/include/openssl/engine.h -> /work/proj/deps_x86_64/quicer/c_build/_deps/opensslquic-build/openssl/include/openssl/engine.h448install ../../../../../msquic/submodules/openssl/include/openssl/engineerr.h -> /work/proj/deps_x86_64/quicer/c_build/_deps/opensslquic-build/openssl/include/openssl/engineerr.h449install ../../../../../msquic/submodules/openssl/include/openssl/err.h -> /work/proj/deps_x86_64/quicer/c_build/_deps/opensslquic-build/openssl/include/openssl/err.h450install ../../../../../msquic/submodules/openssl/include/openssl/evp.h -> /work/proj/deps_x86_64/quicer/c_build/_deps/opensslquic-build/openssl/include/openssl/evp.h451install ../../../../../msquic/submodules/openssl/include/openssl/evperr.h -> /work/proj/deps_x86_64/quicer/c_build/_deps/opensslquic-build/openssl/include/openssl/evperr.h452install ../../../../../msquic/submodules/openssl/include/openssl/hmac.h -> /work/proj/deps_x86_64/quicer/c_build/_deps/opensslquic-build/openssl/include/openssl/hmac.h453install ../../../../../msquic/submodules/openssl/include/openssl/idea.h -> /work/proj/deps_x86_64/quicer/c_build/_deps/opensslquic-build/openssl/include/openssl/idea.h454install ../../../../../msquic/submodules/openssl/include/openssl/kdf.h -> /work/proj/deps_x86_64/quicer/c_build/_deps/opensslquic-build/openssl/include/openssl/kdf.h455install ../../../../../msquic/submodules/openssl/include/openssl/kdferr.h -> /work/proj/deps_x86_64/quicer/c_build/_deps/opensslquic-build/openssl/include/openssl/kdferr.h456install ../../../../../msquic/submodules/openssl/include/openssl/lhash.h -> /work/proj/deps_x86_64/quicer/c_build/_deps/opensslquic-build/openssl/include/openssl/lhash.h457install ../../../../../msquic/submodules/openssl/include/openssl/md2.h -> /work/proj/deps_x86_64/quicer/c_build/_deps/opensslquic-build/openssl/include/openssl/md2.h458install ../../../../../msquic/submodules/openssl/include/openssl/md4.h -> /work/proj/deps_x86_64/quicer/c_build/_deps/opensslquic-build/openssl/include/openssl/md4.h459install ../../../../../msquic/submodules/openssl/include/openssl/md5.h -> /work/proj/deps_x86_64/quicer/c_build/_deps/opensslquic-build/openssl/include/openssl/md5.h460install ../../../../../msquic/submodules/openssl/include/openssl/mdc2.h -> /work/proj/deps_x86_64/quicer/c_build/_deps/opensslquic-build/openssl/include/openssl/mdc2.h461install ../../../../../msquic/submodules/openssl/include/openssl/modes.h -> /work/proj/deps_x86_64/quicer/c_build/_deps/opensslquic-build/openssl/include/openssl/modes.h462install ../../../../../msquic/submodules/openssl/include/openssl/obj_mac.h -> /work/proj/deps_x86_64/quicer/c_build/_deps/opensslquic-build/openssl/include/openssl/obj_mac.h463install ../../../../../msquic/submodules/openssl/include/openssl/objects.h -> /work/proj/deps_x86_64/quicer/c_build/_deps/opensslquic-build/openssl/include/openssl/objects.h464install ../../../../../msquic/submodules/openssl/include/openssl/objectserr.h -> /work/proj/deps_x86_64/quicer/c_build/_deps/opensslquic-build/openssl/include/openssl/objectserr.h465install ../../../../../msquic/submodules/openssl/include/openssl/ocsp.h -> /work/proj/deps_x86_64/quicer/c_build/_deps/opensslquic-build/openssl/include/openssl/ocsp.h466install ../../../../../msquic/submodules/openssl/include/openssl/ocsperr.h -> /work/proj/deps_x86_64/quicer/c_build/_deps/opensslquic-build/openssl/include/openssl/ocsperr.h467install ../../../../../msquic/submodules/openssl/include/openssl/opensslv.h -> /work/proj/deps_x86_64/quicer/c_build/_deps/opensslquic-build/openssl/include/openssl/opensslv.h468install ../../../../../msquic/submodules/openssl/include/openssl/ossl_typ.h -> /work/proj/deps_x86_64/quicer/c_build/_deps/opensslquic-build/openssl/include/openssl/ossl_typ.h469install ../../../../../msquic/submodules/openssl/include/openssl/pem.h -> /work/proj/deps_x86_64/quicer/c_build/_deps/opensslquic-build/openssl/include/openssl/pem.h470install ../../../../../msquic/submodules/openssl/include/openssl/pem2.h -> /work/proj/deps_x86_64/quicer/c_build/_deps/opensslquic-build/openssl/include/openssl/pem2.h471install ../../../../../msquic/submodules/openssl/include/openssl/pemerr.h -> /work/proj/deps_x86_64/quicer/c_build/_deps/opensslquic-build/openssl/include/openssl/pemerr.h472install ../../../../../msquic/submodules/openssl/include/openssl/pkcs12.h -> /work/proj/deps_x86_64/quicer/c_build/_deps/opensslquic-build/openssl/include/openssl/pkcs12.h473install ../../../../../msquic/submodules/openssl/include/openssl/pkcs12err.h -> /work/proj/deps_x86_64/quicer/c_build/_deps/opensslquic-build/openssl/include/openssl/pkcs12err.h474install ../../../../../msquic/submodules/openssl/include/openssl/pkcs7.h -> /work/proj/deps_x86_64/quicer/c_build/_deps/opensslquic-build/openssl/include/openssl/pkcs7.h475install ../../../../../msquic/submodules/openssl/include/openssl/pkcs7err.h -> /work/proj/deps_x86_64/quicer/c_build/_deps/opensslquic-build/openssl/include/openssl/pkcs7err.h476install ../../../../../msquic/submodules/openssl/include/openssl/rand.h -> /work/proj/deps_x86_64/quicer/c_build/_deps/opensslquic-build/openssl/include/openssl/rand.h477install ../../../../../msquic/submodules/openssl/include/openssl/rand_drbg.h -> /work/proj/deps_x86_64/quicer/c_build/_deps/opensslquic-build/openssl/include/openssl/rand_drbg.h478install ../../../../../msquic/submodules/openssl/include/openssl/randerr.h -> /work/proj/deps_x86_64/quicer/c_build/_deps/opensslquic-build/openssl/include/openssl/randerr.h479install ../../../../../msquic/submodules/openssl/include/openssl/rc2.h -> /work/proj/deps_x86_64/quicer/c_build/_deps/opensslquic-build/openssl/include/openssl/rc2.h480install ../../../../../msquic/submodules/openssl/include/openssl/rc4.h -> /work/proj/deps_x86_64/quicer/c_build/_deps/opensslquic-build/openssl/include/openssl/rc4.h481install ../../../../../msquic/submodules/openssl/include/openssl/rc5.h -> /work/proj/deps_x86_64/quicer/c_build/_deps/opensslquic-build/openssl/include/openssl/rc5.h482install ../../../../../msquic/submodules/openssl/include/openssl/ripemd.h -> /work/proj/deps_x86_64/quicer/c_build/_deps/opensslquic-build/openssl/include/openssl/ripemd.h483install ../../../../../msquic/submodules/openssl/include/openssl/rsa.h -> /work/proj/deps_x86_64/quicer/c_build/_deps/opensslquic-build/openssl/include/openssl/rsa.h484install ../../../../../msquic/submodules/openssl/include/openssl/rsaerr.h -> /work/proj/deps_x86_64/quicer/c_build/_deps/opensslquic-build/openssl/include/openssl/rsaerr.h485install ../../../../../msquic/submodules/openssl/include/openssl/safestack.h -> /work/proj/deps_x86_64/quicer/c_build/_deps/opensslquic-build/openssl/include/openssl/safestack.h486install ../../../../../msquic/submodules/openssl/include/openssl/seed.h -> /work/proj/deps_x86_64/quicer/c_build/_deps/opensslquic-build/openssl/include/openssl/seed.h487install ../../../../../msquic/submodules/openssl/include/openssl/sha.h -> /work/proj/deps_x86_64/quicer/c_build/_deps/opensslquic-build/openssl/include/openssl/sha.h488install ../../../../../msquic/submodules/openssl/include/openssl/srp.h -> /work/proj/deps_x86_64/quicer/c_build/_deps/opensslquic-build/openssl/include/openssl/srp.h489install ../../../../../msquic/submodules/openssl/include/openssl/srtp.h -> /work/proj/deps_x86_64/quicer/c_build/_deps/opensslquic-build/openssl/include/openssl/srtp.h490install ../../../../../msquic/submodules/openssl/include/openssl/ssl.h -> /work/proj/deps_x86_64/quicer/c_build/_deps/opensslquic-build/openssl/include/openssl/ssl.h491install ../../../../../msquic/submodules/openssl/include/openssl/ssl2.h -> /work/proj/deps_x86_64/quicer/c_build/_deps/opensslquic-build/openssl/include/openssl/ssl2.h492install ../../../../../msquic/submodules/openssl/include/openssl/ssl3.h -> /work/proj/deps_x86_64/quicer/c_build/_deps/opensslquic-build/openssl/include/openssl/ssl3.h493install ../../../../../msquic/submodules/openssl/include/openssl/sslerr.h -> /work/proj/deps_x86_64/quicer/c_build/_deps/opensslquic-build/openssl/include/openssl/sslerr.h494install ../../../../../msquic/submodules/openssl/include/openssl/stack.h -> /work/proj/deps_x86_64/quicer/c_build/_deps/opensslquic-build/openssl/include/openssl/stack.h495install ../../../../../msquic/submodules/openssl/include/openssl/store.h -> /work/proj/deps_x86_64/quicer/c_build/_deps/opensslquic-build/openssl/include/openssl/store.h496install ../../../../../msquic/submodules/openssl/include/openssl/storeerr.h -> /work/proj/deps_x86_64/quicer/c_build/_deps/opensslquic-build/openssl/include/openssl/storeerr.h497install ../../../../../msquic/submodules/openssl/include/openssl/symhacks.h -> /work/proj/deps_x86_64/quicer/c_build/_deps/opensslquic-build/openssl/include/openssl/symhacks.h498install ../../../../../msquic/submodules/openssl/include/openssl/tls1.h -> /work/proj/deps_x86_64/quicer/c_build/_deps/opensslquic-build/openssl/include/openssl/tls1.h499install ../../../../../msquic/submodules/openssl/include/openssl/ts.h -> /work/proj/deps_x86_64/quicer/c_build/_deps/opensslquic-build/openssl/include/openssl/ts.h500install ../../../../../msquic/submodules/openssl/include/openssl/tserr.h -> /work/proj/deps_x86_64/quicer/c_build/_deps/opensslquic-build/openssl/include/openssl/tserr.h501install ../../../../../msquic/submodules/openssl/include/openssl/txt_db.h -> /work/proj/deps_x86_64/quicer/c_build/_deps/opensslquic-build/openssl/include/openssl/txt_db.h502install ../../../../../msquic/submodules/openssl/include/openssl/ui.h -> /work/proj/deps_x86_64/quicer/c_build/_deps/opensslquic-build/openssl/include/openssl/ui.h503install ../../../../../msquic/submodules/openssl/include/openssl/uierr.h -> /work/proj/deps_x86_64/quicer/c_build/_deps/opensslquic-build/openssl/include/openssl/uierr.h504install ../../../../../msquic/submodules/openssl/include/openssl/whrlpool.h -> /work/proj/deps_x86_64/quicer/c_build/_deps/opensslquic-build/openssl/include/openssl/whrlpool.h505install ../../../../../msquic/submodules/openssl/include/openssl/x509.h -> /work/proj/deps_x86_64/quicer/c_build/_deps/opensslquic-build/openssl/include/openssl/x509.h506install ../../../../../msquic/submodules/openssl/include/openssl/x509_vfy.h -> /work/proj/deps_x86_64/quicer/c_build/_deps/opensslquic-build/openssl/include/openssl/x509_vfy.h507install ../../../../../msquic/submodules/openssl/include/openssl/x509err.h -> /work/proj/deps_x86_64/quicer/c_build/_deps/opensslquic-build/openssl/include/openssl/x509err.h508install ../../../../../msquic/submodules/openssl/include/openssl/x509v3.h -> /work/proj/deps_x86_64/quicer/c_build/_deps/opensslquic-build/openssl/include/openssl/x509v3.h509install ../../../../../msquic/submodules/openssl/include/openssl/x509v3err.h -> /work/proj/deps_x86_64/quicer/c_build/_deps/opensslquic-build/openssl/include/openssl/x509v3err.h510install ./include/openssl/opensslconf.h -> /work/proj/deps_x86_64/quicer/c_build/_deps/opensslquic-build/openssl/include/openssl/opensslconf.h511install libcrypto.a -> /work/proj/deps_x86_64/quicer/c_build/_deps/opensslquic-build/openssl/lib/libcrypto.a512install libssl.a -> /work/proj/deps_x86_64/quicer/c_build/_deps/opensslquic-build/openssl/lib/libssl.a513created directory `/work/proj/deps_x86_64/quicer/c_build/_deps/opensslquic-build/openssl/lib/pkgconfig'514install libcrypto.pc -> /work/proj/deps_x86_64/quicer/c_build/_deps/opensslquic-build/openssl/lib/pkgconfig/libcrypto.pc515install libssl.pc -> /work/proj/deps_x86_64/quicer/c_build/_deps/opensslquic-build/openssl/lib/pkgconfig/libssl.pc516install openssl.pc -> /work/proj/deps_x86_64/quicer/c_build/_deps/opensslquic-build/openssl/lib/pkgconfig/openssl.pc517make[4]: Leaving directory '/work/proj/deps_x86_64/quicer/c_build/_deps/opensslquic-build/submodules/openssl'518make[3]: Leaving directory '/work/proj/deps_x86_64/quicer/c_build'519[ 46%] Built target OpenSSL_Target520make[3]: Entering directory '/work/proj/deps_x86_64/quicer/c_build'521make[3]: Leaving directory '/work/proj/deps_x86_64/quicer/c_build'522make[3]: Entering directory '/work/proj/deps_x86_64/quicer/c_build'523[ 47%] Building C object msquic/src/platform/CMakeFiles/platform.dir/crypt.c.o524[ 48%] Building C object msquic/src/platform/CMakeFiles/platform.dir/pcp.c.o525[ 49%] Building C object msquic/src/platform/CMakeFiles/platform.dir/platform_worker.c.o526[ 50%] Building C object msquic/src/platform/CMakeFiles/platform.dir/toeplitz.c.o527[ 51%] Building C object msquic/src/platform/CMakeFiles/platform.dir/hashtable.c.o528[ 52%] Building C object msquic/src/platform/CMakeFiles/platform.dir/inline.c.o529[ 53%] Building C object msquic/src/platform/CMakeFiles/platform.dir/platform_posix.c.o530[ 55%] Building C object msquic/src/platform/CMakeFiles/platform.dir/storage_posix.c.o531[ 56%] Building C object msquic/src/platform/CMakeFiles/platform.dir/cgroup.c.o532[ 57%] Building C object msquic/src/platform/CMakeFiles/platform.dir/datapath_raw_linux.c.o533[ 58%] Building C object msquic/src/platform/CMakeFiles/platform.dir/datapath_raw_socket.c.o534[ 59%] Building C object msquic/src/platform/CMakeFiles/platform.dir/datapath_raw_socket_linux.c.o535[ 60%] Building C object msquic/src/platform/CMakeFiles/platform.dir/datapath_raw_xdp_linux.c.o536[ 61%] Building C object msquic/src/platform/CMakeFiles/platform.dir/datapath_epoll.c.o537[ 62%] Building C object msquic/src/platform/CMakeFiles/platform.dir/datapath_linux.c.o538[ 64%] Building C object msquic/src/platform/CMakeFiles/platform.dir/tls_openssl.c.o539[ 65%] Building C object msquic/src/platform/CMakeFiles/platform.dir/crypt_openssl.c.o540[ 66%] Building C object msquic/src/platform/CMakeFiles/platform.dir/selfsign_openssl.c.o541[ 67%] Building C object msquic/src/platform/CMakeFiles/platform.dir/certificates_posix.c.o542[ 68%] Linking C static library ../../obj/Release/libplatform.a543make[3]: Leaving directory '/work/proj/deps_x86_64/quicer/c_build'544[ 68%] Built target platform545make[3]: Entering directory '/work/proj/deps_x86_64/quicer/c_build'546make[3]: Leaving directory '/work/proj/deps_x86_64/quicer/c_build'547make[3]: Entering directory '/work/proj/deps_x86_64/quicer/c_build'548[ 69%] Building C object msquic/src/bin/CMakeFiles/msquic.dir/linux/init.c.o549[ 70%] Linking C shared library ../../bin/Release/libmsquic.so550/home/nerves/.nerves/artifacts/nerves_toolchain_x86_64_nerves_linux_musl-linux_x86_64-15.3.1/x86_64-nerves-linux-musl/bin/ld: ../../../_deps/opensslquic-build/openssl/lib/libcrypto.a(ui_openssl.o): warning: relocation against `stderr' in read-only section `.text'551/home/nerves/.nerves/artifacts/nerves_toolchain_x86_64_nerves_linux_musl-linux_x86_64-15.3.1/x86_64-nerves-linux-musl/bin/ld: ../../../_deps/opensslquic-build/openssl/lib/libcrypto.a(cryptlib.o): relocation R_X86_64_PC32 against symbol `stderr' can not be used when making a shared object; recompile with -fPIC552/home/nerves/.nerves/artifacts/nerves_toolchain_x86_64_nerves_linux_musl-linux_x86_64-15.3.1/x86_64-nerves-linux-musl/bin/ld: final link failed: bad value553collect2: error: ld returned 1 exit status554make[3]: *** [msquic/src/bin/CMakeFiles/msquic.dir/build.make:102: msquic/bin/Release/libmsquic.so.2.3.8] Error 1555make[3]: Leaving directory '/work/proj/deps_x86_64/quicer/c_build'556make[2]: *** [CMakeFiles/Makefile2:345: msquic/src/bin/CMakeFiles/msquic.dir/all] Error 2557make[2]: Leaving directory '/work/proj/deps_x86_64/quicer/c_build'558make[1]: *** [Makefile:136: all] Error 2559make[1]: Leaving directory '/work/proj/deps_x86_64/quicer/c_build'560make: *** [Makefile:15: build-nif] Error 2561===> Hook for compile failed!562563** (Mix) Could not compile dependency :quicer, "/home/nerves/.mix/elixir/1-20-otp-29/rebar3 bare compile --paths /work/proj/_build/x86_64/lib/*/ebin" command failed. Errors may have been logged above. You can recompile this dependency with "mix deps.compile quicer --force", update it with "mix deps.update quicer" or clean it with "mix deps.clean quicer"