ex_astro

Build log

host

ex_astro 0.3.0 · fail · run ex_astro-0.3.0-1791172722727
79 of 79 lines
1Resolving Hex dependencies...2Resolution completed in 0.165s3Unchanged:4  circular_buffer 1.1.05  earmark_parser 1.4.466  elixir_make 0.10.07  ex_astro 0.3.08  ex_doc 0.40.49  finch 0.24.010  gnuplot 1.22.27011  hpax 1.1.012  interactive_cmd 0.1.413  jason 1.4.514  makeup 1.2.315  makeup_elixir 1.0.116  makeup_erlang 1.1.017  mime 2.0.718  mint 1.11.019  nerves 2.0.0-pre.220  nerves_discovery 0.1.521  nerves_logging 0.2.422  nerves_runtime 0.13.1323  nerves_system_bbb 2.30.224  nerves_system_br 1.34.425  nerves_system_mangopi_mq_pro 0.17.226  nerves_system_qemu_aarch64 0.4.227  nerves_system_rpi0 2.1.228  nerves_system_rpi4 2.1.229  nerves_system_rpi5 2.1.230  nerves_system_trellis 0.5.031  nerves_system_x86_64 1.34.232  nerves_toolchain_aarch64_nerves_linux_gnu 15.3.133  nerves_toolchain_armv6_nerves_linux_gnueabihf 15.3.134  nerves_toolchain_armv7_nerves_linux_gnueabihf 15.3.135  nerves_toolchain_riscv64_nerves_linux_gnu 15.3.136  nerves_toolchain_x86_64_nerves_linux_musl 15.3.137  nerves_uevent 0.1.738  nimble_options 1.1.139  nimble_parsec 1.4.240  nimble_pool 1.1.041  property_table 0.3.442  req 0.7.443  ring_logger 0.11.744  tablet 0.3.345  telemetry 1.4.246  toolshed 0.5.047  uboot_env 1.0.248All dependencies have been fetched49==> ex_doc50Compiling 30 files (.ex)51Generated ex_doc app52==> gnuplot53Compiling 4 files (.ex)54Generated gnuplot app55==> ex_astro56gcc -I/usr/local/lib/erlang/erts-17.1/include -O2 -fPIC -finline-functions -fvisibility=hidden -Wall -Wextra -Wmissing-prototypes -Wstrict-prototypes -Wold-style-definition -Wint-conversion -Wpointer-arith -Wcast-function-type -Wvla -Walloc-size-larger-than=1048576 -Werror=implicit-function-declaration -Werror=incompatible-pointer-types -Werror=vla -Wno-unused-parameter -I./c_src/vendor/cspice/include -c -o c_src/nif.o c_src/nif.c57gcc -I/usr/local/lib/erlang/erts-17.1/include -O2 -fPIC -finline-functions -fvisibility=hidden -Wall -Wextra -Wmissing-prototypes -Wstrict-prototypes -Wold-style-definition -Wint-conversion -Wpointer-arith -Wcast-function-type -Wvla -Walloc-size-larger-than=1048576 -Werror=implicit-function-declaration -Werror=incompatible-pointer-types -Werror=vla -Wno-unused-parameter -I./c_src/vendor/cspice/include -c -o c_src/utils.o c_src/utils.c58In file included from c_src/nif.c:1:59c_src/utils.h:14:10: fatal error: erfa.h: No such file or directory60   14 | #include <erfa.h>61      |          ^~~~~~~~62compilation terminated.63In file included from c_src/utils.c:1:64c_src/utils.h:14:10: fatal error: erfa.h: No such file or directory65   14 | #include <erfa.h>66      |          ^~~~~~~~67compilation terminated.68make: *** [Makefile:50: c_src/nif.o] Error 169make: *** Waiting for unfinished jobs....70make: *** [Makefile:50: c_src/utils.o] Error 171could not compile dependency :ex_astro, "mix compile" failed. Errors may have been logged above. You can recompile this dependency with "mix deps.compile ex_astro --force", update it with "mix deps.update ex_astro" or clean it with "mix deps.clean ex_astro"72==> nerves_compatibility_test73** (Mix) Could not compile with "make" (exit status: 2).74You need to have gcc and make installed. If you are using75Ubuntu or any other Debian-based system, install the packages76"build-essential". Also install "erlang-dev" package if not77included in your Erlang/OTP version. If you're on Fedora, run78"dnf group install 'Development Tools'".79