Build log
nerves_system_rpi4
ex_astro 0.3.0 · fail · run ex_astro-0.3.0-1791172722727
349 of 349 lines
1Resolving Hex dependencies...2Resolution completed in 0.248s3Unchanged:4 circular_buffer 1.1.05 earmark_parser 1.4.466 elixir_make 0.10.07 ex_astro 0.3.08 ex_doc 0.40.49 finch 0.24.010 gnuplot 1.22.27011 hpax 1.1.012 interactive_cmd 0.1.413 jason 1.4.514 makeup 1.2.315 makeup_elixir 1.0.116 makeup_erlang 1.1.017 mime 2.0.718 mint 1.11.019 nerves 2.0.0-pre.220 nerves_discovery 0.1.521 nerves_logging 0.2.422 nerves_runtime 0.13.1323 nerves_system_bbb 2.30.224 nerves_system_br 1.34.425 nerves_system_mangopi_mq_pro 0.17.226 nerves_system_qemu_aarch64 0.4.227 nerves_system_rpi0 2.1.228 nerves_system_rpi4 2.1.229 nerves_system_rpi5 2.1.230 nerves_system_trellis 0.5.031 nerves_system_x86_64 1.34.232 nerves_toolchain_aarch64_nerves_linux_gnu 15.3.133 nerves_toolchain_armv6_nerves_linux_gnueabihf 15.3.134 nerves_toolchain_armv7_nerves_linux_gnueabihf 15.3.135 nerves_toolchain_riscv64_nerves_linux_gnu 15.3.136 nerves_toolchain_x86_64_nerves_linux_musl 15.3.137 nerves_uevent 0.1.738 nimble_options 1.1.139 nimble_parsec 1.4.240 nimble_pool 1.1.041 property_table 0.3.442 req 0.7.443 ring_logger 0.11.744 tablet 0.3.345 telemetry 1.4.246 toolshed 0.5.047 uboot_env 1.0.248* Getting ex_astro (Hex package)49* Getting nerves (Hex package)50* Getting ring_logger (Hex package)51* Getting toolshed (Hex package)52* Getting nerves_runtime (Hex package)53* Getting nerves_system_bbb (Hex package)54* Getting nerves_system_mangopi_mq_pro (Hex package)55* Getting nerves_system_qemu_aarch64 (Hex package)56* Getting nerves_system_rpi0 (Hex package)57* Getting nerves_system_rpi4 (Hex package)58* Getting nerves_system_rpi5 (Hex package)59* Getting nerves_system_trellis (Hex package)60* Getting nerves_system_x86_64 (Hex package)61* Getting nerves_system_br (Hex package)62* Getting nerves_toolchain_x86_64_nerves_linux_musl (Hex package)63* Getting nerves_toolchain_armv7_nerves_linux_gnueabihf (Hex package)64* Getting nerves_toolchain_aarch64_nerves_linux_gnu (Hex package)65* Getting nerves_toolchain_armv6_nerves_linux_gnueabihf (Hex package)66* Getting nerves_toolchain_riscv64_nerves_linux_gnu (Hex package)67* Getting nerves_logging (Hex package)68* Getting nerves_uevent (Hex package)69* Getting uboot_env (Hex package)70* Getting elixir_make (Hex package)71* Getting property_table (Hex package)72* Getting circular_buffer (Hex package)73* Getting interactive_cmd (Hex package)74* Getting nerves_discovery (Hex package)75* Getting tablet (Hex package)76* Getting ex_doc (Hex package)77* Getting gnuplot (Hex package)78* Getting req (Hex package)79* Getting finch (Hex package)80* Getting jason (Hex package)81* Getting mime (Hex package)82* Getting mint (Hex package)83* Getting nimble_options (Hex package)84* Getting nimble_pool (Hex package)85* Getting telemetry (Hex package)86* Getting hpax (Hex package)87* Getting earmark_parser (Hex package)88* Getting makeup_elixir (Hex package)89* Getting makeup_erlang (Hex package)90* Getting makeup (Hex package)91* Getting nimble_parsec (Hex package)92==> nerves_system_br93Generated nerves_system_br app94==> earmark_parser95Compiling 2 files (.xrl)96Compiling 1 file (.yrl)97Compiling 3 files (.erl)98Compiling 32 files (.ex)99Generated earmark_parser app100==> mime101Compiling 1 file (.ex)102Generated mime app103==> circular_buffer104Compiling 1 file (.ex)105Generated circular_buffer app106==> nimble_options107Compiling 3 files (.ex)108Generated nimble_options app109==> jason110Compiling 10 files (.ex)111Generated jason app112==> hpax113Compiling 4 files (.ex)114Generated hpax app115==> mint116Compiling 1 file (.erl)117Compiling 21 files (.ex)118Generated mint app119==> tablet120Compiling 2 files (.ex)121Generated tablet app122==> elixir_make123Compiling 8 files (.ex)124Generated elixir_make app125==> nerves_logging126 CC kmsg_tailer.o127 LD kmsg_tailer128Compiling 5 files (.ex)129Generated nerves_logging app130==> nerves_discovery131Compiling 5 files (.ex)132Generated nerves_discovery app133==> ring_logger134Compiling 7 files (.ex)135Generated ring_logger app136==> interactive_cmd137Compiling 1 file (.ex)138Generated interactive_cmd app139==> nerves140Compiling 65 files (.ex)141 warning: redefining module Mix.Tasks.Nerves.Init (current version loaded from /work/proj/_build/rpi4/lib/nerves/ebin/Elixir.Mix.Tasks.Nerves.Init.beam)142 │143 6 │ defmodule Mix.Tasks.Nerves.Init do144 │ ~~~~~~~~~~~~~~~~~~~~~~~~~~~~~~~~~~145 │146 └─ lib/mix/tasks/nerves.init.ex:6: Mix.Tasks.Nerves.Init (module)147148 warning: redefining module Nerves (current version loaded from /work/proj/_build/rpi4/lib/nerves/ebin/Elixir.Nerves.beam)149 │150 6 │ defmodule Nerves do151 │ ~~~~~~~~~~~~~~~~~~~152 │153 └─ lib/nerves.ex:6: Nerves (module)154155 warning: redefining module Nerves.ArtifactResolver (current version loaded from /work/proj/_build/rpi4/lib/nerves/ebin/Elixir.Nerves.ArtifactResolver.beam)156 │157 5 │ defmodule Nerves.ArtifactResolver do158 │ ~~~~~~~~~~~~~~~~~~~~~~~~~~~~~~~~~~~~159 │160 └─ lib/nerves/artifact_resolver.ex:5: Nerves.ArtifactResolver (module)161162 warning: redefining module Nerves.BuildAction.AppModes (current version loaded from /work/proj/_build/rpi4/lib/nerves/ebin/Elixir.Nerves.BuildAction.AppModes.beam)163 │164 6 │ defmodule Nerves.BuildAction.AppModes do165 │ ~~~~~~~~~~~~~~~~~~~~~~~~~~~~~~~~~~~~~~~~166 │167 └─ lib/nerves/build_action/app_modes.ex:6: Nerves.BuildAction.AppModes (module)168169 warning: redefining module Nerves.BuildAction.CheckExecutables (current version loaded from /work/proj/_build/rpi4/lib/nerves/ebin/Elixir.Nerves.BuildAction.CheckExecutables.beam)170 │171 5 │ defmodule Nerves.BuildAction.CheckExecutables do172 │ ~~~~~~~~~~~~~~~~~~~~~~~~~~~~~~~~~~~~~~~~~~~~~~~~173 │174 └─ lib/nerves/build_action/check_executables.ex:5: Nerves.BuildAction.CheckExecutables (module)175176 warning: redefining module Nerves.BuildAction.Erlinit (current version loaded from /work/proj/_build/rpi4/lib/nerves/ebin/Elixir.Nerves.BuildAction.Erlinit.beam)177 │178 8 │ defmodule Nerves.BuildAction.Erlinit do179 │ ~~~~~~~~~~~~~~~~~~~~~~~~~~~~~~~~~~~~~~~180 │181 └─ lib/nerves/build_action/erlinit.ex:8: Nerves.BuildAction.Erlinit (module)182183 warning: redefining module Nerves.BuildAction.Firmware (current version loaded from /work/proj/_build/rpi4/lib/nerves/ebin/Elixir.Nerves.BuildAction.Firmware.beam)184 │185 5 │ defmodule Nerves.BuildAction.Firmware do186 │ ~~~~~~~~~~~~~~~~~~~~~~~~~~~~~~~~~~~~~~~~187 │188 └─ lib/nerves/build_action/firmware.ex:5: Nerves.BuildAction.Firmware (module)189190 warning: redefining module Nerves.BuildAction.IExStartupCheck (current version loaded from /work/proj/_build/rpi4/lib/nerves/ebin/Elixir.Nerves.BuildAction.IExStartupCheck.beam)191 │192 7 │ defmodule Nerves.BuildAction.IExStartupCheck do193 │ ~~~~~~~~~~~~~~~~~~~~~~~~~~~~~~~~~~~~~~~~~~~~~~~194 │195 └─ lib/nerves/build_action/iex_startup_check.ex:7: Nerves.BuildAction.IExStartupCheck (module)196197 warning: redefining module Nerves.BuildAction.NervesV1System (current version loaded from /work/proj/_build/rpi4/lib/nerves/ebin/Elixir.Nerves.BuildAction.NervesV1System.beam)198 │199 5 │ defmodule Nerves.BuildAction.NervesV1System do200 │ ~~~~~~~~~~~~~~~~~~~~~~~~~~~~~~~~~~~~~~~~~~~~~~201 │202 └─ lib/nerves/build_action/nerves_v1_system.ex:5: Nerves.BuildAction.NervesV1System (module)203204 warning: redefining module Nerves.BuildAction.NervesV1Toolchain (current version loaded from /work/proj/_build/rpi4/lib/nerves/ebin/Elixir.Nerves.BuildAction.NervesV1Toolchain.beam)205 │206 5 │ defmodule Nerves.BuildAction.NervesV1Toolchain do207 │ ~~~~~~~~~~~~~~~~~~~~~~~~~~~~~~~~~~~~~~~~~~~~~~~~~208 │209 └─ lib/nerves/build_action/nerves_v1_toolchain.ex:5: Nerves.BuildAction.NervesV1Toolchain (module)210211 warning: redefining module Nerves.BuildAction.Rootfs (current version loaded from /work/proj/_build/rpi4/lib/nerves/ebin/Elixir.Nerves.BuildAction.Rootfs.beam)212 │213 5 │ defmodule Nerves.BuildAction.Rootfs do214 │ ~~~~~~~~~~~~~~~~~~~~~~~~~~~~~~~~~~~~~~215 │216 └─ lib/nerves/build_action/rootfs.ex:5: Nerves.BuildAction.Rootfs (module)217218 warning: redefining module Nerves.BuildAction.SortApps (current version loaded from /work/proj/_build/rpi4/lib/nerves/ebin/Elixir.Nerves.BuildAction.SortApps.beam)219 │220 6 │ defmodule Nerves.BuildAction.SortApps do221 │ ~~~~~~~~~~~~~~~~~~~~~~~~~~~~~~~~~~~~~~~~222 │223 └─ lib/nerves/build_action/sort_apps.ex:6: Nerves.BuildAction.SortApps (module)224225 warning: redefining module Nerves.BuildAction.StripAll (current version loaded from /work/proj/_build/rpi4/lib/nerves/ebin/Elixir.Nerves.BuildAction.StripAll.beam)226 │227 5 │ defmodule Nerves.BuildAction.StripAll do228 │ ~~~~~~~~~~~~~~~~~~~~~~~~~~~~~~~~~~~~~~~~229 │230 └─ lib/nerves/build_action/strip_all.ex:5: Nerves.BuildAction.StripAll (module)231232 warning: redefining module Nerves.BuildAction.Trimmer (current version loaded from /work/proj/_build/rpi4/lib/nerves/ebin/Elixir.Nerves.BuildAction.Trimmer.beam)233 │234 5 │ defmodule Nerves.BuildAction.Trimmer do235 │ ~~~~~~~~~~~~~~~~~~~~~~~~~~~~~~~~~~~~~~~236 │237 └─ lib/nerves/build_action/trimmer.ex:5: Nerves.BuildAction.Trimmer (module)238239 warning: redefining module Nerves.BuildPlan (current version loaded from /work/proj/_build/rpi4/lib/nerves/ebin/Elixir.Nerves.BuildPlan.beam)240 │241 5 │ defmodule Nerves.BuildPlan do242 │ ~~~~~~~~~~~~~~~~~~~~~~~~~~~~~243 │244 └─ lib/nerves/build_plan.ex:5: Nerves.BuildPlan (module)245246 warning: redefining module Nerves.BuildPlan.Checks (current version loaded from /work/proj/_build/rpi4/lib/nerves/ebin/Elixir.Nerves.BuildPlan.Checks.beam)247 │248 5 │ defmodule Nerves.BuildPlan.Checks do249 │ ~~~~~~~~~~~~~~~~~~~~~~~~~~~~~~~~~~~~250 │251 └─ lib/nerves/build_plan/checks.ex:5: Nerves.BuildPlan.Checks (module)252253 warning: redefining module Nerves.Container (current version loaded from /work/proj/_build/rpi4/lib/nerves/ebin/Elixir.Nerves.Container.beam)254 │255 6 │ defmodule Nerves.Container do256 │ ~~~~~~~~~~~~~~~~~~~~~~~~~~~~~257 │258 └─ lib/nerves/container.ex:6: Nerves.Container (module)259260 warning: redefining module Nerves.Fingerprint (current version loaded from /work/proj/_build/rpi4/lib/nerves/ebin/Elixir.Nerves.Fingerprint.beam)261 │262 5 │ defmodule Nerves.Fingerprint do263 │ ~~~~~~~~~~~~~~~~~~~~~~~~~~~~~~~264 │265 └─ lib/nerves/fingerprint.ex:5: Nerves.Fingerprint (module)266267 warning: redefining module Nerves.MixPackage (current version loaded from /work/proj/_build/rpi4/lib/nerves/ebin/Elixir.Nerves.MixPackage.beam)268 │269 5 │ defmodule Nerves.MixPackage do270 │ ~~~~~~~~~~~~~~~~~~~~~~~~~~~~~~271 │272 └─ lib/nerves/mix_package.ex:5: Nerves.MixPackage (module)273274 warning: redefining module Nerves.Paths (current version loaded from /work/proj/_build/rpi4/lib/nerves/ebin/Elixir.Nerves.Paths.beam)275 │276 5 │ defmodule Nerves.Paths do277 │ ~~~~~~~~~~~~~~~~~~~~~~~~~278 │279 └─ lib/nerves/paths.ex:5: Nerves.Paths (module)280281 warning: redefining module Nerves.TargetTuple (current version loaded from /work/proj/_build/rpi4/lib/nerves/ebin/Elixir.Nerves.TargetTuple.beam)282 │283 5 │ defmodule Nerves.TargetTuple do284 │ ~~~~~~~~~~~~~~~~~~~~~~~~~~~~~~~285 │286 └─ lib/nerves/target_tuple.ex:5: Nerves.TargetTuple (module)287288Generated nerves app289==> nerves_toolchain_aarch64_nerves_linux_gnu290Compiling 1 file (.ex)291Generated nerves_toolchain_aarch64_nerves_linux_gnu app292==> nerves_system_rpi4293Generated nerves_system_rpi4 app294==> nimble_parsec295Compiling 4 files (.ex)296Generated nimble_parsec app297==> makeup298Compiling 15 files (.ex)299Generated makeup app300==> makeup_elixir301Compiling 6 files (.ex)302Compiling lib/makeup/lexers/elixir_lexer.ex (it's taking more than 10s)303Generated makeup_elixir app304==> makeup_erlang305Compiling 4 files (.ex)306Compiling lib/makeup/lexers/erlang_lexer.ex (it's taking more than 10s)307Generated makeup_erlang app308==> ex_doc309Compiling 30 files (.ex)310Generated ex_doc app311==> gnuplot312Compiling 4 files (.ex)313Generated gnuplot app314==> nerves_compatibility_test315===> Analyzing applications...316===> Compiling telemetry317==> uboot_env318Compiling 5 files (.ex)319Generated uboot_env app320==> nimble_pool321Compiling 2 files (.ex)322Generated nimble_pool app323==> finch324Compiling 23 files (.ex)325Generated finch app326==> req327Compiling 24 files (.ex)328Generated req app329==> ex_astro330gcc -mabi=lp64 -fstack-protector-strong -mcpu=cortex-a72 -fPIE -pie -Wl,-z,now -Wl,-z,relro -D_LARGEFILE_SOURCE -D_LARGEFILE64_SOURCE -D_FILE_OFFSET_BITS=64 -pipe -O2 --sysroot /home/nerves/.nerves/artifacts/nerves_system_rpi4-2.1.2/staging -I/home/nerves/.nerves/artifacts/nerves_system_rpi4-2.1.2/staging/usr/lib/erlang/erts-17.0.6/include -O2 -fPIC -finline-functions -fvisibility=hidden -Wall -Wextra -Wmissing-prototypes -Wstrict-prototypes -Wold-style-definition -Wint-conversion -Wpointer-arith -Wcast-function-type -Wvla -Walloc-size-larger-than=1048576 -Werror=implicit-function-declaration -Werror=incompatible-pointer-types -Werror=vla -Wno-unused-parameter -I./c_src/vendor/cspice/include -c -o c_src/nif.o c_src/nif.c331gcc -mabi=lp64 -fstack-protector-strong -mcpu=cortex-a72 -fPIE -pie -Wl,-z,now -Wl,-z,relro -D_LARGEFILE_SOURCE -D_LARGEFILE64_SOURCE -D_FILE_OFFSET_BITS=64 -pipe -O2 --sysroot /home/nerves/.nerves/artifacts/nerves_system_rpi4-2.1.2/staging -I/home/nerves/.nerves/artifacts/nerves_system_rpi4-2.1.2/staging/usr/lib/erlang/erts-17.0.6/include -O2 -fPIC -finline-functions -fvisibility=hidden -Wall -Wextra -Wmissing-prototypes -Wstrict-prototypes -Wold-style-definition -Wint-conversion -Wpointer-arith -Wcast-function-type -Wvla -Walloc-size-larger-than=1048576 -Werror=implicit-function-declaration -Werror=incompatible-pointer-types -Werror=vla -Wno-unused-parameter -I./c_src/vendor/cspice/include -c -o c_src/utils.o c_src/utils.c332gcc: error: unrecognized argument in option ‘-mabi=lp64’333gcc: note: valid arguments to ‘-mabi=’ are: ms sysv334gcc: warning: ‘-mcpu=’ is deprecated; use ‘-mtune=’ or ‘-march=’ instead335gcc: error: unrecognized argument in option ‘-mabi=lp64’336make: *** [Makefile:50: c_src/nif.o] Error 1337make: *** Waiting for unfinished jobs....338gcc: note: valid arguments to ‘-mabi=’ are: ms sysv339gcc: warning: ‘-mcpu=’ is deprecated; use ‘-mtune=’ or ‘-march=’ instead340make: *** [Makefile:50: c_src/utils.o] Error 1341could not compile dependency :ex_astro, "mix compile" failed. Errors may have been logged above. You can recompile this dependency with "mix deps.compile ex_astro --force", update it with "mix deps.update ex_astro" or clean it with "mix deps.clean ex_astro"342==> nerves_compatibility_test343** (Mix) Could not compile with "make" (exit status: 2).344You need to have gcc and make installed. If you are using345Ubuntu or any other Debian-based system, install the packages346"build-essential". Also install "erlang-dev" package if not347included in your Erlang/OTP version. If you're on Fedora, run348"dnf group install 'Development Tools'".349