exboost

Build log

nerves_system_rpi5

exboost 0.3.9 · fail · run exboost-0.3.9-1791179945481
615 of 615 lines
1Resolving Hex dependencies...2Resolution completed in 0.108s3Unchanged:4  circular_buffer 1.1.05  elixir_make 0.10.06  exboost 0.3.97  interactive_cmd 0.1.48  nerves 2.0.0-pre.29  nerves_discovery 0.1.510  nerves_logging 0.2.411  nerves_runtime 0.13.1312  nerves_system_bbb 2.30.213  nerves_system_br 1.34.414  nerves_system_mangopi_mq_pro 0.17.215  nerves_system_qemu_aarch64 0.4.216  nerves_system_rpi0 2.1.217  nerves_system_rpi4 2.1.218  nerves_system_rpi5 2.1.219  nerves_system_trellis 0.5.020  nerves_system_x86_64 1.34.221  nerves_toolchain_aarch64_nerves_linux_gnu 15.3.122  nerves_toolchain_armv6_nerves_linux_gnueabihf 15.3.123  nerves_toolchain_armv7_nerves_linux_gnueabihf 15.3.124  nerves_toolchain_riscv64_nerves_linux_gnu 15.3.125  nerves_toolchain_x86_64_nerves_linux_musl 15.3.126  nerves_uevent 0.1.727  property_table 0.3.428  ring_logger 0.11.729  tablet 0.3.330  toolshed 0.5.031  uboot_env 1.0.232* Getting exboost (Hex package)33* Getting nerves (Hex package)34* Getting ring_logger (Hex package)35* Getting toolshed (Hex package)36* Getting nerves_runtime (Hex package)37* Getting nerves_system_bbb (Hex package)38* Getting nerves_system_mangopi_mq_pro (Hex package)39* Getting nerves_system_qemu_aarch64 (Hex package)40* Getting nerves_system_rpi0 (Hex package)41* Getting nerves_system_rpi4 (Hex package)42* Getting nerves_system_rpi5 (Hex package)43* Getting nerves_system_trellis (Hex package)44* Getting nerves_system_x86_64 (Hex package)45* Getting nerves_system_br (Hex package)46* Getting nerves_toolchain_x86_64_nerves_linux_musl (Hex package)47* Getting nerves_toolchain_armv7_nerves_linux_gnueabihf (Hex package)48* Getting nerves_toolchain_aarch64_nerves_linux_gnu (Hex package)49* Getting nerves_toolchain_armv6_nerves_linux_gnueabihf (Hex package)50* Getting nerves_toolchain_riscv64_nerves_linux_gnu (Hex package)51* Getting nerves_logging (Hex package)52* Getting nerves_uevent (Hex package)53* Getting uboot_env (Hex package)54* Getting elixir_make (Hex package)55* Getting property_table (Hex package)56* Getting circular_buffer (Hex package)57* Getting interactive_cmd (Hex package)58* Getting nerves_discovery (Hex package)59* Getting tablet (Hex package)60==> nerves_system_br61Generated nerves_system_br app62==> circular_buffer63Compiling 1 file (.ex)64Generated circular_buffer app65==> tablet66Compiling 2 files (.ex)67Generated tablet app68==> elixir_make69Compiling 8 files (.ex)70Generated elixir_make app71==> exboost72c++ -I/usr/local/lib/erlang/erts-17.1/include -I/usr/local/include -fPIC -g -O3 -flto -mtune=generic -Wno-write-strings -D_LARGEFILE_SOURCE -D_LARGEFILE64_SOURCE -D_FILE_OFFSET_BITS=64 --sysroot /home/nerves/.nerves/artifacts/nerves_system_rpi5-2.1.2/staging aarch64 -c -o priv/boostnif.o priv/boostnif.c73In file included from /home/nerves/.nerves/artifacts/nerves_system_rpi5-2.1.2/staging/usr/include/math.h:37,74                 from /usr/include/c++/13/cmath:47,75                 from /usr/include/c++/13/complex:44,76                 from /home/nerves/.nerves/artifacts/nerves_system_rpi5-2.1.2/staging/usr/include/boost/math/special_functions/math_fwd.hpp:27,77                 from /home/nerves/.nerves/artifacts/nerves_system_rpi5-2.1.2/staging/usr/include/boost/math/special_functions/airy.hpp:11,78                 from /home/nerves/.nerves/artifacts/nerves_system_rpi5-2.1.2/staging/usr/include/boost/math/special_functions.hpp:15,79                 from priv/boostnif.c:32:80/home/nerves/.nerves/artifacts/nerves_system_rpi5-2.1.2/staging/usr/include/bits/math-vector.h:192:9: error: ‘__Float32x4_t’ does not name a type; did you mean ‘_Float32x’?81  192 | typedef __Float32x4_t __f32x4_t;82      |         ^~~~~~~~~~~~~83      |         _Float32x84/home/nerves/.nerves/artifacts/nerves_system_rpi5-2.1.2/staging/usr/include/bits/math-vector.h:193:9: error: ‘__Float64x2_t’ does not name a type; did you mean ‘_Float64x’?85  193 | typedef __Float64x2_t __f64x2_t;86      |         ^~~~~~~~~~~~~87      |         _Float64x88/home/nerves/.nerves/artifacts/nerves_system_rpi5-2.1.2/staging/usr/include/bits/math-vector.h:202:9: error: ‘__SVFloat32_t’ does not name a type; did you mean ‘_Float32x’?89  202 | typedef __SVFloat32_t __sv_f32_t;90      |         ^~~~~~~~~~~~~91      |         _Float32x92/home/nerves/.nerves/artifacts/nerves_system_rpi5-2.1.2/staging/usr/include/bits/math-vector.h:203:9: error: ‘__SVFloat64_t’ does not name a type; did you mean ‘_Float64x’?93  203 | typedef __SVFloat64_t __sv_f64_t;94      |         ^~~~~~~~~~~~~95      |         _Float64x96/home/nerves/.nerves/artifacts/nerves_system_rpi5-2.1.2/staging/usr/include/bits/math-vector.h:204:9: error: ‘__SVBool_t’ does not name a type97  204 | typedef __SVBool_t __sv_bool_t;98      |         ^~~~~~~~~~99/home/nerves/.nerves/artifacts/nerves_system_rpi5-2.1.2/staging/usr/include/bits/math-vector.h:214:8: error: ‘__f32x4_t’ does not name a type100  214 | __vpcs __f32x4_t _ZGVnN4vv_atan2f (__f32x4_t, __f32x4_t);101      |        ^~~~~~~~~102/home/nerves/.nerves/artifacts/nerves_system_rpi5-2.1.2/staging/usr/include/bits/math-vector.h:215:8: error: ‘__f32x4_t’ does not name a type103  215 | __vpcs __f32x4_t _ZGVnN4vv_atan2pif (__f32x4_t, __f32x4_t);104      |        ^~~~~~~~~105/home/nerves/.nerves/artifacts/nerves_system_rpi5-2.1.2/staging/usr/include/bits/math-vector.h:216:8: error: ‘__f32x4_t’ does not name a type106  216 | __vpcs __f32x4_t _ZGVnN4v_acosf (__f32x4_t);107      |        ^~~~~~~~~108/home/nerves/.nerves/artifacts/nerves_system_rpi5-2.1.2/staging/usr/include/bits/math-vector.h:217:8: error: ‘__f32x4_t’ does not name a type109  217 | __vpcs __f32x4_t _ZGVnN4v_acoshf (__f32x4_t);110      |        ^~~~~~~~~111/home/nerves/.nerves/artifacts/nerves_system_rpi5-2.1.2/staging/usr/include/bits/math-vector.h:218:8: error: ‘__f32x4_t’ does not name a type112  218 | __vpcs __f32x4_t _ZGVnN4v_acospif (__f32x4_t);113      |        ^~~~~~~~~114/home/nerves/.nerves/artifacts/nerves_system_rpi5-2.1.2/staging/usr/include/bits/math-vector.h:219:8: error: ‘__f32x4_t’ does not name a type115  219 | __vpcs __f32x4_t _ZGVnN4v_asinf (__f32x4_t);116      |        ^~~~~~~~~117/home/nerves/.nerves/artifacts/nerves_system_rpi5-2.1.2/staging/usr/include/bits/math-vector.h:220:8: error: ‘__f32x4_t’ does not name a type118  220 | __vpcs __f32x4_t _ZGVnN4v_asinhf (__f32x4_t);119      |        ^~~~~~~~~120/home/nerves/.nerves/artifacts/nerves_system_rpi5-2.1.2/staging/usr/include/bits/math-vector.h:221:8: error: ‘__f32x4_t’ does not name a type121  221 | __vpcs __f32x4_t _ZGVnN4v_asinpif (__f32x4_t);122      |        ^~~~~~~~~123/home/nerves/.nerves/artifacts/nerves_system_rpi5-2.1.2/staging/usr/include/bits/math-vector.h:222:8: error: ‘__f32x4_t’ does not name a type124  222 | __vpcs __f32x4_t _ZGVnN4v_atanf (__f32x4_t);125      |        ^~~~~~~~~126/home/nerves/.nerves/artifacts/nerves_system_rpi5-2.1.2/staging/usr/include/bits/math-vector.h:223:8: error: ‘__f32x4_t’ does not name a type127  223 | __vpcs __f32x4_t _ZGVnN4v_atanhf (__f32x4_t);128      |        ^~~~~~~~~129/home/nerves/.nerves/artifacts/nerves_system_rpi5-2.1.2/staging/usr/include/bits/math-vector.h:224:8: error: ‘__f32x4_t’ does not name a type130  224 | __vpcs __f32x4_t _ZGVnN4v_atanpif (__f32x4_t);131      |        ^~~~~~~~~132/home/nerves/.nerves/artifacts/nerves_system_rpi5-2.1.2/staging/usr/include/bits/math-vector.h:225:8: error: ‘__f32x4_t’ does not name a type133  225 | __vpcs __f32x4_t _ZGVnN4v_cbrtf (__f32x4_t);134      |        ^~~~~~~~~135/home/nerves/.nerves/artifacts/nerves_system_rpi5-2.1.2/staging/usr/include/bits/math-vector.h:226:8: error: ‘__f32x4_t’ does not name a type136  226 | __vpcs __f32x4_t _ZGVnN4v_cosf (__f32x4_t);137      |        ^~~~~~~~~138/home/nerves/.nerves/artifacts/nerves_system_rpi5-2.1.2/staging/usr/include/bits/math-vector.h:227:8: error: ‘__f32x4_t’ does not name a type139  227 | __vpcs __f32x4_t _ZGVnN4v_coshf (__f32x4_t);140      |        ^~~~~~~~~141/home/nerves/.nerves/artifacts/nerves_system_rpi5-2.1.2/staging/usr/include/bits/math-vector.h:228:8: error: ‘__f32x4_t’ does not name a type142  228 | __vpcs __f32x4_t _ZGVnN4v_cospif (__f32x4_t);143      |        ^~~~~~~~~144/home/nerves/.nerves/artifacts/nerves_system_rpi5-2.1.2/staging/usr/include/bits/math-vector.h:229:8: error: ‘__f32x4_t’ does not name a type145  229 | __vpcs __f32x4_t _ZGVnN4v_erff (__f32x4_t);146      |        ^~~~~~~~~147/home/nerves/.nerves/artifacts/nerves_system_rpi5-2.1.2/staging/usr/include/bits/math-vector.h:230:8: error: ‘__f32x4_t’ does not name a type148  230 | __vpcs __f32x4_t _ZGVnN4v_erfcf (__f32x4_t);149      |        ^~~~~~~~~150/home/nerves/.nerves/artifacts/nerves_system_rpi5-2.1.2/staging/usr/include/bits/math-vector.h:231:8: error: ‘__f32x4_t’ does not name a type151  231 | __vpcs __f32x4_t _ZGVnN4v_expf (__f32x4_t);152      |        ^~~~~~~~~153/home/nerves/.nerves/artifacts/nerves_system_rpi5-2.1.2/staging/usr/include/bits/math-vector.h:232:8: error: ‘__f32x4_t’ does not name a type154  232 | __vpcs __f32x4_t _ZGVnN4v_exp10f (__f32x4_t);155      |        ^~~~~~~~~156/home/nerves/.nerves/artifacts/nerves_system_rpi5-2.1.2/staging/usr/include/bits/math-vector.h:233:8: error: ‘__f32x4_t’ does not name a type157  233 | __vpcs __f32x4_t _ZGVnN4v_exp2f (__f32x4_t);158      |        ^~~~~~~~~159/home/nerves/.nerves/artifacts/nerves_system_rpi5-2.1.2/staging/usr/include/bits/math-vector.h:234:8: error: ‘__f32x4_t’ does not name a type160  234 | __vpcs __f32x4_t _ZGVnN4v_expm1f (__f32x4_t);161      |        ^~~~~~~~~162/home/nerves/.nerves/artifacts/nerves_system_rpi5-2.1.2/staging/usr/include/bits/math-vector.h:235:8: error: ‘__f32x4_t’ does not name a type163  235 | __vpcs __f32x4_t _ZGVnN4v_exp2m1f (__f32x4_t);164      |        ^~~~~~~~~165/home/nerves/.nerves/artifacts/nerves_system_rpi5-2.1.2/staging/usr/include/bits/math-vector.h:236:8: error: ‘__f32x4_t’ does not name a type166  236 | __vpcs __f32x4_t _ZGVnN4v_exp10m1f (__f32x4_t);167      |        ^~~~~~~~~168/home/nerves/.nerves/artifacts/nerves_system_rpi5-2.1.2/staging/usr/include/bits/math-vector.h:237:8: error: ‘__f32x4_t’ does not name a type169  237 | __vpcs __f32x4_t _ZGVnN4vv_hypotf (__f32x4_t, __f32x4_t);170      |        ^~~~~~~~~171/home/nerves/.nerves/artifacts/nerves_system_rpi5-2.1.2/staging/usr/include/bits/math-vector.h:238:8: error: ‘__f32x4_t’ does not name a type172  238 | __vpcs __f32x4_t _ZGVnN4v_logf (__f32x4_t);173      |        ^~~~~~~~~174/home/nerves/.nerves/artifacts/nerves_system_rpi5-2.1.2/staging/usr/include/bits/math-vector.h:239:8: error: ‘__f32x4_t’ does not name a type175  239 | __vpcs __f32x4_t _ZGVnN4v_log10f (__f32x4_t);176      |        ^~~~~~~~~177/home/nerves/.nerves/artifacts/nerves_system_rpi5-2.1.2/staging/usr/include/bits/math-vector.h:240:8: error: ‘__f32x4_t’ does not name a type178  240 | __vpcs __f32x4_t _ZGVnN4v_log10p1f (__f32x4_t);179      |        ^~~~~~~~~180/home/nerves/.nerves/artifacts/nerves_system_rpi5-2.1.2/staging/usr/include/bits/math-vector.h:241:8: error: ‘__f32x4_t’ does not name a type181  241 | __vpcs __f32x4_t _ZGVnN4v_log1pf (__f32x4_t);182      |        ^~~~~~~~~183/home/nerves/.nerves/artifacts/nerves_system_rpi5-2.1.2/staging/usr/include/bits/math-vector.h:242:8: error: ‘__f32x4_t’ does not name a type184  242 | __vpcs __f32x4_t _ZGVnN4v_log2f (__f32x4_t);185      |        ^~~~~~~~~186/home/nerves/.nerves/artifacts/nerves_system_rpi5-2.1.2/staging/usr/include/bits/math-vector.h:243:8: error: ‘__f32x4_t’ does not name a type187  243 | __vpcs __f32x4_t _ZGVnN4v_log2p1f (__f32x4_t);188      |        ^~~~~~~~~189/home/nerves/.nerves/artifacts/nerves_system_rpi5-2.1.2/staging/usr/include/bits/math-vector.h:244:8: error: ‘__f32x4_t’ does not name a type190  244 | __vpcs __f32x4_t _ZGVnN4v_logp1f (__f32x4_t);191      |        ^~~~~~~~~192/home/nerves/.nerves/artifacts/nerves_system_rpi5-2.1.2/staging/usr/include/bits/math-vector.h:245:8: error: ‘__f32x4_t’ does not name a type193  245 | __vpcs __f32x4_t _ZGVnN4vv_powf (__f32x4_t, __f32x4_t);194      |        ^~~~~~~~~195/home/nerves/.nerves/artifacts/nerves_system_rpi5-2.1.2/staging/usr/include/bits/math-vector.h:246:8: error: ‘__f32x4_t’ does not name a type196  246 | __vpcs __f32x4_t _ZGVnN4v_rsqrtf (__f32x4_t);197      |        ^~~~~~~~~198/home/nerves/.nerves/artifacts/nerves_system_rpi5-2.1.2/staging/usr/include/bits/math-vector.h:247:8: error: ‘__f32x4_t’ does not name a type199  247 | __vpcs __f32x4_t _ZGVnN4v_sinf (__f32x4_t);200      |        ^~~~~~~~~201/home/nerves/.nerves/artifacts/nerves_system_rpi5-2.1.2/staging/usr/include/bits/math-vector.h:248:8: error: ‘__f32x4_t’ does not name a type202  248 | __vpcs __f32x4_t _ZGVnN4v_sinhf (__f32x4_t);203      |        ^~~~~~~~~204/home/nerves/.nerves/artifacts/nerves_system_rpi5-2.1.2/staging/usr/include/bits/math-vector.h:249:8: error: ‘__f32x4_t’ does not name a type205  249 | __vpcs __f32x4_t _ZGVnN4v_sinpif (__f32x4_t);206      |        ^~~~~~~~~207/home/nerves/.nerves/artifacts/nerves_system_rpi5-2.1.2/staging/usr/include/bits/math-vector.h:250:8: error: ‘__f32x4_t’ does not name a type208  250 | __vpcs __f32x4_t _ZGVnN4v_tanf (__f32x4_t);209      |        ^~~~~~~~~210/home/nerves/.nerves/artifacts/nerves_system_rpi5-2.1.2/staging/usr/include/bits/math-vector.h:251:8: error: ‘__f32x4_t’ does not name a type211  251 | __vpcs __f32x4_t _ZGVnN4v_tanhf (__f32x4_t);212      |        ^~~~~~~~~213/home/nerves/.nerves/artifacts/nerves_system_rpi5-2.1.2/staging/usr/include/bits/math-vector.h:252:8: error: ‘__f32x4_t’ does not name a type214  252 | __vpcs __f32x4_t _ZGVnN4v_tanpif (__f32x4_t);215      |        ^~~~~~~~~216/home/nerves/.nerves/artifacts/nerves_system_rpi5-2.1.2/staging/usr/include/bits/math-vector.h:254:8: error: ‘__f64x2_t’ does not name a type217  254 | __vpcs __f64x2_t _ZGVnN2vv_atan2 (__f64x2_t, __f64x2_t);218      |        ^~~~~~~~~219/home/nerves/.nerves/artifacts/nerves_system_rpi5-2.1.2/staging/usr/include/bits/math-vector.h:255:8: error: ‘__f64x2_t’ does not name a type220  255 | __vpcs __f64x2_t _ZGVnN2vv_atan2pi (__f64x2_t, __f64x2_t);221      |        ^~~~~~~~~222/home/nerves/.nerves/artifacts/nerves_system_rpi5-2.1.2/staging/usr/include/bits/math-vector.h:256:8: error: ‘__f64x2_t’ does not name a type223  256 | __vpcs __f64x2_t _ZGVnN2v_acos (__f64x2_t);224      |        ^~~~~~~~~225/home/nerves/.nerves/artifacts/nerves_system_rpi5-2.1.2/staging/usr/include/bits/math-vector.h:257:8: error: ‘__f64x2_t’ does not name a type226  257 | __vpcs __f64x2_t _ZGVnN2v_acosh (__f64x2_t);227      |        ^~~~~~~~~228/home/nerves/.nerves/artifacts/nerves_system_rpi5-2.1.2/staging/usr/include/bits/math-vector.h:258:8: error: ‘__f64x2_t’ does not name a type229  258 | __vpcs __f64x2_t _ZGVnN2v_acospi (__f64x2_t);230      |        ^~~~~~~~~231/home/nerves/.nerves/artifacts/nerves_system_rpi5-2.1.2/staging/usr/include/bits/math-vector.h:259:8: error: ‘__f64x2_t’ does not name a type232  259 | __vpcs __f64x2_t _ZGVnN2v_asin (__f64x2_t);233      |        ^~~~~~~~~234/home/nerves/.nerves/artifacts/nerves_system_rpi5-2.1.2/staging/usr/include/bits/math-vector.h:260:8: error: ‘__f64x2_t’ does not name a type235  260 | __vpcs __f64x2_t _ZGVnN2v_asinh (__f64x2_t);236      |        ^~~~~~~~~237/home/nerves/.nerves/artifacts/nerves_system_rpi5-2.1.2/staging/usr/include/bits/math-vector.h:261:8: error: ‘__f64x2_t’ does not name a type238  261 | __vpcs __f64x2_t _ZGVnN2v_asinpi (__f64x2_t);239      |        ^~~~~~~~~240/home/nerves/.nerves/artifacts/nerves_system_rpi5-2.1.2/staging/usr/include/bits/math-vector.h:262:8: error: ‘__f64x2_t’ does not name a type241  262 | __vpcs __f64x2_t _ZGVnN2v_atan (__f64x2_t);242      |        ^~~~~~~~~243/home/nerves/.nerves/artifacts/nerves_system_rpi5-2.1.2/staging/usr/include/bits/math-vector.h:263:8: error: ‘__f64x2_t’ does not name a type244  263 | __vpcs __f64x2_t _ZGVnN2v_atanh (__f64x2_t);245      |        ^~~~~~~~~246/home/nerves/.nerves/artifacts/nerves_system_rpi5-2.1.2/staging/usr/include/bits/math-vector.h:264:8: error: ‘__f64x2_t’ does not name a type247  264 | __vpcs __f64x2_t _ZGVnN2v_atanpi (__f64x2_t);248      |        ^~~~~~~~~249/home/nerves/.nerves/artifacts/nerves_system_rpi5-2.1.2/staging/usr/include/bits/math-vector.h:265:8: error: ‘__f64x2_t’ does not name a type250  265 | __vpcs __f64x2_t _ZGVnN2v_cbrt (__f64x2_t);251      |        ^~~~~~~~~252/home/nerves/.nerves/artifacts/nerves_system_rpi5-2.1.2/staging/usr/include/bits/math-vector.h:266:8: error: ‘__f64x2_t’ does not name a type253  266 | __vpcs __f64x2_t _ZGVnN2v_cos (__f64x2_t);254      |        ^~~~~~~~~255/home/nerves/.nerves/artifacts/nerves_system_rpi5-2.1.2/staging/usr/include/bits/math-vector.h:267:8: error: ‘__f64x2_t’ does not name a type256  267 | __vpcs __f64x2_t _ZGVnN2v_cosh (__f64x2_t);257      |        ^~~~~~~~~258/home/nerves/.nerves/artifacts/nerves_system_rpi5-2.1.2/staging/usr/include/bits/math-vector.h:268:8: error: ‘__f64x2_t’ does not name a type259  268 | __vpcs __f64x2_t _ZGVnN2v_cospi (__f64x2_t);260      |        ^~~~~~~~~261/home/nerves/.nerves/artifacts/nerves_system_rpi5-2.1.2/staging/usr/include/bits/math-vector.h:269:8: error: ‘__f64x2_t’ does not name a type262  269 | __vpcs __f64x2_t _ZGVnN2v_erf (__f64x2_t);263      |        ^~~~~~~~~264/home/nerves/.nerves/artifacts/nerves_system_rpi5-2.1.2/staging/usr/include/bits/math-vector.h:270:8: error: ‘__f64x2_t’ does not name a type265  270 | __vpcs __f64x2_t _ZGVnN2v_erfc (__f64x2_t);266      |        ^~~~~~~~~267/home/nerves/.nerves/artifacts/nerves_system_rpi5-2.1.2/staging/usr/include/bits/math-vector.h:271:8: error: ‘__f64x2_t’ does not name a type268  271 | __vpcs __f64x2_t _ZGVnN2v_exp (__f64x2_t);269      |        ^~~~~~~~~270/home/nerves/.nerves/artifacts/nerves_system_rpi5-2.1.2/staging/usr/include/bits/math-vector.h:272:8: error: ‘__f64x2_t’ does not name a type271  272 | __vpcs __f64x2_t _ZGVnN2v_exp10 (__f64x2_t);272      |        ^~~~~~~~~273/home/nerves/.nerves/artifacts/nerves_system_rpi5-2.1.2/staging/usr/include/bits/math-vector.h:273:8: error: ‘__f64x2_t’ does not name a type274  273 | __vpcs __f64x2_t _ZGVnN2v_exp2 (__f64x2_t);275      |        ^~~~~~~~~276/home/nerves/.nerves/artifacts/nerves_system_rpi5-2.1.2/staging/usr/include/bits/math-vector.h:274:8: error: ‘__f64x2_t’ does not name a type277  274 | __vpcs __f64x2_t _ZGVnN2v_expm1 (__f64x2_t);278      |        ^~~~~~~~~279/home/nerves/.nerves/artifacts/nerves_system_rpi5-2.1.2/staging/usr/include/bits/math-vector.h:275:8: error: ‘__f64x2_t’ does not name a type280  275 | __vpcs __f64x2_t _ZGVnN2v_exp2m1 (__f64x2_t);281      |        ^~~~~~~~~282/home/nerves/.nerves/artifacts/nerves_system_rpi5-2.1.2/staging/usr/include/bits/math-vector.h:276:8: error: ‘__f64x2_t’ does not name a type283  276 | __vpcs __f64x2_t _ZGVnN2v_exp10m1 (__f64x2_t);284      |        ^~~~~~~~~285/home/nerves/.nerves/artifacts/nerves_system_rpi5-2.1.2/staging/usr/include/bits/math-vector.h:277:8: error: ‘__f64x2_t’ does not name a type286  277 | __vpcs __f64x2_t _ZGVnN2vv_hypot (__f64x2_t, __f64x2_t);287      |        ^~~~~~~~~288/home/nerves/.nerves/artifacts/nerves_system_rpi5-2.1.2/staging/usr/include/bits/math-vector.h:278:8: error: ‘__f64x2_t’ does not name a type289  278 | __vpcs __f64x2_t _ZGVnN2v_log (__f64x2_t);290      |        ^~~~~~~~~291/home/nerves/.nerves/artifacts/nerves_system_rpi5-2.1.2/staging/usr/include/bits/math-vector.h:279:8: error: ‘__f64x2_t’ does not name a type292  279 | __vpcs __f64x2_t _ZGVnN2v_log10 (__f64x2_t);293      |        ^~~~~~~~~294/home/nerves/.nerves/artifacts/nerves_system_rpi5-2.1.2/staging/usr/include/bits/math-vector.h:280:8: error: ‘__f64x2_t’ does not name a type295  280 | __vpcs __f64x2_t _ZGVnN2v_log10p1 (__f64x2_t);296      |        ^~~~~~~~~297/home/nerves/.nerves/artifacts/nerves_system_rpi5-2.1.2/staging/usr/include/bits/math-vector.h:281:8: error: ‘__f64x2_t’ does not name a type298  281 | __vpcs __f64x2_t _ZGVnN2v_log1p (__f64x2_t);299      |        ^~~~~~~~~300/home/nerves/.nerves/artifacts/nerves_system_rpi5-2.1.2/staging/usr/include/bits/math-vector.h:282:8: error: ‘__f64x2_t’ does not name a type301  282 | __vpcs __f64x2_t _ZGVnN2v_log2 (__f64x2_t);302      |        ^~~~~~~~~303/home/nerves/.nerves/artifacts/nerves_system_rpi5-2.1.2/staging/usr/include/bits/math-vector.h:283:8: error: ‘__f64x2_t’ does not name a type304  283 | __vpcs __f64x2_t _ZGVnN2v_log2p1 (__f64x2_t);305      |        ^~~~~~~~~306/home/nerves/.nerves/artifacts/nerves_system_rpi5-2.1.2/staging/usr/include/bits/math-vector.h:284:8: error: ‘__f64x2_t’ does not name a type307  284 | __vpcs __f64x2_t _ZGVnN2v_logp1 (__f64x2_t);308      |        ^~~~~~~~~309/home/nerves/.nerves/artifacts/nerves_system_rpi5-2.1.2/staging/usr/include/bits/math-vector.h:285:8: error: ‘__f64x2_t’ does not name a type310  285 | __vpcs __f64x2_t _ZGVnN2vv_pow (__f64x2_t, __f64x2_t);311      |        ^~~~~~~~~312/home/nerves/.nerves/artifacts/nerves_system_rpi5-2.1.2/staging/usr/include/bits/math-vector.h:286:8: error: ‘__f64x2_t’ does not name a type313  286 | __vpcs __f64x2_t _ZGVnN2v_rsqrt (__f64x2_t);314      |        ^~~~~~~~~315/home/nerves/.nerves/artifacts/nerves_system_rpi5-2.1.2/staging/usr/include/bits/math-vector.h:287:8: error: ‘__f64x2_t’ does not name a type316  287 | __vpcs __f64x2_t _ZGVnN2v_sin (__f64x2_t);317      |        ^~~~~~~~~318/home/nerves/.nerves/artifacts/nerves_system_rpi5-2.1.2/staging/usr/include/bits/math-vector.h:288:8: error: ‘__f64x2_t’ does not name a type319  288 | __vpcs __f64x2_t _ZGVnN2v_sinh (__f64x2_t);320      |        ^~~~~~~~~321/home/nerves/.nerves/artifacts/nerves_system_rpi5-2.1.2/staging/usr/include/bits/math-vector.h:289:8: error: ‘__f64x2_t’ does not name a type322  289 | __vpcs __f64x2_t _ZGVnN2v_sinpi (__f64x2_t);323      |        ^~~~~~~~~324/home/nerves/.nerves/artifacts/nerves_system_rpi5-2.1.2/staging/usr/include/bits/math-vector.h:290:8: error: ‘__f64x2_t’ does not name a type325  290 | __vpcs __f64x2_t _ZGVnN2v_tan (__f64x2_t);326      |        ^~~~~~~~~327/home/nerves/.nerves/artifacts/nerves_system_rpi5-2.1.2/staging/usr/include/bits/math-vector.h:291:8: error: ‘__f64x2_t’ does not name a type328  291 | __vpcs __f64x2_t _ZGVnN2v_tanh (__f64x2_t);329      |        ^~~~~~~~~330/home/nerves/.nerves/artifacts/nerves_system_rpi5-2.1.2/staging/usr/include/bits/math-vector.h:292:8: error: ‘__f64x2_t’ does not name a type331  292 | __vpcs __f64x2_t _ZGVnN2v_tanpi (__f64x2_t);332      |        ^~~~~~~~~333/home/nerves/.nerves/artifacts/nerves_system_rpi5-2.1.2/staging/usr/include/bits/math-vector.h:299:1: error: ‘__sv_f32_t’ does not name a type334  299 | __sv_f32_t _ZGVsMxvv_atan2f (__sv_f32_t, __sv_f32_t, __sv_bool_t);335      | ^~~~~~~~~~336/home/nerves/.nerves/artifacts/nerves_system_rpi5-2.1.2/staging/usr/include/bits/math-vector.h:300:1: error: ‘__sv_f32_t’ does not name a type337  300 | __sv_f32_t _ZGVsMxvv_atan2pif (__sv_f32_t, __sv_f32_t, __sv_bool_t);338      | ^~~~~~~~~~339/home/nerves/.nerves/artifacts/nerves_system_rpi5-2.1.2/staging/usr/include/bits/math-vector.h:301:1: error: ‘__sv_f32_t’ does not name a type340  301 | __sv_f32_t _ZGVsMxv_acosf (__sv_f32_t, __sv_bool_t);341      | ^~~~~~~~~~342/home/nerves/.nerves/artifacts/nerves_system_rpi5-2.1.2/staging/usr/include/bits/math-vector.h:302:1: error: ‘__sv_f32_t’ does not name a type343  302 | __sv_f32_t _ZGVsMxv_acoshf (__sv_f32_t, __sv_bool_t);344      | ^~~~~~~~~~345/home/nerves/.nerves/artifacts/nerves_system_rpi5-2.1.2/staging/usr/include/bits/math-vector.h:303:1: error: ‘__sv_f32_t’ does not name a type346  303 | __sv_f32_t _ZGVsMxv_acospif (__sv_f32_t, __sv_bool_t);347      | ^~~~~~~~~~348/home/nerves/.nerves/artifacts/nerves_system_rpi5-2.1.2/staging/usr/include/bits/math-vector.h:304:1: error: ‘__sv_f32_t’ does not name a type349  304 | __sv_f32_t _ZGVsMxv_asinf (__sv_f32_t, __sv_bool_t);350      | ^~~~~~~~~~351/home/nerves/.nerves/artifacts/nerves_system_rpi5-2.1.2/staging/usr/include/bits/math-vector.h:305:1: error: ‘__sv_f32_t’ does not name a type352  305 | __sv_f32_t _ZGVsMxv_asinhf (__sv_f32_t, __sv_bool_t);353      | ^~~~~~~~~~354/home/nerves/.nerves/artifacts/nerves_system_rpi5-2.1.2/staging/usr/include/bits/math-vector.h:306:1: error: ‘__sv_f32_t’ does not name a type355  306 | __sv_f32_t _ZGVsMxv_asinpif (__sv_f32_t, __sv_bool_t);356      | ^~~~~~~~~~357/home/nerves/.nerves/artifacts/nerves_system_rpi5-2.1.2/staging/usr/include/bits/math-vector.h:307:1: error: ‘__sv_f32_t’ does not name a type358  307 | __sv_f32_t _ZGVsMxv_atanf (__sv_f32_t, __sv_bool_t);359      | ^~~~~~~~~~360/home/nerves/.nerves/artifacts/nerves_system_rpi5-2.1.2/staging/usr/include/bits/math-vector.h:308:1: error: ‘__sv_f32_t’ does not name a type361  308 | __sv_f32_t _ZGVsMxv_atanhf (__sv_f32_t, __sv_bool_t);362      | ^~~~~~~~~~363/home/nerves/.nerves/artifacts/nerves_system_rpi5-2.1.2/staging/usr/include/bits/math-vector.h:309:1: error: ‘__sv_f32_t’ does not name a type364  309 | __sv_f32_t _ZGVsMxv_atanpif (__sv_f32_t, __sv_bool_t);365      | ^~~~~~~~~~366/home/nerves/.nerves/artifacts/nerves_system_rpi5-2.1.2/staging/usr/include/bits/math-vector.h:310:1: error: ‘__sv_f32_t’ does not name a type367  310 | __sv_f32_t _ZGVsMxv_cbrtf (__sv_f32_t, __sv_bool_t);368      | ^~~~~~~~~~369/home/nerves/.nerves/artifacts/nerves_system_rpi5-2.1.2/staging/usr/include/bits/math-vector.h:311:1: error: ‘__sv_f32_t’ does not name a type370  311 | __sv_f32_t _ZGVsMxv_cosf (__sv_f32_t, __sv_bool_t);371      | ^~~~~~~~~~372/home/nerves/.nerves/artifacts/nerves_system_rpi5-2.1.2/staging/usr/include/bits/math-vector.h:312:1: error: ‘__sv_f32_t’ does not name a type373  312 | __sv_f32_t _ZGVsMxv_coshf (__sv_f32_t, __sv_bool_t);374      | ^~~~~~~~~~375/home/nerves/.nerves/artifacts/nerves_system_rpi5-2.1.2/staging/usr/include/bits/math-vector.h:313:1: error: ‘__sv_f32_t’ does not name a type376  313 | __sv_f32_t _ZGVsMxv_cospif (__sv_f32_t, __sv_bool_t);377      | ^~~~~~~~~~378/home/nerves/.nerves/artifacts/nerves_system_rpi5-2.1.2/staging/usr/include/bits/math-vector.h:314:1: error: ‘__sv_f32_t’ does not name a type379  314 | __sv_f32_t _ZGVsMxv_erff (__sv_f32_t, __sv_bool_t);380      | ^~~~~~~~~~381/home/nerves/.nerves/artifacts/nerves_system_rpi5-2.1.2/staging/usr/include/bits/math-vector.h:315:1: error: ‘__sv_f32_t’ does not name a type382  315 | __sv_f32_t _ZGVsMxv_erfcf (__sv_f32_t, __sv_bool_t);383      | ^~~~~~~~~~384/home/nerves/.nerves/artifacts/nerves_system_rpi5-2.1.2/staging/usr/include/bits/math-vector.h:316:1: error: ‘__sv_f32_t’ does not name a type385  316 | __sv_f32_t _ZGVsMxv_expf (__sv_f32_t, __sv_bool_t);386      | ^~~~~~~~~~387/home/nerves/.nerves/artifacts/nerves_system_rpi5-2.1.2/staging/usr/include/bits/math-vector.h:317:1: error: ‘__sv_f32_t’ does not name a type388  317 | __sv_f32_t _ZGVsMxv_exp10f (__sv_f32_t, __sv_bool_t);389      | ^~~~~~~~~~390/home/nerves/.nerves/artifacts/nerves_system_rpi5-2.1.2/staging/usr/include/bits/math-vector.h:318:1: error: ‘__sv_f32_t’ does not name a type391  318 | __sv_f32_t _ZGVsMxv_exp2f (__sv_f32_t, __sv_bool_t);392      | ^~~~~~~~~~393/home/nerves/.nerves/artifacts/nerves_system_rpi5-2.1.2/staging/usr/include/bits/math-vector.h:319:1: error: ‘__sv_f32_t’ does not name a type394  319 | __sv_f32_t _ZGVsMxv_expm1f (__sv_f32_t, __sv_bool_t);395      | ^~~~~~~~~~396/home/nerves/.nerves/artifacts/nerves_system_rpi5-2.1.2/staging/usr/include/bits/math-vector.h:320:1: error: ‘__sv_f32_t’ does not name a type397  320 | __sv_f32_t _ZGVsMxv_exp2m1f (__sv_f32_t, __sv_bool_t);398      | ^~~~~~~~~~399/home/nerves/.nerves/artifacts/nerves_system_rpi5-2.1.2/staging/usr/include/bits/math-vector.h:321:1: error: ‘__sv_f32_t’ does not name a type400  321 | __sv_f32_t _ZGVsMxv_exp10m1f (__sv_f32_t, __sv_bool_t);401      | ^~~~~~~~~~402/home/nerves/.nerves/artifacts/nerves_system_rpi5-2.1.2/staging/usr/include/bits/math-vector.h:322:1: error: ‘__sv_f32_t’ does not name a type403  322 | __sv_f32_t _ZGVsMxvv_hypotf (__sv_f32_t, __sv_f32_t, __sv_bool_t);404      | ^~~~~~~~~~405/home/nerves/.nerves/artifacts/nerves_system_rpi5-2.1.2/staging/usr/include/bits/math-vector.h:323:1: error: ‘__sv_f32_t’ does not name a type406  323 | __sv_f32_t _ZGVsMxv_logf (__sv_f32_t, __sv_bool_t);407      | ^~~~~~~~~~408/home/nerves/.nerves/artifacts/nerves_system_rpi5-2.1.2/staging/usr/include/bits/math-vector.h:324:1: error: ‘__sv_f32_t’ does not name a type409  324 | __sv_f32_t _ZGVsMxv_log10f (__sv_f32_t, __sv_bool_t);410      | ^~~~~~~~~~411/home/nerves/.nerves/artifacts/nerves_system_rpi5-2.1.2/staging/usr/include/bits/math-vector.h:325:1: error: ‘__sv_f32_t’ does not name a type412  325 | __sv_f32_t _ZGVsMxv_log10p1f (__sv_f32_t, __sv_bool_t);413      | ^~~~~~~~~~414/home/nerves/.nerves/artifacts/nerves_system_rpi5-2.1.2/staging/usr/include/bits/math-vector.h:326:1: error: ‘__sv_f32_t’ does not name a type415  326 | __sv_f32_t _ZGVsMxv_log1pf (__sv_f32_t, __sv_bool_t);416      | ^~~~~~~~~~417/home/nerves/.nerves/artifacts/nerves_system_rpi5-2.1.2/staging/usr/include/bits/math-vector.h:327:1: error: ‘__sv_f32_t’ does not name a type418  327 | __sv_f32_t _ZGVsMxv_log2f (__sv_f32_t, __sv_bool_t);419      | ^~~~~~~~~~420/home/nerves/.nerves/artifacts/nerves_system_rpi5-2.1.2/staging/usr/include/bits/math-vector.h:328:1: error: ‘__sv_f32_t’ does not name a type421  328 | __sv_f32_t _ZGVsMxv_log2p1f (__sv_f32_t, __sv_bool_t);422      | ^~~~~~~~~~423/home/nerves/.nerves/artifacts/nerves_system_rpi5-2.1.2/staging/usr/include/bits/math-vector.h:329:1: error: ‘__sv_f32_t’ does not name a type424  329 | __sv_f32_t _ZGVsMxv_logp1f (__sv_f32_t, __sv_bool_t);425      | ^~~~~~~~~~426/home/nerves/.nerves/artifacts/nerves_system_rpi5-2.1.2/staging/usr/include/bits/math-vector.h:330:1: error: ‘__sv_f32_t’ does not name a type427  330 | __sv_f32_t _ZGVsMxvv_powf (__sv_f32_t, __sv_f32_t, __sv_bool_t);428      | ^~~~~~~~~~429/home/nerves/.nerves/artifacts/nerves_system_rpi5-2.1.2/staging/usr/include/bits/math-vector.h:331:1: error: ‘__sv_f32_t’ does not name a type430  331 | __sv_f32_t _ZGVsMxv_rsqrtf (__sv_f32_t, __sv_bool_t);431      | ^~~~~~~~~~432/home/nerves/.nerves/artifacts/nerves_system_rpi5-2.1.2/staging/usr/include/bits/math-vector.h:332:1: error: ‘__sv_f32_t’ does not name a type433  332 | __sv_f32_t _ZGVsMxv_sinf (__sv_f32_t, __sv_bool_t);434      | ^~~~~~~~~~435/home/nerves/.nerves/artifacts/nerves_system_rpi5-2.1.2/staging/usr/include/bits/math-vector.h:333:1: error: ‘__sv_f32_t’ does not name a type436  333 | __sv_f32_t _ZGVsMxv_sinhf (__sv_f32_t, __sv_bool_t);437      | ^~~~~~~~~~438/home/nerves/.nerves/artifacts/nerves_system_rpi5-2.1.2/staging/usr/include/bits/math-vector.h:334:1: error: ‘__sv_f32_t’ does not name a type439  334 | __sv_f32_t _ZGVsMxv_sinpif (__sv_f32_t, __sv_bool_t);440      | ^~~~~~~~~~441/home/nerves/.nerves/artifacts/nerves_system_rpi5-2.1.2/staging/usr/include/bits/math-vector.h:335:1: error: ‘__sv_f32_t’ does not name a type442  335 | __sv_f32_t _ZGVsMxv_tanf (__sv_f32_t, __sv_bool_t);443      | ^~~~~~~~~~444/home/nerves/.nerves/artifacts/nerves_system_rpi5-2.1.2/staging/usr/include/bits/math-vector.h:336:1: error: ‘__sv_f32_t’ does not name a type445  336 | __sv_f32_t _ZGVsMxv_tanhf (__sv_f32_t, __sv_bool_t);446      | ^~~~~~~~~~447/home/nerves/.nerves/artifacts/nerves_system_rpi5-2.1.2/staging/usr/include/bits/math-vector.h:337:1: error: ‘__sv_f32_t’ does not name a type448  337 | __sv_f32_t _ZGVsMxv_tanpif (__sv_f32_t, __sv_bool_t);449      | ^~~~~~~~~~450/home/nerves/.nerves/artifacts/nerves_system_rpi5-2.1.2/staging/usr/include/bits/math-vector.h:339:1: error: ‘__sv_f64_t’ does not name a type; did you mean ‘__off64_t’?451  339 | __sv_f64_t _ZGVsMxvv_atan2 (__sv_f64_t, __sv_f64_t, __sv_bool_t);452      | ^~~~~~~~~~453      | __off64_t454/home/nerves/.nerves/artifacts/nerves_system_rpi5-2.1.2/staging/usr/include/bits/math-vector.h:340:1: error: ‘__sv_f64_t’ does not name a type; did you mean ‘__off64_t’?455  340 | __sv_f64_t _ZGVsMxvv_atan2pi (__sv_f64_t, __sv_f64_t, __sv_bool_t);456      | ^~~~~~~~~~457      | __off64_t458/home/nerves/.nerves/artifacts/nerves_system_rpi5-2.1.2/staging/usr/include/bits/math-vector.h:341:1: error: ‘__sv_f64_t’ does not name a type; did you mean ‘__off64_t’?459  341 | __sv_f64_t _ZGVsMxv_acos (__sv_f64_t, __sv_bool_t);460      | ^~~~~~~~~~461      | __off64_t462/home/nerves/.nerves/artifacts/nerves_system_rpi5-2.1.2/staging/usr/include/bits/math-vector.h:342:1: error: ‘__sv_f64_t’ does not name a type; did you mean ‘__off64_t’?463  342 | __sv_f64_t _ZGVsMxv_acosh (__sv_f64_t, __sv_bool_t);464      | ^~~~~~~~~~465      | __off64_t466/home/nerves/.nerves/artifacts/nerves_system_rpi5-2.1.2/staging/usr/include/bits/math-vector.h:343:1: error: ‘__sv_f64_t’ does not name a type; did you mean ‘__off64_t’?467  343 | __sv_f64_t _ZGVsMxv_acospi (__sv_f64_t, __sv_bool_t);468      | ^~~~~~~~~~469      | __off64_t470/home/nerves/.nerves/artifacts/nerves_system_rpi5-2.1.2/staging/usr/include/bits/math-vector.h:344:1: error: ‘__sv_f64_t’ does not name a type; did you mean ‘__off64_t’?471  344 | __sv_f64_t _ZGVsMxv_asin (__sv_f64_t, __sv_bool_t);472      | ^~~~~~~~~~473      | __off64_t474/home/nerves/.nerves/artifacts/nerves_system_rpi5-2.1.2/staging/usr/include/bits/math-vector.h:345:1: error: ‘__sv_f64_t’ does not name a type; did you mean ‘__off64_t’?475  345 | __sv_f64_t _ZGVsMxv_asinh (__sv_f64_t, __sv_bool_t);476      | ^~~~~~~~~~477      | __off64_t478/home/nerves/.nerves/artifacts/nerves_system_rpi5-2.1.2/staging/usr/include/bits/math-vector.h:346:1: error: ‘__sv_f64_t’ does not name a type; did you mean ‘__off64_t’?479  346 | __sv_f64_t _ZGVsMxv_asinpi (__sv_f64_t, __sv_bool_t);480      | ^~~~~~~~~~481      | __off64_t482/home/nerves/.nerves/artifacts/nerves_system_rpi5-2.1.2/staging/usr/include/bits/math-vector.h:347:1: error: ‘__sv_f64_t’ does not name a type; did you mean ‘__off64_t’?483  347 | __sv_f64_t _ZGVsMxv_atan (__sv_f64_t, __sv_bool_t);484      | ^~~~~~~~~~485      | __off64_t486/home/nerves/.nerves/artifacts/nerves_system_rpi5-2.1.2/staging/usr/include/bits/math-vector.h:348:1: error: ‘__sv_f64_t’ does not name a type; did you mean ‘__off64_t’?487  348 | __sv_f64_t _ZGVsMxv_atanh (__sv_f64_t, __sv_bool_t);488      | ^~~~~~~~~~489      | __off64_t490/home/nerves/.nerves/artifacts/nerves_system_rpi5-2.1.2/staging/usr/include/bits/math-vector.h:349:1: error: ‘__sv_f64_t’ does not name a type; did you mean ‘__off64_t’?491  349 | __sv_f64_t _ZGVsMxv_atanpi (__sv_f64_t, __sv_bool_t);492      | ^~~~~~~~~~493      | __off64_t494/home/nerves/.nerves/artifacts/nerves_system_rpi5-2.1.2/staging/usr/include/bits/math-vector.h:350:1: error: ‘__sv_f64_t’ does not name a type; did you mean ‘__off64_t’?495  350 | __sv_f64_t _ZGVsMxv_cbrt (__sv_f64_t, __sv_bool_t);496      | ^~~~~~~~~~497      | __off64_t498/home/nerves/.nerves/artifacts/nerves_system_rpi5-2.1.2/staging/usr/include/bits/math-vector.h:351:1: error: ‘__sv_f64_t’ does not name a type; did you mean ‘__off64_t’?499  351 | __sv_f64_t _ZGVsMxv_cos (__sv_f64_t, __sv_bool_t);500      | ^~~~~~~~~~501      | __off64_t502/home/nerves/.nerves/artifacts/nerves_system_rpi5-2.1.2/staging/usr/include/bits/math-vector.h:352:1: error: ‘__sv_f64_t’ does not name a type; did you mean ‘__off64_t’?503  352 | __sv_f64_t _ZGVsMxv_cosh (__sv_f64_t, __sv_bool_t);504      | ^~~~~~~~~~505      | __off64_t506/home/nerves/.nerves/artifacts/nerves_system_rpi5-2.1.2/staging/usr/include/bits/math-vector.h:353:1: error: ‘__sv_f64_t’ does not name a type; did you mean ‘__off64_t’?507  353 | __sv_f64_t _ZGVsMxv_cospi (__sv_f64_t, __sv_bool_t);508      | ^~~~~~~~~~509      | __off64_t510/home/nerves/.nerves/artifacts/nerves_system_rpi5-2.1.2/staging/usr/include/bits/math-vector.h:354:1: error: ‘__sv_f64_t’ does not name a type; did you mean ‘__off64_t’?511  354 | __sv_f64_t _ZGVsMxv_erf (__sv_f64_t, __sv_bool_t);512      | ^~~~~~~~~~513      | __off64_t514/home/nerves/.nerves/artifacts/nerves_system_rpi5-2.1.2/staging/usr/include/bits/math-vector.h:355:1: error: ‘__sv_f64_t’ does not name a type; did you mean ‘__off64_t’?515  355 | __sv_f64_t _ZGVsMxv_erfc (__sv_f64_t, __sv_bool_t);516      | ^~~~~~~~~~517      | __off64_t518/home/nerves/.nerves/artifacts/nerves_system_rpi5-2.1.2/staging/usr/include/bits/math-vector.h:356:1: error: ‘__sv_f64_t’ does not name a type; did you mean ‘__off64_t’?519  356 | __sv_f64_t _ZGVsMxv_exp (__sv_f64_t, __sv_bool_t);520      | ^~~~~~~~~~521      | __off64_t522/home/nerves/.nerves/artifacts/nerves_system_rpi5-2.1.2/staging/usr/include/bits/math-vector.h:357:1: error: ‘__sv_f64_t’ does not name a type; did you mean ‘__off64_t’?523  357 | __sv_f64_t _ZGVsMxv_exp10 (__sv_f64_t, __sv_bool_t);524      | ^~~~~~~~~~525      | __off64_t526/home/nerves/.nerves/artifacts/nerves_system_rpi5-2.1.2/staging/usr/include/bits/math-vector.h:358:1: error: ‘__sv_f64_t’ does not name a type; did you mean ‘__off64_t’?527  358 | __sv_f64_t _ZGVsMxv_exp2 (__sv_f64_t, __sv_bool_t);528      | ^~~~~~~~~~529      | __off64_t530/home/nerves/.nerves/artifacts/nerves_system_rpi5-2.1.2/staging/usr/include/bits/math-vector.h:359:1: error: ‘__sv_f64_t’ does not name a type; did you mean ‘__off64_t’?531  359 | __sv_f64_t _ZGVsMxv_expm1 (__sv_f64_t, __sv_bool_t);532      | ^~~~~~~~~~533      | __off64_t534/home/nerves/.nerves/artifacts/nerves_system_rpi5-2.1.2/staging/usr/include/bits/math-vector.h:360:1: error: ‘__sv_f64_t’ does not name a type; did you mean ‘__off64_t’?535  360 | __sv_f64_t _ZGVsMxv_exp2m1 (__sv_f64_t, __sv_bool_t);536      | ^~~~~~~~~~537      | __off64_t538/home/nerves/.nerves/artifacts/nerves_system_rpi5-2.1.2/staging/usr/include/bits/math-vector.h:361:1: error: ‘__sv_f64_t’ does not name a type; did you mean ‘__off64_t’?539  361 | __sv_f64_t _ZGVsMxv_exp10m1 (__sv_f64_t, __sv_bool_t);540      | ^~~~~~~~~~541      | __off64_t542/home/nerves/.nerves/artifacts/nerves_system_rpi5-2.1.2/staging/usr/include/bits/math-vector.h:362:1: error: ‘__sv_f64_t’ does not name a type; did you mean ‘__off64_t’?543  362 | __sv_f64_t _ZGVsMxvv_hypot (__sv_f64_t, __sv_f64_t, __sv_bool_t);544      | ^~~~~~~~~~545      | __off64_t546/home/nerves/.nerves/artifacts/nerves_system_rpi5-2.1.2/staging/usr/include/bits/math-vector.h:363:1: error: ‘__sv_f64_t’ does not name a type; did you mean ‘__off64_t’?547  363 | __sv_f64_t _ZGVsMxv_log (__sv_f64_t, __sv_bool_t);548      | ^~~~~~~~~~549      | __off64_t550/home/nerves/.nerves/artifacts/nerves_system_rpi5-2.1.2/staging/usr/include/bits/math-vector.h:364:1: error: ‘__sv_f64_t’ does not name a type; did you mean ‘__off64_t’?551  364 | __sv_f64_t _ZGVsMxv_log10 (__sv_f64_t, __sv_bool_t);552      | ^~~~~~~~~~553      | __off64_t554/home/nerves/.nerves/artifacts/nerves_system_rpi5-2.1.2/staging/usr/include/bits/math-vector.h:365:1: error: ‘__sv_f64_t’ does not name a type; did you mean ‘__off64_t’?555  365 | __sv_f64_t _ZGVsMxv_log10p1 (__sv_f64_t, __sv_bool_t);556      | ^~~~~~~~~~557      | __off64_t558/home/nerves/.nerves/artifacts/nerves_system_rpi5-2.1.2/staging/usr/include/bits/math-vector.h:366:1: error: ‘__sv_f64_t’ does not name a type; did you mean ‘__off64_t’?559  366 | __sv_f64_t _ZGVsMxv_log1p (__sv_f64_t, __sv_bool_t);560      | ^~~~~~~~~~561      | __off64_t562/home/nerves/.nerves/artifacts/nerves_system_rpi5-2.1.2/staging/usr/include/bits/math-vector.h:367:1: error: ‘__sv_f64_t’ does not name a type; did you mean ‘__off64_t’?563  367 | __sv_f64_t _ZGVsMxv_log2 (__sv_f64_t, __sv_bool_t);564      | ^~~~~~~~~~565      | __off64_t566/home/nerves/.nerves/artifacts/nerves_system_rpi5-2.1.2/staging/usr/include/bits/math-vector.h:368:1: error: ‘__sv_f64_t’ does not name a type; did you mean ‘__off64_t’?567  368 | __sv_f64_t _ZGVsMxv_log2p1 (__sv_f64_t, __sv_bool_t);568      | ^~~~~~~~~~569      | __off64_t570/home/nerves/.nerves/artifacts/nerves_system_rpi5-2.1.2/staging/usr/include/bits/math-vector.h:369:1: error: ‘__sv_f64_t’ does not name a type; did you mean ‘__off64_t’?571  369 | __sv_f64_t _ZGVsMxv_logp1 (__sv_f64_t, __sv_bool_t);572      | ^~~~~~~~~~573      | __off64_t574/home/nerves/.nerves/artifacts/nerves_system_rpi5-2.1.2/staging/usr/include/bits/math-vector.h:370:1: error: ‘__sv_f64_t’ does not name a type; did you mean ‘__off64_t’?575  370 | __sv_f64_t _ZGVsMxvv_pow (__sv_f64_t, __sv_f64_t, __sv_bool_t);576      | ^~~~~~~~~~577      | __off64_t578/home/nerves/.nerves/artifacts/nerves_system_rpi5-2.1.2/staging/usr/include/bits/math-vector.h:371:1: error: ‘__sv_f64_t’ does not name a type; did you mean ‘__off64_t’?579  371 | __sv_f64_t _ZGVsMxv_rsqrt (__sv_f64_t, __sv_bool_t);580      | ^~~~~~~~~~581      | __off64_t582/home/nerves/.nerves/artifacts/nerves_system_rpi5-2.1.2/staging/usr/include/bits/math-vector.h:372:1: error: ‘__sv_f64_t’ does not name a type; did you mean ‘__off64_t’?583  372 | __sv_f64_t _ZGVsMxv_sin (__sv_f64_t, __sv_bool_t);584      | ^~~~~~~~~~585      | __off64_t586/home/nerves/.nerves/artifacts/nerves_system_rpi5-2.1.2/staging/usr/include/bits/math-vector.h:373:1: error: ‘__sv_f64_t’ does not name a type; did you mean ‘__off64_t’?587  373 | __sv_f64_t _ZGVsMxv_sinh (__sv_f64_t, __sv_bool_t);588      | ^~~~~~~~~~589      | __off64_t590/home/nerves/.nerves/artifacts/nerves_system_rpi5-2.1.2/staging/usr/include/bits/math-vector.h:374:1: error: ‘__sv_f64_t’ does not name a type; did you mean ‘__off64_t’?591  374 | __sv_f64_t _ZGVsMxv_sinpi (__sv_f64_t, __sv_bool_t);592      | ^~~~~~~~~~593      | __off64_t594/home/nerves/.nerves/artifacts/nerves_system_rpi5-2.1.2/staging/usr/include/bits/math-vector.h:375:1: error: ‘__sv_f64_t’ does not name a type; did you mean ‘__off64_t’?595  375 | __sv_f64_t _ZGVsMxv_tan (__sv_f64_t, __sv_bool_t);596      | ^~~~~~~~~~597      | __off64_t598/home/nerves/.nerves/artifacts/nerves_system_rpi5-2.1.2/staging/usr/include/bits/math-vector.h:376:1: error: ‘__sv_f64_t’ does not name a type; did you mean ‘__off64_t’?599  376 | __sv_f64_t _ZGVsMxv_tanh (__sv_f64_t, __sv_bool_t);600      | ^~~~~~~~~~601      | __off64_t602/home/nerves/.nerves/artifacts/nerves_system_rpi5-2.1.2/staging/usr/include/bits/math-vector.h:377:1: error: ‘__sv_f64_t’ does not name a type; did you mean ‘__off64_t’?603  377 | __sv_f64_t _ZGVsMxv_tanpi (__sv_f64_t, __sv_bool_t);604      | ^~~~~~~~~~605      | __off64_t606make: *** [<builtin>: priv/boostnif.o] Error 1607could not compile dependency :exboost, "mix compile" failed. Errors may have been logged above. You can recompile this dependency with "mix deps.compile exboost --force", update it with "mix deps.update exboost" or clean it with "mix deps.clean exboost"608==> nerves_compatibility_test609** (Mix) Could not compile with "make" (exit status: 2).610You need to have gcc and make installed. If you are using611Ubuntu or any other Debian-based system, install the packages612"build-essential". Also install "erlang-dev" package if not613included in your Erlang/OTP version. If you're on Fedora, run614"dnf group install 'Development Tools'".615