Build log
host
exhort 0.1.1 · fail · run exhort-0.1.1-1791180505544
75 of 75 lines
1Resolving Hex dependencies...2Resolution completed in 0.124s3Unchanged:4 circular_buffer 1.1.05 elixir_make 0.10.06 exhort 0.1.17 interactive_cmd 0.1.48 nerves 2.0.0-pre.29 nerves_discovery 0.1.510 nerves_logging 0.2.411 nerves_runtime 0.13.1312 nerves_system_bbb 2.30.213 nerves_system_br 1.34.414 nerves_system_mangopi_mq_pro 0.17.215 nerves_system_qemu_aarch64 0.4.216 nerves_system_rpi0 2.1.217 nerves_system_rpi4 2.1.218 nerves_system_rpi5 2.1.219 nerves_system_trellis 0.5.020 nerves_system_x86_64 1.34.221 nerves_toolchain_aarch64_nerves_linux_gnu 15.3.122 nerves_toolchain_armv6_nerves_linux_gnueabihf 15.3.123 nerves_toolchain_armv7_nerves_linux_gnueabihf 15.3.124 nerves_toolchain_riscv64_nerves_linux_gnu 15.3.125 nerves_toolchain_x86_64_nerves_linux_musl 15.3.126 nerves_uevent 0.1.727 property_table 0.3.428 ring_logger 0.11.729 tablet 0.3.330 toolshed 0.5.031 uboot_env 1.0.232All dependencies have been fetched33==> exhort34c_src/bool_var.cc:2:10: fatal error: erl_nif.h: No such file or directory35 2 | #include "erl_nif.h"36 | ^~~~~~~~~~~37compilation terminated.38c_src/cp_model_builder.cc:3:10: fatal error: erl_nif.h: No such file or directory39 3 | #include "erl_nif.h"40 | ^~~~~~~~~~~41compilation terminated.42c_src/cp_solver_response.cc:3:10: fatal error: erl_nif.h: No such file or directory43 3 | #include "erl_nif.h"44 | ^~~~~~~~~~~45compilation terminated.46c_src/int_var.cc:2:10: fatal error: erl_nif.h: No such file or directory47 2 | #include "erl_nif.h"48 | ^~~~~~~~~~~49compilation terminated.50c_src/interval_var.cc:2:10: fatal error: erl_nif.h: No such file or directory51 2 | #include "erl_nif.h"52 | ^~~~~~~~~~~53compilation terminated.54c_src/linear_expression.cc:2:10: fatal error: erl_nif.h: No such file or directory55 2 | #include "erl_nif.h"56 | ^~~~~~~~~~~57compilation terminated.58c_src/nif.cc:2:10: fatal error: erl_nif.h: No such file or directory59 2 | #include "erl_nif.h"60 | ^~~~~~~~~~~61compilation terminated.62c_src/utility.cc:3:10: fatal error: erl_nif.h: No such file or directory63 3 | #include "erl_nif.h"64 | ^~~~~~~~~~~65compilation terminated.66make: *** [Makefile:25: priv/lib/nif.so] Error 167could not compile dependency :exhort, "mix compile" failed. Errors may have been logged above. You can recompile this dependency with "mix deps.compile exhort --force", update it with "mix deps.update exhort" or clean it with "mix deps.clean exhort"68==> nerves_compatibility_test69** (Mix) Could not compile with "make" (exit status: 2).70You need to have gcc and make installed. If you are using71Ubuntu or any other Debian-based system, install the packages72"build-essential". Also install "erlang-dev" package if not73included in your Erlang/OTP version. If you're on Fedora, run74"dnf group install 'Development Tools'".75