Build log
nerves_system_x86_64
exhort 0.1.1 · fail · run exhort-0.1.1-1791180505544
102 of 102 lines
1Resolving Hex dependencies...2Resolution completed in 0.14s3Unchanged:4 circular_buffer 1.1.05 elixir_make 0.10.06 exhort 0.1.17 interactive_cmd 0.1.48 nerves 2.0.0-pre.29 nerves_discovery 0.1.510 nerves_logging 0.2.411 nerves_runtime 0.13.1312 nerves_system_bbb 2.30.213 nerves_system_br 1.34.414 nerves_system_mangopi_mq_pro 0.17.215 nerves_system_qemu_aarch64 0.4.216 nerves_system_rpi0 2.1.217 nerves_system_rpi4 2.1.218 nerves_system_rpi5 2.1.219 nerves_system_trellis 0.5.020 nerves_system_x86_64 1.34.221 nerves_toolchain_aarch64_nerves_linux_gnu 15.3.122 nerves_toolchain_armv6_nerves_linux_gnueabihf 15.3.123 nerves_toolchain_armv7_nerves_linux_gnueabihf 15.3.124 nerves_toolchain_riscv64_nerves_linux_gnu 15.3.125 nerves_toolchain_x86_64_nerves_linux_musl 15.3.126 nerves_uevent 0.1.727 property_table 0.3.428 ring_logger 0.11.729 tablet 0.3.330 toolshed 0.5.031 uboot_env 1.0.232* Getting exhort (Hex package)33* Getting nerves (Hex package)34* Getting ring_logger (Hex package)35* Getting toolshed (Hex package)36* Getting nerves_runtime (Hex package)37* Getting nerves_system_bbb (Hex package)38* Getting nerves_system_mangopi_mq_pro (Hex package)39* Getting nerves_system_qemu_aarch64 (Hex package)40* Getting nerves_system_rpi0 (Hex package)41* Getting nerves_system_rpi4 (Hex package)42* Getting nerves_system_rpi5 (Hex package)43* Getting nerves_system_trellis (Hex package)44* Getting nerves_system_x86_64 (Hex package)45* Getting nerves_system_br (Hex package)46* Getting nerves_toolchain_x86_64_nerves_linux_musl (Hex package)47* Getting nerves_toolchain_armv7_nerves_linux_gnueabihf (Hex package)48* Getting nerves_toolchain_aarch64_nerves_linux_gnu (Hex package)49* Getting nerves_toolchain_armv6_nerves_linux_gnueabihf (Hex package)50* Getting nerves_toolchain_riscv64_nerves_linux_gnu (Hex package)51* Getting nerves_logging (Hex package)52* Getting nerves_uevent (Hex package)53* Getting uboot_env (Hex package)54* Getting elixir_make (Hex package)55* Getting property_table (Hex package)56* Getting circular_buffer (Hex package)57* Getting interactive_cmd (Hex package)58* Getting nerves_discovery (Hex package)59* Getting tablet (Hex package)60==> exhort61c_src/bool_var.cc:2:10: fatal error: erl_nif.h: No such file or directory62 2 | #include "erl_nif.h"63 | ^~~~~~~~~~~64compilation terminated.65c_src/cp_model_builder.cc:3:10: fatal error: erl_nif.h: No such file or directory66 3 | #include "erl_nif.h"67 | ^~~~~~~~~~~68compilation terminated.69c_src/cp_solver_response.cc:3:10: fatal error: erl_nif.h: No such file or directory70 3 | #include "erl_nif.h"71 | ^~~~~~~~~~~72compilation terminated.73c_src/int_var.cc:2:10: fatal error: erl_nif.h: No such file or directory74 2 | #include "erl_nif.h"75 | ^~~~~~~~~~~76compilation terminated.77c_src/interval_var.cc:2:10: fatal error: erl_nif.h: No such file or directory78 2 | #include "erl_nif.h"79 | ^~~~~~~~~~~80compilation terminated.81c_src/linear_expression.cc:2:10: fatal error: erl_nif.h: No such file or directory82 2 | #include "erl_nif.h"83 | ^~~~~~~~~~~84compilation terminated.85c_src/nif.cc:2:10: fatal error: erl_nif.h: No such file or directory86 2 | #include "erl_nif.h"87 | ^~~~~~~~~~~88compilation terminated.89c_src/utility.cc:3:10: fatal error: erl_nif.h: No such file or directory90 3 | #include "erl_nif.h"91 | ^~~~~~~~~~~92compilation terminated.93make: *** [Makefile:25: priv/lib/nif.so] Error 194could not compile dependency :exhort, "mix compile" failed. Errors may have been logged above. You can recompile this dependency with "mix deps.compile exhort --force", update it with "mix deps.update exhort" or clean it with "mix deps.clean exhort"95==> nerves_compatibility_test96** (Mix) Could not compile with "make" (exit status: 2).97You need to have gcc and make installed. If you are using98Ubuntu or any other Debian-based system, install the packages99"build-essential". Also install "erlang-dev" package if not100included in your Erlang/OTP version. If you're on Fedora, run101"dnf group install 'Development Tools'".102