homex

Build log

nerves_system_x86_64

homex 0.1.2 · fail · run homex-0.1.2-1789367439221
602 of 602 lines
1Resolving Hex dependencies...2Resolution completed in 0.405s3Unchanged:4  circular_buffer 1.1.05  cowlib 2.13.0 VULNERABLE!6    EEF-CVE-2026-43971 (MEDIUM)7    aka: CVE-2026-439718    Link Header Directive Smuggling via Unescaped target/rel/Attribute Keys in cow_link:link/19    https://osv.dev/vulnerability/EEF-CVE-2026-439711011    EEF-CVE-2026-43969 (LOW)12    aka: CVE-2026-43969, GHSA-g2wm-735q-3f5613    Cookie Request Header Injection via Unvalidated Encoder in cow_cookie:cookie/114    https://osv.dev/vulnerability/EEF-CVE-2026-439691516    EEF-CVE-2026-43968 (MEDIUM)17    aka: CVE-2026-43968, GHSA-hv23-4qp7-8c8r18    CR Injection in SSE Encoder Enables Event Splitting via cow_sse:event/119    https://osv.dev/vulnerability/EEF-CVE-2026-439682021    EEF-CVE-2026-7790 (HIGH)22    aka: CVE-2026-7790, GHSA-32p9-57cr-4x6523    Unbounded chunk-size hex digits in cowlib cause quadratic CPU and memory DoS24    https://osv.dev/vulnerability/EEF-CVE-2026-77902526    EEF-CVE-2026-43970 (HIGH)27    aka: CVE-2026-43970, GHSA-84f2-rp86-235p28    Decompression Bomb in cow_spdy:inflate/2 Allows Memory Exhaustion via Crafted SPDY Frame29    https://osv.dev/vulnerability/EEF-CVE-2026-439703031    EEF-CVE-2026-43966 (MEDIUM)32    aka: CVE-2026-43966, GHSA-w4f7-4cxr-rv3c33    HTTP Response Splitting via Non-VCHAR Bytes in cow_http_struct_hd:escape_string/234    https://osv.dev/vulnerability/EEF-CVE-2026-439663536    EEF-CVE-2026-59248 (HIGH)37    aka: CVE-2026-5924838    Unbounded HPACK/QPACK prefixed-integer decoding in Cowlib causes memory-exhaustion DoS39    https://osv.dev/vulnerability/EEF-CVE-2026-5924840  elixir_make 0.10.041  emqtt 1.14.742  getopt 1.0.343  gun 2.1.0 VULNERABLE!44    EEF-CVE-2026-43972 (MEDIUM)45    aka: CVE-2026-43972, GHSA-36w4-95hv-5vwg46    gun HTTP/2 PUSH_PROMISE authority not validated against connection origin allows cross-origin cookie injection47    https://osv.dev/vulnerability/EEF-CVE-2026-439724849    EEF-CVE-2026-43973 (HIGH)50    aka: CVE-2026-43973, GHSA-r53j-fjj5-mv7751    gun HTTP/1.1 response buffer has no size limit allowing server-controlled memory exhaustion52    https://osv.dev/vulnerability/EEF-CVE-2026-439735354    GHSA-w4f7-4cxr-rv3c (MEDIUM)55    aka: CVE-2026-43966, EEF-CVE-2026-4396656    cowboy and gun affected by an HTTP Request/Response Splitting vulnerability57    https://osv.dev/vulnerability/GHSA-w4f7-4cxr-rv3c5859    EEF-CVE-2026-43974 (HIGH)60    aka: CVE-2026-43974, GHSA-2j82-37xg-f9wp61    gun HTTP/1.1 client accepts unsolicited 101 Switching Protocols response allowing server-driven protocol hijack and OOM62    https://osv.dev/vulnerability/EEF-CVE-2026-4397463  homex 0.1.264  interactive_cmd 0.1.465  jason 1.4.566  nerves 1.15.067  nerves_discovery 0.1.568  nerves_logging 0.2.469  nerves_runtime 0.13.1370  nerves_system_bbb 2.30.271  nerves_system_br 1.34.472  nerves_system_mangopi_mq_pro 0.17.273  nerves_system_qemu_aarch64 0.4.274  nerves_system_rpi 2.1.275  nerves_system_rpi0 2.1.276  nerves_system_rpi0_2 2.1.277  nerves_system_rpi2 2.1.278  nerves_system_rpi3 2.1.279  nerves_system_rpi4 2.1.280  nerves_system_rpi5 2.1.281  nerves_system_x86_64 1.34.282  nerves_toolchain_aarch64_nerves_linux_gnu 15.3.183  nerves_toolchain_armv6_nerves_linux_gnueabihf 15.3.184  nerves_toolchain_armv7_nerves_linux_gnueabihf 15.3.185  nerves_toolchain_riscv64_nerves_linux_gnu 15.3.186  nerves_toolchain_x86_64_nerves_linux_musl 15.3.187  nerves_uevent 0.1.788  nimble_options 1.1.189  property_table 0.3.490  quicer 0.2.1591  ring_logger 0.11.792  shoehorn 0.9.393  snabbkaffe 1.0.1094  tablet 0.3.395  toolshed 0.5.096  uboot_env 1.0.297* Getting homex (Hex package)98* Getting nerves (Hex package)99* Getting shoehorn (Hex package)100* Getting ring_logger (Hex package)101* Getting toolshed (Hex package)102* Getting nerves_runtime (Hex package)103* Getting nerves_system_bbb (Hex package)104* Getting nerves_system_mangopi_mq_pro (Hex package)105* Getting nerves_system_qemu_aarch64 (Hex package)106* Getting nerves_system_rpi (Hex package)107* Getting nerves_system_rpi0 (Hex package)108* Getting nerves_system_rpi0_2 (Hex package)109* Getting nerves_system_rpi2 (Hex package)110* Getting nerves_system_rpi3 (Hex package)111* Getting nerves_system_rpi4 (Hex package)112* Getting nerves_system_rpi5 (Hex package)113* Getting nerves_system_x86_64 (Hex package)114* Getting nerves_system_br (Hex package)115* Getting nerves_toolchain_x86_64_nerves_linux_musl (Hex package)116* Getting nerves_toolchain_aarch64_nerves_linux_gnu (Hex package)117* Getting nerves_toolchain_armv7_nerves_linux_gnueabihf (Hex package)118* Getting nerves_toolchain_armv6_nerves_linux_gnueabihf (Hex package)119* Getting nerves_toolchain_riscv64_nerves_linux_gnu (Hex package)120* Getting nerves_logging (Hex package)121* Getting nerves_uevent (Hex package)122* Getting uboot_env (Hex package)123* Getting elixir_make (Hex package)124* Getting property_table (Hex package)125* Getting circular_buffer (Hex package)126* Getting interactive_cmd (Hex package)127* Getting jason (Hex package)128* Getting nerves_discovery (Hex package)129* Getting tablet (Hex package)130* Getting emqtt (Hex package)131* Getting nimble_options (Hex package)132* Getting cowlib (Hex package)133* Getting getopt (Hex package)134* Getting gun (Hex package)135* Getting quicer (Hex package)136* Getting snabbkaffe (Hex package)137Found packages with security advisories, see above for details138You have added/upgraded packages you could sponsor, run `mix hex.sponsor` to learn more139==> jason140Compiling 10 files (.ex)141Generated jason app142==> tablet143Compiling 2 files (.ex)144Generated tablet app145==> elixir_make146Compiling 8 files (.ex)147Generated elixir_make app148==> nerves_discovery149Compiling 5 files (.ex)150Generated nerves_discovery app151==> interactive_cmd152Compiling 1 file (.ex)153Generated interactive_cmd app154==> nerves155HOST_CC port.o156HOST_LD port157Compiling 55 files (.ex)158Generated nerves app159==> nerves_compatibility_test160161Nerves environment162  MIX_TARGET:   x86_64163  MIX_ENV:      prod164165Checking for prebuilt Nerves artifacts...166  Found nerves_system_x86_64 in cache167    /home/nerves/.nerves/artifacts/nerves_system_x86_64-portable-1.34.2168  Found nerves_toolchain_x86_64_nerves_linux_musl in cache169    /home/nerves/.nerves/artifacts/nerves_toolchain_x86_64_nerves_linux_musl-linux_x86_64-15.3.1170==> nerves171==> nerves_compatibility_test172173Nerves environment174  MIX_TARGET:   x86_64175  MIX_ENV:      prod176177===> Analyzing applications...178===> Compiling snabbkaffe179./build.sh 'v2.3.8'180Cloning into 'msquic'...181Note: switching to 'e453ade8d9b35f53290fdbd111738f86150253a1'.182183You are in 'detached HEAD' state. You can look around, make experimental184changes and commit them, and you can discard any commits you make in this185state without impacting any branches by switching back to a branch.186187If you want to create a new branch to retain commits you create, you may188do so (now or later) by using -c with the switch command. Example:189190  git switch -c <new-branch-name>191192Or undo this operation with:193194  git switch -195196Turn off this advice by setting config variable advice.detachedHead to false197198Submodule 'submodules/clog' (https://github.com/microsoft/CLOG.git) registered for path 'submodules/clog'199Submodule 'submodules/googletest' (https://github.com/google/googletest) registered for path 'submodules/googletest'200Submodule 'submodules/openssl' (https://github.com/quictls/openssl.git) registered for path 'submodules/openssl'201Submodule 'submodules/openssl3' (https://github.com/quictls/openssl.git) registered for path 'submodules/openssl3'202Submodule 'submodules/xdp-for-windows' (https://github.com/microsoft/xdp-for-windows.git) registered for path 'submodules/xdp-for-windows'203Cloning into '/work/proj/deps_x86_64/quicer/msquic/submodules/clog'...204Cloning into '/work/proj/deps_x86_64/quicer/msquic/submodules/googletest'...205Cloning into '/work/proj/deps_x86_64/quicer/msquic/submodules/openssl'...206Cloning into '/work/proj/deps_x86_64/quicer/msquic/submodules/openssl3'...207Cloning into '/work/proj/deps_x86_64/quicer/msquic/submodules/xdp-for-windows'...208From https://github.com/microsoft/CLOG209 * branch            ca6e640fbf7f53ec9de915f1f4d852c10d874d13 -> FETCH_HEAD210Submodule path 'submodules/clog': checked out 'ca6e640fbf7f53ec9de915f1f4d852c10d874d13'211From https://github.com/google/googletest212 * branch            563ebf1769af08d448765c31064260e1a16fcced -> FETCH_HEAD213Submodule path 'submodules/googletest': checked out '563ebf1769af08d448765c31064260e1a16fcced'214From https://github.com/quictls/openssl215 * branch              612d8e44d687e4b71c4724319d7aa27a733bcbca -> FETCH_HEAD216Submodule path 'submodules/openssl': checked out '612d8e44d687e4b71c4724319d7aa27a733bcbca'217Submodule 'boringssl' (https://boringssl.googlesource.com/boringssl) registered for path 'submodules/openssl/boringssl'218Submodule 'krb5' (https://github.com/krb5/krb5) registered for path 'submodules/openssl/krb5'219Submodule 'pyca.cryptography' (https://github.com/pyca/cryptography.git) registered for path 'submodules/openssl/pyca-cryptography'220Submodule 'wycheproof' (https://github.com/google/wycheproof) registered for path 'submodules/openssl/wycheproof'221Cloning into '/work/proj/deps_x86_64/quicer/msquic/submodules/openssl/boringssl'...222Cloning into '/work/proj/deps_x86_64/quicer/msquic/submodules/openssl/krb5'...223Cloning into '/work/proj/deps_x86_64/quicer/msquic/submodules/openssl/pyca-cryptography'...224Cloning into '/work/proj/deps_x86_64/quicer/msquic/submodules/openssl/wycheproof'...225From https://boringssl.googlesource.com/boringssl226 * branch            2070f8ad9151dc8f3a73bffaa146b5e6937a583f -> FETCH_HEAD227Submodule path 'submodules/openssl/boringssl': checked out '2070f8ad9151dc8f3a73bffaa146b5e6937a583f'228From https://github.com/krb5/krb5229 * branch            890ca2f401924cdcb88f493950b04700bbe52db3 -> FETCH_HEAD230Submodule path 'submodules/openssl/krb5': checked out '890ca2f401924cdcb88f493950b04700bbe52db3'231From https://github.com/pyca/cryptography232 * branch            fa84d185c0fefa7d612759e02a26def2f948fe34 -> FETCH_HEAD233Submodule path 'submodules/openssl/pyca-cryptography': checked out 'fa84d185c0fefa7d612759e02a26def2f948fe34'234From https://github.com/google/wycheproof235 * branch            2196000605e45d91097147c9c71f26b72af58003 -> FETCH_HEAD236Submodule path 'submodules/openssl/wycheproof': checked out '2196000605e45d91097147c9c71f26b72af58003'237From https://github.com/quictls/openssl238 * branch              330feef3dcb69d95cd752d54cb9254b366bdc7cf -> FETCH_HEAD239Submodule path 'submodules/openssl3': checked out '330feef3dcb69d95cd752d54cb9254b366bdc7cf'240Submodule 'gost-engine' (https://github.com/gost-engine/engine) registered for path 'submodules/openssl3/gost-engine'241Submodule 'krb5' (https://github.com/krb5/krb5) registered for path 'submodules/openssl3/krb5'242Submodule 'oqs-provider' (https://github.com/open-quantum-safe/oqs-provider.git) registered for path 'submodules/openssl3/oqs-provider'243Submodule 'pyca.cryptography' (https://github.com/pyca/cryptography.git) registered for path 'submodules/openssl3/pyca-cryptography'244Submodule 'python-ecdsa' (https://github.com/tlsfuzzer/python-ecdsa) registered for path 'submodules/openssl3/python-ecdsa'245Submodule 'tlsfuzzer' (https://github.com/tlsfuzzer/tlsfuzzer) registered for path 'submodules/openssl3/tlsfuzzer'246Submodule 'tlslite-ng' (https://github.com/tlsfuzzer/tlslite-ng) registered for path 'submodules/openssl3/tlslite-ng'247Submodule 'wycheproof' (https://github.com/google/wycheproof) registered for path 'submodules/openssl3/wycheproof'248Cloning into '/work/proj/deps_x86_64/quicer/msquic/submodules/openssl3/gost-engine'...249Cloning into '/work/proj/deps_x86_64/quicer/msquic/submodules/openssl3/krb5'...250Cloning into '/work/proj/deps_x86_64/quicer/msquic/submodules/openssl3/oqs-provider'...251Cloning into '/work/proj/deps_x86_64/quicer/msquic/submodules/openssl3/pyca-cryptography'...252Cloning into '/work/proj/deps_x86_64/quicer/msquic/submodules/openssl3/python-ecdsa'...253Cloning into '/work/proj/deps_x86_64/quicer/msquic/submodules/openssl3/tlsfuzzer'...254Cloning into '/work/proj/deps_x86_64/quicer/msquic/submodules/openssl3/tlslite-ng'...255Cloning into '/work/proj/deps_x86_64/quicer/msquic/submodules/openssl3/wycheproof'...256From https://github.com/gost-engine/engine257 * branch            2a8a5e0ecaa3e3d6f4ec722a49aa72476755c2b7 -> FETCH_HEAD258Submodule path 'submodules/openssl3/gost-engine': checked out '2a8a5e0ecaa3e3d6f4ec722a49aa72476755c2b7'259Submodule 'libprov' (https://github.com/provider-corner/libprov.git) registered for path 'submodules/openssl3/gost-engine/libprov'260Cloning into '/work/proj/deps_x86_64/quicer/msquic/submodules/openssl3/gost-engine/libprov'...261From https://github.com/provider-corner/libprov262 * branch            8a126e09547630ef900177625626b6156052f0ee -> FETCH_HEAD263Submodule path 'submodules/openssl3/gost-engine/libprov': checked out '8a126e09547630ef900177625626b6156052f0ee'264From https://github.com/krb5/krb5265 * branch            aa9b4a2a64046afd2fab7cb49c346295874a5fb6 -> FETCH_HEAD266Submodule path 'submodules/openssl3/krb5': checked out 'aa9b4a2a64046afd2fab7cb49c346295874a5fb6'267From https://github.com/open-quantum-safe/oqs-provider268 * branch            3f3d8a8cf331c73a26fe93a598273997cb54eb4f -> FETCH_HEAD269Submodule path 'submodules/openssl3/oqs-provider': checked out '3f3d8a8cf331c73a26fe93a598273997cb54eb4f'270From https://github.com/pyca/cryptography271 * branch            c18d0567386414efa3caef7ed586c4ca75bf3a8b -> FETCH_HEAD272Submodule path 'submodules/openssl3/pyca-cryptography': checked out 'c18d0567386414efa3caef7ed586c4ca75bf3a8b'273From https://github.com/tlsfuzzer/python-ecdsa274 * branch            4de8d5bf89089d1140eb99aa5d7eb2dc8e6337b6 -> FETCH_HEAD275Submodule path 'submodules/openssl3/python-ecdsa': checked out '4de8d5bf89089d1140eb99aa5d7eb2dc8e6337b6'276From https://github.com/tlsfuzzer/tlsfuzzer277 * branch            dbd56c149072e656ca8d6a43a59588f3e7513da2 -> FETCH_HEAD278Submodule path 'submodules/openssl3/tlsfuzzer': checked out 'dbd56c149072e656ca8d6a43a59588f3e7513da2'279From https://github.com/tlsfuzzer/tlslite-ng280 * branch            771e9f59d639dbb0e2fa8e646c8e588405d3903e -> FETCH_HEAD281Submodule path 'submodules/openssl3/tlslite-ng': checked out '771e9f59d639dbb0e2fa8e646c8e588405d3903e'282From https://github.com/google/wycheproof283 * branch            2196000605e45d91097147c9c71f26b72af58003 -> FETCH_HEAD284Submodule path 'submodules/openssl3/wycheproof': checked out '2196000605e45d91097147c9c71f26b72af58003'285From https://github.com/microsoft/xdp-for-windows286 * branch            51bba848b1a7c571c7eb7226977a6f24c0abffd3 -> FETCH_HEAD287Submodule path 'submodules/xdp-for-windows': checked out '51bba848b1a7c571c7eb7226977a6f24c0abffd3'288Submodule 'submodules/ndis-driver-library' (https://github.com/microsoft/ndis-driver-library) registered for path 'submodules/xdp-for-windows/submodules/ndis-driver-library'289Submodule 'submodules/net-offloads' (https://github.com/microsoft/net-offloads.git) registered for path 'submodules/xdp-for-windows/submodules/net-offloads'290Submodule 'submodules/wil' (https://github.com/microsoft/wil) registered for path 'submodules/xdp-for-windows/submodules/wil'291Cloning into '/work/proj/deps_x86_64/quicer/msquic/submodules/xdp-for-windows/submodules/ndis-driver-library'...292Cloning into '/work/proj/deps_x86_64/quicer/msquic/submodules/xdp-for-windows/submodules/net-offloads'...293Cloning into '/work/proj/deps_x86_64/quicer/msquic/submodules/xdp-for-windows/submodules/wil'...294From https://github.com/microsoft/ndis-driver-library295 * branch            6bf878da1a54bf471d4d934cef6e26355860d386 -> FETCH_HEAD296Submodule path 'submodules/xdp-for-windows/submodules/ndis-driver-library': checked out '6bf878da1a54bf471d4d934cef6e26355860d386'297From https://github.com/microsoft/net-offloads298 * branch            02dbf4e58e3b7f752ba3d97d17c36d4cd5fdc490 -> FETCH_HEAD299Submodule path 'submodules/xdp-for-windows/submodules/net-offloads': checked out '02dbf4e58e3b7f752ba3d97d17c36d4cd5fdc490'300From https://github.com/microsoft/wil301 * branch            ae986e12b2fa722ba70e9761ae6897565293cbea -> FETCH_HEAD302Submodule path 'submodules/xdp-for-windows/submodules/wil': checked out 'ae986e12b2fa722ba70e9761ae6897565293cbea'303Patching Msquic 2.3.8304Patch patches/12edf3725475d4a99e5598df3289bace47b8f56e.patch already exists, skipping download305patching file src/inc/msquic_posix.h306Patch patches/e0201eb4e007e7524aef007be67f2281f949f102.patch already exists, skipping download307patching file src/core/binding.c308Patch patches/b16a14a72e8c74407ee4a079a1f57efe0246f739.patch already exists, skipping download309patching file src/generated/stdout/quic_trace.c310Patch patches/9261dacc1dd9a67f6fa8d5fbe663082508b4c605.patch already exists, skipping download311patching file src/platform/datapath_epoll.c312-- The C compiler identification is GNU 15.3.0313-- The CXX compiler identification is GNU 15.3.0314-- Detecting C compiler ABI info315-- Detecting C compiler ABI info - done316-- Check for working C compiler: /home/nerves/.nerves/artifacts/nerves_toolchain_x86_64_nerves_linux_musl-linux_x86_64-15.3.1/bin/x86_64-nerves-linux-musl-gcc - skipped317-- Detecting C compile features318-- Detecting C compile features - done319-- Detecting CXX compiler ABI info320-- Detecting CXX compiler ABI info - done321-- Check for working CXX compiler: /home/nerves/.nerves/artifacts/nerves_toolchain_x86_64_nerves_linux_musl-linux_x86_64-15.3.1/bin/x86_64-nerves-linux-musl-g++ - skipped322-- Detecting CXX compile features323-- Detecting CXX compile features - done324-- CMAKE Version: 3.28.3325-- Source Dir: /work/proj/deps_x86_64/quicer/msquic326-- Host System name: Linux327-- Setting policy 0091328-- System name: Linux329-- System version: 330-- Platform version: 331-- Build type: RelWithDebInfo332-- QUIC Platform: linux333-- Version Build ID: 0334-- Version Suffix: -private335-- Looking for _SC_PHYS_PAGES336-- Looking for _SC_PHYS_PAGES - found337-- Looking for sysconf338-- Looking for sysconf - found339-- Looking for UDP_SEGMENT340-- Looking for UDP_SEGMENT - found341-- Looking for SO_ATTACH_REUSEPORT_CBPF342-- Looking for SO_ATTACH_REUSEPORT_CBPF - found343-- Looking for sendmmsg344-- Looking for sendmmsg - found345-- Enabling OpenSsl configuration tests346-- Enabling CA file tests347-- QUIC_ENABLE_LOGGING is false. Disabling logging348-- Found libatomic: /home/nerves/.nerves/artifacts/nerves_system_x86_64-portable-1.34.2/staging/lib/libatomic.so349-- libnuma not found. If build fails, install libnuma350-- Enabling shared ephemeral port work around351-- Configuring for OpenSSL 1.1352-- Setting openssldir to /usr/lib/ssl353-- Configuring OpenSSL: /work/proj/deps_x86_64/quicer/msquic/submodules/openssl/config;CC=/home/nerves/.nerves/artifacts/nerves_toolchain_x86_64_nerves_linux_musl-linux_x86_64-15.3.1/bin/x86_64-nerves-linux-musl-gcc;CXX=/home/nerves/.nerves/artifacts/nerves_toolchain_x86_64_nerves_linux_musl-linux_x86_64-15.3.1/bin/x86_64-nerves-linux-musl-g++ enable-tls1_3;no-makedepend;no-dgram;no-ssl3;no-psk;no-srp;no-zlib;no-egd;no-idea;no-rc5;no-rc4;no-afalgeng;no-comp;no-cms;no-ct;no-srp;no-srtp;no-ts;no-gost;no-dso;no-ec2m;no-tls1;no-tls1_1;no-tls1_2;no-dtls;no-dtls1;no-dtls1_2;no-ssl;no-ssl3-method;no-tls1-method;no-tls1_1-method;no-tls1_2-method;no-dtls1-method;no-dtls1_2-method;no-siphash;no-whirlpool;no-aria;no-bf;no-blake2;no-sm2;no-sm3;no-sm4;no-camellia;no-cast;no-md4;no-mdc2;no-ocb;no-rc2;no-rmd160;no-scrypt;no-seed;no-weak-ssl-ciphers;no-shared;no-tests;--openssldir="/usr/lib/ssl";--prefix=/work/proj/deps_x86_64/quicer/c_build/_deps/opensslquic-build/openssl354-- Performing Test CMAKE_HAVE_LIBC_PTHREAD355-- Performing Test CMAKE_HAVE_LIBC_PTHREAD - Success356-- Found Threads: TRUE  357-- Configuring for OpenSSL358-- Configuring done (13.5s)359-- Generating done (0.9s)360-- Build files have been written to: /work/proj/deps_x86_64/quicer/c_build361make[1]: warning: -j6 forced in submake: resetting jobserver mode.362make[1]: Entering directory '/work/proj/deps_x86_64/quicer/c_build'363make[2]: Entering directory '/work/proj/deps_x86_64/quicer/c_build'364make[3]: Entering directory '/work/proj/deps_x86_64/quicer/c_build'365make[3]: Entering directory '/work/proj/deps_x86_64/quicer/c_build'366make[3]: Leaving directory '/work/proj/deps_x86_64/quicer/c_build'367make[3]: Entering directory '/work/proj/deps_x86_64/quicer/c_build'368make[3]: Leaving directory '/work/proj/deps_x86_64/quicer/c_build'369make[3]: Entering directory '/work/proj/deps_x86_64/quicer/c_build'370[  1%] Building C object msquic/src/core/CMakeFiles/core.dir/ack_tracker.c.o371[  2%] Building C object msquic/src/core/CMakeFiles/core.dir/configuration.c.o372[  3%] OpenSSL configure373[  5%] Building C object msquic/src/core/CMakeFiles/core.dir/api.c.o374[  4%] Building C object msquic/src/core/CMakeFiles/core.dir/congestion_control.c.o375[  6%] Building C object msquic/src/core/CMakeFiles/core.dir/binding.c.o376[  7%] Building C object msquic/src/core/CMakeFiles/core.dir/connection.c.o377[  8%] Building C object msquic/src/core/CMakeFiles/core.dir/crypto.c.o378[ 10%] Building C object msquic/src/core/CMakeFiles/core.dir/crypto_tls.c.o379[ 11%] Building C object msquic/src/core/CMakeFiles/core.dir/cubic.c.o380[ 12%] Building C object msquic/src/core/CMakeFiles/core.dir/bbr.c.o381[ 13%] Building C object msquic/src/core/CMakeFiles/core.dir/datagram.c.o382Operating system: x86_64-whatever-linux2383[ 14%] Building C object msquic/src/core/CMakeFiles/core.dir/frame.c.o384[ 15%] Building C object msquic/src/core/CMakeFiles/core.dir/library.c.o385[ 16%] Building C object msquic/src/core/CMakeFiles/core.dir/listener.c.o386[ 17%] Building C object msquic/src/core/CMakeFiles/core.dir/lookup.c.o387Configuring OpenSSL version 1.1.1w+quic (0x1010117fL) for linux-x86_64388Using os-specific seed configuration389[ 19%] Building C object msquic/src/core/CMakeFiles/core.dir/loss_detection.c.o390[ 20%] Building C object msquic/src/core/CMakeFiles/core.dir/mtu_discovery.c.o391[ 21%] Building C object msquic/src/core/CMakeFiles/core.dir/operation.c.o392[ 22%] Building C object msquic/src/core/CMakeFiles/core.dir/packet.c.o393[ 23%] Building C object msquic/src/core/CMakeFiles/core.dir/packet_builder.c.o394[ 24%] Building C object msquic/src/core/CMakeFiles/core.dir/packet_space.c.o395[ 25%] Building C object msquic/src/core/CMakeFiles/core.dir/path.c.o396[ 26%] Building C object msquic/src/core/CMakeFiles/core.dir/range.c.o397[ 28%] Building C object msquic/src/core/CMakeFiles/core.dir/recv_buffer.c.o398[ 29%] Building C object msquic/src/core/CMakeFiles/core.dir/send.c.o399[ 30%] Building C object msquic/src/core/CMakeFiles/core.dir/registration.c.o400[ 31%] Building C object msquic/src/core/CMakeFiles/core.dir/send_buffer.c.o401[ 32%] Building C object msquic/src/core/CMakeFiles/core.dir/sent_packet_metadata.c.o402[ 33%] Building C object msquic/src/core/CMakeFiles/core.dir/stream.c.o403[ 34%] Building C object msquic/src/core/CMakeFiles/core.dir/settings.c.o404[ 35%] Building C object msquic/src/core/CMakeFiles/core.dir/stream_recv.c.o405[ 37%] Building C object msquic/src/core/CMakeFiles/core.dir/stream_send.c.o406[ 38%] Building C object msquic/src/core/CMakeFiles/core.dir/stream_set.c.o407[ 39%] Building C object msquic/src/core/CMakeFiles/core.dir/timer_wheel.c.o408[ 40%] Building C object msquic/src/core/CMakeFiles/core.dir/worker.c.o409[ 41%] Building C object msquic/src/core/CMakeFiles/core.dir/version_neg.c.o410[ 42%] Building C object msquic/src/core/CMakeFiles/core.dir/sliding_window_extremum.c.o411[ 43%] Building C object msquic/src/core/CMakeFiles/core.dir/inline.c.o412Creating configdata.pm413Creating Makefile414415**********************************************************************416***                                                                ***417***   OpenSSL has been successfully configured                     ***418***                                                                ***419***   If you encounter a problem while building, please open an    ***420***   issue on GitHub <https://github.com/openssl/openssl/issues>  ***421***   and include the output from the following command:           ***422***                                                                ***423***       perl configdata.pm --dump                                ***424***                                                                ***425***   (If you are new to OpenSSL, you might want to consult the    ***426***   'Troubleshooting' section in the INSTALL file first)         ***427***                                                                ***428**********************************************************************429[ 44%] OpenSSL build430make[4]: Entering directory '/work/proj/deps_x86_64/quicer/c_build/_deps/opensslquic-build/submodules/openssl'431make[4]: warning: -j6 forced in submake: resetting jobserver mode.432make[5]: Entering directory '/work/proj/deps_x86_64/quicer/c_build/_deps/opensslquic-build/submodules/openssl'433make[5]: Leaving directory '/work/proj/deps_x86_64/quicer/c_build/_deps/opensslquic-build/submodules/openssl'434[ 46%] Linking C static library ../../obj/Release/libcore.a435make[5]: Entering directory '/work/proj/deps_x86_64/quicer/c_build/_deps/opensslquic-build/submodules/openssl'436make[3]: Leaving directory '/work/proj/deps_x86_64/quicer/c_build'437[ 46%] Built target core438/home/nerves/.nerves/artifacts/nerves_toolchain_x86_64_nerves_linux_musl-linux_x86_64-15.3.1/bin/x86_64-nerves-linux-musl-ar: creating apps/libapps.a439/home/nerves/.nerves/artifacts/nerves_toolchain_x86_64_nerves_linux_musl-linux_x86_64-15.3.1/bin/x86_64-nerves-linux-musl-ar: creating libcrypto.a440/home/nerves/.nerves/artifacts/nerves_toolchain_x86_64_nerves_linux_musl-linux_x86_64-15.3.1/bin/x86_64-nerves-linux-musl-ar: creating libssl.a441make[5]: Leaving directory '/work/proj/deps_x86_64/quicer/c_build/_deps/opensslquic-build/submodules/openssl'442created directory `/work/proj/deps_x86_64/quicer/c_build/_deps/opensslquic-build/openssl/lib'443*** Installing runtime libraries444*** Installing development files445created directory `/work/proj/deps_x86_64/quicer/c_build/_deps/opensslquic-build/openssl/include/openssl'446install ../../../../../msquic/submodules/openssl/include/openssl/aes.h -> /work/proj/deps_x86_64/quicer/c_build/_deps/opensslquic-build/openssl/include/openssl/aes.h447install ../../../../../msquic/submodules/openssl/include/openssl/asn1.h -> /work/proj/deps_x86_64/quicer/c_build/_deps/opensslquic-build/openssl/include/openssl/asn1.h448install ../../../../../msquic/submodules/openssl/include/openssl/asn1_mac.h -> /work/proj/deps_x86_64/quicer/c_build/_deps/opensslquic-build/openssl/include/openssl/asn1_mac.h449install ../../../../../msquic/submodules/openssl/include/openssl/asn1err.h -> /work/proj/deps_x86_64/quicer/c_build/_deps/opensslquic-build/openssl/include/openssl/asn1err.h450install ../../../../../msquic/submodules/openssl/include/openssl/asn1t.h -> /work/proj/deps_x86_64/quicer/c_build/_deps/opensslquic-build/openssl/include/openssl/asn1t.h451install ../../../../../msquic/submodules/openssl/include/openssl/async.h -> /work/proj/deps_x86_64/quicer/c_build/_deps/opensslquic-build/openssl/include/openssl/async.h452install ../../../../../msquic/submodules/openssl/include/openssl/asyncerr.h -> /work/proj/deps_x86_64/quicer/c_build/_deps/opensslquic-build/openssl/include/openssl/asyncerr.h453install ../../../../../msquic/submodules/openssl/include/openssl/bio.h -> /work/proj/deps_x86_64/quicer/c_build/_deps/opensslquic-build/openssl/include/openssl/bio.h454install ../../../../../msquic/submodules/openssl/include/openssl/bioerr.h -> /work/proj/deps_x86_64/quicer/c_build/_deps/opensslquic-build/openssl/include/openssl/bioerr.h455install ../../../../../msquic/submodules/openssl/include/openssl/blowfish.h -> /work/proj/deps_x86_64/quicer/c_build/_deps/opensslquic-build/openssl/include/openssl/blowfish.h456install ../../../../../msquic/submodules/openssl/include/openssl/bn.h -> /work/proj/deps_x86_64/quicer/c_build/_deps/opensslquic-build/openssl/include/openssl/bn.h457install ../../../../../msquic/submodules/openssl/include/openssl/bnerr.h -> /work/proj/deps_x86_64/quicer/c_build/_deps/opensslquic-build/openssl/include/openssl/bnerr.h458install ../../../../../msquic/submodules/openssl/include/openssl/buffer.h -> /work/proj/deps_x86_64/quicer/c_build/_deps/opensslquic-build/openssl/include/openssl/buffer.h459install ../../../../../msquic/submodules/openssl/include/openssl/buffererr.h -> /work/proj/deps_x86_64/quicer/c_build/_deps/opensslquic-build/openssl/include/openssl/buffererr.h460install ../../../../../msquic/submodules/openssl/include/openssl/camellia.h -> /work/proj/deps_x86_64/quicer/c_build/_deps/opensslquic-build/openssl/include/openssl/camellia.h461install ../../../../../msquic/submodules/openssl/include/openssl/cast.h -> /work/proj/deps_x86_64/quicer/c_build/_deps/opensslquic-build/openssl/include/openssl/cast.h462install ../../../../../msquic/submodules/openssl/include/openssl/cmac.h -> /work/proj/deps_x86_64/quicer/c_build/_deps/opensslquic-build/openssl/include/openssl/cmac.h463install ../../../../../msquic/submodules/openssl/include/openssl/cms.h -> /work/proj/deps_x86_64/quicer/c_build/_deps/opensslquic-build/openssl/include/openssl/cms.h464install ../../../../../msquic/submodules/openssl/include/openssl/cmserr.h -> /work/proj/deps_x86_64/quicer/c_build/_deps/opensslquic-build/openssl/include/openssl/cmserr.h465install ../../../../../msquic/submodules/openssl/include/openssl/comp.h -> /work/proj/deps_x86_64/quicer/c_build/_deps/opensslquic-build/openssl/include/openssl/comp.h466install ../../../../../msquic/submodules/openssl/include/openssl/comperr.h -> /work/proj/deps_x86_64/quicer/c_build/_deps/opensslquic-build/openssl/include/openssl/comperr.h467install ../../../../../msquic/submodules/openssl/include/openssl/conf.h -> /work/proj/deps_x86_64/quicer/c_build/_deps/opensslquic-build/openssl/include/openssl/conf.h468install ../../../../../msquic/submodules/openssl/include/openssl/conf_api.h -> /work/proj/deps_x86_64/quicer/c_build/_deps/opensslquic-build/openssl/include/openssl/conf_api.h469install ../../../../../msquic/submodules/openssl/include/openssl/conferr.h -> /work/proj/deps_x86_64/quicer/c_build/_deps/opensslquic-build/openssl/include/openssl/conferr.h470install ../../../../../msquic/submodules/openssl/include/openssl/crypto.h -> /work/proj/deps_x86_64/quicer/c_build/_deps/opensslquic-build/openssl/include/openssl/crypto.h471install ../../../../../msquic/submodules/openssl/include/openssl/cryptoerr.h -> /work/proj/deps_x86_64/quicer/c_build/_deps/opensslquic-build/openssl/include/openssl/cryptoerr.h472install ../../../../../msquic/submodules/openssl/include/openssl/ct.h -> /work/proj/deps_x86_64/quicer/c_build/_deps/opensslquic-build/openssl/include/openssl/ct.h473install ../../../../../msquic/submodules/openssl/include/openssl/cterr.h -> /work/proj/deps_x86_64/quicer/c_build/_deps/opensslquic-build/openssl/include/openssl/cterr.h474install ../../../../../msquic/submodules/openssl/include/openssl/des.h -> /work/proj/deps_x86_64/quicer/c_build/_deps/opensslquic-build/openssl/include/openssl/des.h475install ../../../../../msquic/submodules/openssl/include/openssl/dh.h -> /work/proj/deps_x86_64/quicer/c_build/_deps/opensslquic-build/openssl/include/openssl/dh.h476install ../../../../../msquic/submodules/openssl/include/openssl/dherr.h -> /work/proj/deps_x86_64/quicer/c_build/_deps/opensslquic-build/openssl/include/openssl/dherr.h477install ../../../../../msquic/submodules/openssl/include/openssl/dsa.h -> /work/proj/deps_x86_64/quicer/c_build/_deps/opensslquic-build/openssl/include/openssl/dsa.h478install ../../../../../msquic/submodules/openssl/include/openssl/dsaerr.h -> /work/proj/deps_x86_64/quicer/c_build/_deps/opensslquic-build/openssl/include/openssl/dsaerr.h479install ../../../../../msquic/submodules/openssl/include/openssl/dtls1.h -> /work/proj/deps_x86_64/quicer/c_build/_deps/opensslquic-build/openssl/include/openssl/dtls1.h480install ../../../../../msquic/submodules/openssl/include/openssl/e_os2.h -> /work/proj/deps_x86_64/quicer/c_build/_deps/opensslquic-build/openssl/include/openssl/e_os2.h481install ../../../../../msquic/submodules/openssl/include/openssl/ebcdic.h -> /work/proj/deps_x86_64/quicer/c_build/_deps/opensslquic-build/openssl/include/openssl/ebcdic.h482install ../../../../../msquic/submodules/openssl/include/openssl/ec.h -> /work/proj/deps_x86_64/quicer/c_build/_deps/opensslquic-build/openssl/include/openssl/ec.h483install ../../../../../msquic/submodules/openssl/include/openssl/ecdh.h -> /work/proj/deps_x86_64/quicer/c_build/_deps/opensslquic-build/openssl/include/openssl/ecdh.h484install ../../../../../msquic/submodules/openssl/include/openssl/ecdsa.h -> /work/proj/deps_x86_64/quicer/c_build/_deps/opensslquic-build/openssl/include/openssl/ecdsa.h485install ../../../../../msquic/submodules/openssl/include/openssl/ecerr.h -> /work/proj/deps_x86_64/quicer/c_build/_deps/opensslquic-build/openssl/include/openssl/ecerr.h486install ../../../../../msquic/submodules/openssl/include/openssl/engine.h -> /work/proj/deps_x86_64/quicer/c_build/_deps/opensslquic-build/openssl/include/openssl/engine.h487install ../../../../../msquic/submodules/openssl/include/openssl/engineerr.h -> /work/proj/deps_x86_64/quicer/c_build/_deps/opensslquic-build/openssl/include/openssl/engineerr.h488install ../../../../../msquic/submodules/openssl/include/openssl/err.h -> /work/proj/deps_x86_64/quicer/c_build/_deps/opensslquic-build/openssl/include/openssl/err.h489install ../../../../../msquic/submodules/openssl/include/openssl/evp.h -> /work/proj/deps_x86_64/quicer/c_build/_deps/opensslquic-build/openssl/include/openssl/evp.h490install ../../../../../msquic/submodules/openssl/include/openssl/evperr.h -> /work/proj/deps_x86_64/quicer/c_build/_deps/opensslquic-build/openssl/include/openssl/evperr.h491install ../../../../../msquic/submodules/openssl/include/openssl/hmac.h -> /work/proj/deps_x86_64/quicer/c_build/_deps/opensslquic-build/openssl/include/openssl/hmac.h492install ../../../../../msquic/submodules/openssl/include/openssl/idea.h -> /work/proj/deps_x86_64/quicer/c_build/_deps/opensslquic-build/openssl/include/openssl/idea.h493install ../../../../../msquic/submodules/openssl/include/openssl/kdf.h -> /work/proj/deps_x86_64/quicer/c_build/_deps/opensslquic-build/openssl/include/openssl/kdf.h494install ../../../../../msquic/submodules/openssl/include/openssl/kdferr.h -> /work/proj/deps_x86_64/quicer/c_build/_deps/opensslquic-build/openssl/include/openssl/kdferr.h495install ../../../../../msquic/submodules/openssl/include/openssl/lhash.h -> /work/proj/deps_x86_64/quicer/c_build/_deps/opensslquic-build/openssl/include/openssl/lhash.h496install ../../../../../msquic/submodules/openssl/include/openssl/md2.h -> /work/proj/deps_x86_64/quicer/c_build/_deps/opensslquic-build/openssl/include/openssl/md2.h497install ../../../../../msquic/submodules/openssl/include/openssl/md4.h -> /work/proj/deps_x86_64/quicer/c_build/_deps/opensslquic-build/openssl/include/openssl/md4.h498install ../../../../../msquic/submodules/openssl/include/openssl/md5.h -> /work/proj/deps_x86_64/quicer/c_build/_deps/opensslquic-build/openssl/include/openssl/md5.h499install ../../../../../msquic/submodules/openssl/include/openssl/mdc2.h -> /work/proj/deps_x86_64/quicer/c_build/_deps/opensslquic-build/openssl/include/openssl/mdc2.h500install ../../../../../msquic/submodules/openssl/include/openssl/modes.h -> /work/proj/deps_x86_64/quicer/c_build/_deps/opensslquic-build/openssl/include/openssl/modes.h501install ../../../../../msquic/submodules/openssl/include/openssl/obj_mac.h -> /work/proj/deps_x86_64/quicer/c_build/_deps/opensslquic-build/openssl/include/openssl/obj_mac.h502install ../../../../../msquic/submodules/openssl/include/openssl/objects.h -> /work/proj/deps_x86_64/quicer/c_build/_deps/opensslquic-build/openssl/include/openssl/objects.h503install ../../../../../msquic/submodules/openssl/include/openssl/objectserr.h -> /work/proj/deps_x86_64/quicer/c_build/_deps/opensslquic-build/openssl/include/openssl/objectserr.h504install ../../../../../msquic/submodules/openssl/include/openssl/ocsp.h -> /work/proj/deps_x86_64/quicer/c_build/_deps/opensslquic-build/openssl/include/openssl/ocsp.h505install ../../../../../msquic/submodules/openssl/include/openssl/ocsperr.h -> /work/proj/deps_x86_64/quicer/c_build/_deps/opensslquic-build/openssl/include/openssl/ocsperr.h506install ../../../../../msquic/submodules/openssl/include/openssl/opensslv.h -> /work/proj/deps_x86_64/quicer/c_build/_deps/opensslquic-build/openssl/include/openssl/opensslv.h507install ../../../../../msquic/submodules/openssl/include/openssl/ossl_typ.h -> /work/proj/deps_x86_64/quicer/c_build/_deps/opensslquic-build/openssl/include/openssl/ossl_typ.h508install ../../../../../msquic/submodules/openssl/include/openssl/pem.h -> /work/proj/deps_x86_64/quicer/c_build/_deps/opensslquic-build/openssl/include/openssl/pem.h509install ../../../../../msquic/submodules/openssl/include/openssl/pem2.h -> /work/proj/deps_x86_64/quicer/c_build/_deps/opensslquic-build/openssl/include/openssl/pem2.h510install ../../../../../msquic/submodules/openssl/include/openssl/pemerr.h -> /work/proj/deps_x86_64/quicer/c_build/_deps/opensslquic-build/openssl/include/openssl/pemerr.h511install ../../../../../msquic/submodules/openssl/include/openssl/pkcs12.h -> /work/proj/deps_x86_64/quicer/c_build/_deps/opensslquic-build/openssl/include/openssl/pkcs12.h512install ../../../../../msquic/submodules/openssl/include/openssl/pkcs12err.h -> /work/proj/deps_x86_64/quicer/c_build/_deps/opensslquic-build/openssl/include/openssl/pkcs12err.h513install ../../../../../msquic/submodules/openssl/include/openssl/pkcs7.h -> /work/proj/deps_x86_64/quicer/c_build/_deps/opensslquic-build/openssl/include/openssl/pkcs7.h514install ../../../../../msquic/submodules/openssl/include/openssl/pkcs7err.h -> /work/proj/deps_x86_64/quicer/c_build/_deps/opensslquic-build/openssl/include/openssl/pkcs7err.h515install ../../../../../msquic/submodules/openssl/include/openssl/rand.h -> /work/proj/deps_x86_64/quicer/c_build/_deps/opensslquic-build/openssl/include/openssl/rand.h516install ../../../../../msquic/submodules/openssl/include/openssl/rand_drbg.h -> /work/proj/deps_x86_64/quicer/c_build/_deps/opensslquic-build/openssl/include/openssl/rand_drbg.h517install ../../../../../msquic/submodules/openssl/include/openssl/randerr.h -> /work/proj/deps_x86_64/quicer/c_build/_deps/opensslquic-build/openssl/include/openssl/randerr.h518install ../../../../../msquic/submodules/openssl/include/openssl/rc2.h -> /work/proj/deps_x86_64/quicer/c_build/_deps/opensslquic-build/openssl/include/openssl/rc2.h519install ../../../../../msquic/submodules/openssl/include/openssl/rc4.h -> /work/proj/deps_x86_64/quicer/c_build/_deps/opensslquic-build/openssl/include/openssl/rc4.h520install ../../../../../msquic/submodules/openssl/include/openssl/rc5.h -> /work/proj/deps_x86_64/quicer/c_build/_deps/opensslquic-build/openssl/include/openssl/rc5.h521install ../../../../../msquic/submodules/openssl/include/openssl/ripemd.h -> /work/proj/deps_x86_64/quicer/c_build/_deps/opensslquic-build/openssl/include/openssl/ripemd.h522install ../../../../../msquic/submodules/openssl/include/openssl/rsa.h -> /work/proj/deps_x86_64/quicer/c_build/_deps/opensslquic-build/openssl/include/openssl/rsa.h523install ../../../../../msquic/submodules/openssl/include/openssl/rsaerr.h -> /work/proj/deps_x86_64/quicer/c_build/_deps/opensslquic-build/openssl/include/openssl/rsaerr.h524install ../../../../../msquic/submodules/openssl/include/openssl/safestack.h -> /work/proj/deps_x86_64/quicer/c_build/_deps/opensslquic-build/openssl/include/openssl/safestack.h525install ../../../../../msquic/submodules/openssl/include/openssl/seed.h -> /work/proj/deps_x86_64/quicer/c_build/_deps/opensslquic-build/openssl/include/openssl/seed.h526install ../../../../../msquic/submodules/openssl/include/openssl/sha.h -> /work/proj/deps_x86_64/quicer/c_build/_deps/opensslquic-build/openssl/include/openssl/sha.h527install ../../../../../msquic/submodules/openssl/include/openssl/srp.h -> /work/proj/deps_x86_64/quicer/c_build/_deps/opensslquic-build/openssl/include/openssl/srp.h528install ../../../../../msquic/submodules/openssl/include/openssl/srtp.h -> /work/proj/deps_x86_64/quicer/c_build/_deps/opensslquic-build/openssl/include/openssl/srtp.h529install ../../../../../msquic/submodules/openssl/include/openssl/ssl.h -> /work/proj/deps_x86_64/quicer/c_build/_deps/opensslquic-build/openssl/include/openssl/ssl.h530install ../../../../../msquic/submodules/openssl/include/openssl/ssl2.h -> /work/proj/deps_x86_64/quicer/c_build/_deps/opensslquic-build/openssl/include/openssl/ssl2.h531install ../../../../../msquic/submodules/openssl/include/openssl/ssl3.h -> /work/proj/deps_x86_64/quicer/c_build/_deps/opensslquic-build/openssl/include/openssl/ssl3.h532install ../../../../../msquic/submodules/openssl/include/openssl/sslerr.h -> /work/proj/deps_x86_64/quicer/c_build/_deps/opensslquic-build/openssl/include/openssl/sslerr.h533install ../../../../../msquic/submodules/openssl/include/openssl/stack.h -> /work/proj/deps_x86_64/quicer/c_build/_deps/opensslquic-build/openssl/include/openssl/stack.h534install ../../../../../msquic/submodules/openssl/include/openssl/store.h -> /work/proj/deps_x86_64/quicer/c_build/_deps/opensslquic-build/openssl/include/openssl/store.h535install ../../../../../msquic/submodules/openssl/include/openssl/storeerr.h -> /work/proj/deps_x86_64/quicer/c_build/_deps/opensslquic-build/openssl/include/openssl/storeerr.h536install ../../../../../msquic/submodules/openssl/include/openssl/symhacks.h -> /work/proj/deps_x86_64/quicer/c_build/_deps/opensslquic-build/openssl/include/openssl/symhacks.h537install ../../../../../msquic/submodules/openssl/include/openssl/tls1.h -> /work/proj/deps_x86_64/quicer/c_build/_deps/opensslquic-build/openssl/include/openssl/tls1.h538install ../../../../../msquic/submodules/openssl/include/openssl/ts.h -> /work/proj/deps_x86_64/quicer/c_build/_deps/opensslquic-build/openssl/include/openssl/ts.h539install ../../../../../msquic/submodules/openssl/include/openssl/tserr.h -> /work/proj/deps_x86_64/quicer/c_build/_deps/opensslquic-build/openssl/include/openssl/tserr.h540install ../../../../../msquic/submodules/openssl/include/openssl/txt_db.h -> /work/proj/deps_x86_64/quicer/c_build/_deps/opensslquic-build/openssl/include/openssl/txt_db.h541install ../../../../../msquic/submodules/openssl/include/openssl/ui.h -> /work/proj/deps_x86_64/quicer/c_build/_deps/opensslquic-build/openssl/include/openssl/ui.h542install ../../../../../msquic/submodules/openssl/include/openssl/uierr.h -> /work/proj/deps_x86_64/quicer/c_build/_deps/opensslquic-build/openssl/include/openssl/uierr.h543install ../../../../../msquic/submodules/openssl/include/openssl/whrlpool.h -> /work/proj/deps_x86_64/quicer/c_build/_deps/opensslquic-build/openssl/include/openssl/whrlpool.h544install ../../../../../msquic/submodules/openssl/include/openssl/x509.h -> /work/proj/deps_x86_64/quicer/c_build/_deps/opensslquic-build/openssl/include/openssl/x509.h545install ../../../../../msquic/submodules/openssl/include/openssl/x509_vfy.h -> /work/proj/deps_x86_64/quicer/c_build/_deps/opensslquic-build/openssl/include/openssl/x509_vfy.h546install ../../../../../msquic/submodules/openssl/include/openssl/x509err.h -> /work/proj/deps_x86_64/quicer/c_build/_deps/opensslquic-build/openssl/include/openssl/x509err.h547install ../../../../../msquic/submodules/openssl/include/openssl/x509v3.h -> /work/proj/deps_x86_64/quicer/c_build/_deps/opensslquic-build/openssl/include/openssl/x509v3.h548install ../../../../../msquic/submodules/openssl/include/openssl/x509v3err.h -> /work/proj/deps_x86_64/quicer/c_build/_deps/opensslquic-build/openssl/include/openssl/x509v3err.h549install ./include/openssl/opensslconf.h -> /work/proj/deps_x86_64/quicer/c_build/_deps/opensslquic-build/openssl/include/openssl/opensslconf.h550install libcrypto.a -> /work/proj/deps_x86_64/quicer/c_build/_deps/opensslquic-build/openssl/lib/libcrypto.a551install libssl.a -> /work/proj/deps_x86_64/quicer/c_build/_deps/opensslquic-build/openssl/lib/libssl.a552created directory `/work/proj/deps_x86_64/quicer/c_build/_deps/opensslquic-build/openssl/lib/pkgconfig'553install libcrypto.pc -> /work/proj/deps_x86_64/quicer/c_build/_deps/opensslquic-build/openssl/lib/pkgconfig/libcrypto.pc554install libssl.pc -> /work/proj/deps_x86_64/quicer/c_build/_deps/opensslquic-build/openssl/lib/pkgconfig/libssl.pc555install openssl.pc -> /work/proj/deps_x86_64/quicer/c_build/_deps/opensslquic-build/openssl/lib/pkgconfig/openssl.pc556make[4]: Leaving directory '/work/proj/deps_x86_64/quicer/c_build/_deps/opensslquic-build/submodules/openssl'557make[3]: Leaving directory '/work/proj/deps_x86_64/quicer/c_build'558[ 46%] Built target OpenSSL_Target559make[3]: Entering directory '/work/proj/deps_x86_64/quicer/c_build'560make[3]: Leaving directory '/work/proj/deps_x86_64/quicer/c_build'561make[3]: Entering directory '/work/proj/deps_x86_64/quicer/c_build'562[ 47%] Building C object msquic/src/platform/CMakeFiles/platform.dir/hashtable.c.o563[ 48%] Building C object msquic/src/platform/CMakeFiles/platform.dir/crypt.c.o564[ 49%] Building C object msquic/src/platform/CMakeFiles/platform.dir/pcp.c.o565[ 50%] Building C object msquic/src/platform/CMakeFiles/platform.dir/toeplitz.c.o566[ 51%] Building C object msquic/src/platform/CMakeFiles/platform.dir/inline.c.o567[ 52%] Building C object msquic/src/platform/CMakeFiles/platform.dir/platform_worker.c.o568[ 53%] Building C object msquic/src/platform/CMakeFiles/platform.dir/platform_posix.c.o569[ 55%] Building C object msquic/src/platform/CMakeFiles/platform.dir/storage_posix.c.o570[ 56%] Building C object msquic/src/platform/CMakeFiles/platform.dir/cgroup.c.o571[ 57%] Building C object msquic/src/platform/CMakeFiles/platform.dir/datapath_raw_linux.c.o572[ 58%] Building C object msquic/src/platform/CMakeFiles/platform.dir/datapath_raw_socket.c.o573[ 59%] Building C object msquic/src/platform/CMakeFiles/platform.dir/datapath_raw_xdp_linux.c.o574[ 60%] Building C object msquic/src/platform/CMakeFiles/platform.dir/datapath_raw_socket_linux.c.o575[ 61%] Building C object msquic/src/platform/CMakeFiles/platform.dir/datapath_epoll.c.o576[ 62%] Building C object msquic/src/platform/CMakeFiles/platform.dir/datapath_linux.c.o577[ 64%] Building C object msquic/src/platform/CMakeFiles/platform.dir/tls_openssl.c.o578[ 65%] Building C object msquic/src/platform/CMakeFiles/platform.dir/crypt_openssl.c.o579[ 66%] Building C object msquic/src/platform/CMakeFiles/platform.dir/certificates_posix.c.o580[ 67%] Building C object msquic/src/platform/CMakeFiles/platform.dir/selfsign_openssl.c.o581[ 68%] Linking C static library ../../obj/Release/libplatform.a582make[3]: Leaving directory '/work/proj/deps_x86_64/quicer/c_build'583[ 68%] Built target platform584make[3]: Entering directory '/work/proj/deps_x86_64/quicer/c_build'585make[3]: Leaving directory '/work/proj/deps_x86_64/quicer/c_build'586make[3]: Entering directory '/work/proj/deps_x86_64/quicer/c_build'587[ 69%] Building C object msquic/src/bin/CMakeFiles/msquic.dir/linux/init.c.o588[ 70%] Linking C shared library ../../bin/Release/libmsquic.so589/home/nerves/.nerves/artifacts/nerves_toolchain_x86_64_nerves_linux_musl-linux_x86_64-15.3.1/x86_64-nerves-linux-musl/bin/ld: ../../../_deps/opensslquic-build/openssl/lib/libcrypto.a(ui_openssl.o): warning: relocation against `stderr' in read-only section `.text'590/home/nerves/.nerves/artifacts/nerves_toolchain_x86_64_nerves_linux_musl-linux_x86_64-15.3.1/x86_64-nerves-linux-musl/bin/ld: ../../../_deps/opensslquic-build/openssl/lib/libcrypto.a(cryptlib.o): relocation R_X86_64_PC32 against symbol `stderr' can not be used when making a shared object; recompile with -fPIC591/home/nerves/.nerves/artifacts/nerves_toolchain_x86_64_nerves_linux_musl-linux_x86_64-15.3.1/x86_64-nerves-linux-musl/bin/ld: final link failed: bad value592collect2: error: ld returned 1 exit status593make[3]: *** [msquic/src/bin/CMakeFiles/msquic.dir/build.make:102: msquic/bin/Release/libmsquic.so.2.3.8] Error 1594make[3]: Leaving directory '/work/proj/deps_x86_64/quicer/c_build'595make[2]: *** [CMakeFiles/Makefile2:345: msquic/src/bin/CMakeFiles/msquic.dir/all] Error 2596make[2]: Leaving directory '/work/proj/deps_x86_64/quicer/c_build'597make[1]: *** [Makefile:136: all] Error 2598make[1]: Leaving directory '/work/proj/deps_x86_64/quicer/c_build'599make: *** [Makefile:15: build-nif] Error 2600===> Hook for compile failed!601602** (Mix) Could not compile dependency :quicer, "/home/nerves/.mix/elixir/1-20-otp-29/rebar3 bare compile --paths /work/proj/_build/x86_64/lib/*/ebin" command failed. Errors may have been logged above. You can recompile this dependency with "mix deps.compile quicer --force", update it with "mix deps.update quicer" or clean it with "mix deps.clean quicer"