Build log
nerves_system_mangopi_mq_pro
kino_phonograph 0.9.0 · fail · run kino_phonograph-0.9.0-1790967471194
580 of 580 lines
1Resolving Hex dependencies...2Resolution completed in 0.244s3Unchanged:4 cc_precompiler 0.1.115 circular_buffer 1.1.06 complex 0.7.07 elixir_make 0.10.08 image 0.62.19 interactive_cmd 0.1.410 kino 0.19.111 kino_phonograph 0.9.012 kino_zoetrope 0.25.013 nerves 2.0.0-pre.214 nerves_discovery 0.1.515 nerves_logging 0.2.416 nerves_runtime 0.13.1317 nerves_system_bbb 2.30.218 nerves_system_br 1.34.419 nerves_system_mangopi_mq_pro 0.17.220 nerves_system_qemu_aarch64 0.4.221 nerves_system_rpi0 2.1.222 nerves_system_rpi4 2.1.223 nerves_system_rpi5 2.1.224 nerves_system_trellis 0.5.025 nerves_system_x86_64 1.34.226 nerves_toolchain_aarch64_nerves_linux_gnu 15.3.127 nerves_toolchain_armv6_nerves_linux_gnueabihf 15.3.128 nerves_toolchain_armv7_nerves_linux_gnueabihf 15.3.129 nerves_toolchain_riscv64_nerves_linux_gnu 15.3.130 nerves_toolchain_x86_64_nerves_linux_musl 15.3.131 nerves_uevent 0.1.732 nx 0.12.133 phoenix_html 4.3.034 property_table 0.3.435 ring_logger 0.11.736 sweet_xml 0.7.537 table 0.1.238 tablet 0.3.339 telemetry 1.4.240 toolshed 0.5.041 uboot_env 1.0.242 vix 0.42.043* Getting kino_phonograph (Hex package)44* Getting nerves (Hex package)45* Getting ring_logger (Hex package)46* Getting toolshed (Hex package)47* Getting nerves_runtime (Hex package)48* Getting nerves_system_bbb (Hex package)49* Getting nerves_system_mangopi_mq_pro (Hex package)50* Getting nerves_system_qemu_aarch64 (Hex package)51* Getting nerves_system_rpi0 (Hex package)52* Getting nerves_system_rpi4 (Hex package)53* Getting nerves_system_rpi5 (Hex package)54* Getting nerves_system_trellis (Hex package)55* Getting nerves_system_x86_64 (Hex package)56* Getting nerves_system_br (Hex package)57* Getting nerves_toolchain_x86_64_nerves_linux_musl (Hex package)58* Getting nerves_toolchain_armv7_nerves_linux_gnueabihf (Hex package)59* Getting nerves_toolchain_aarch64_nerves_linux_gnu (Hex package)60* Getting nerves_toolchain_armv6_nerves_linux_gnueabihf (Hex package)61* Getting nerves_toolchain_riscv64_nerves_linux_gnu (Hex package)62* Getting nerves_logging (Hex package)63* Getting nerves_uevent (Hex package)64* Getting uboot_env (Hex package)65* Getting elixir_make (Hex package)66* Getting property_table (Hex package)67* Getting circular_buffer (Hex package)68* Getting interactive_cmd (Hex package)69* Getting nerves_discovery (Hex package)70* Getting tablet (Hex package)71* Getting image (Hex package)72* Getting kino (Hex package)73* Getting kino_zoetrope (Hex package)74* Getting nx (Hex package)75* Getting complex (Hex package)76* Getting telemetry (Hex package)77* Getting table (Hex package)78* Getting phoenix_html (Hex package)79* Getting sweet_xml (Hex package)80* Getting vix (Hex package)81* Getting cc_precompiler (Hex package)82==> nerves_system_br83Generated nerves_system_br app84==> circular_buffer85Compiling 1 file (.ex)86Generated circular_buffer app87==> complex88Compiling 2 files (.ex)89 warning: the following clause is redundant:9091 def divide(n, b) when is_number(n) and (b === :infinity or b === :neg_infinity)9293 it has type:9495 dynamic(float() or integer()), dynamic(:infinity or :neg_infinity)9697 previous clauses have already matched on the following types:9899 :infinity or :nan or :neg_infinity, :infinity or :nan or :neg_infinity100 :nan, float() or integer()101 float() or integer(), :nan102 float() or integer(), :infinity103 float() or integer(), :neg_infinity104 float() or integer(), float() or integer()105106 │107 590 │ def divide(n, b) when is_number(n) and b in [:infinity, :neg_infinity] do108 │ ~109 │110 └─ lib/complex.ex:590:7: Complex.divide/2111112 warning: the following clause is redundant:113114 def pow(%Complex{re: re, im: im}, :neg_infinity) when re == 0 and im == 0115116 it has type:117118 dynamic(%Complex{re: float() or integer(), im: float() or integer()}), :neg_infinity119120 previous clauses have already matched on the following types:121122 :infinity or :nan or :neg_infinity, %Complex{}123 %Complex{}, :infinity or :nan or :neg_infinity124 %Complex{re: :infinity or :nan or :neg_infinity}, term()125 %Complex{im: :infinity or :nan or :neg_infinity}, term()126 term(), %Complex{re: :infinity or :nan or :neg_infinity}127 term(), %Complex{im: :infinity or :nan or :neg_infinity}128 :nan, term()129 term(), :nan130131 │132 1143 │ def pow(%Complex{re: re, im: im}, :neg_infinity) when re == 0 and im == 0, do: new(:infinity, 0)133 │ ~134 │135 └─ lib/complex.ex:1143:7: Complex.pow/2136137 warning: the following clause is redundant:138139 def atan2(:nan, :nan)140141 it has type:142143 :nan, :nan144145 previous clauses have already matched on the following types:146147 float() or integer(), float() or integer()148 :infinity, :infinity149 :infinity, :neg_infinity150 :infinity, :nan151 :infinity, float() or integer()152 :neg_infinity, :infinity153 :neg_infinity, :neg_infinity154 :neg_infinity, :nan155 :neg_infinity, float() or integer()156 :nan, :infinity or :nan or :neg_infinity or float() or integer()157 :infinity or :nan or :neg_infinity or float() or integer(), :nan158159 │160 1458 │ def atan2(:nan, :nan), do: :nan161 │ ~162 │163 └─ lib/complex.ex:1458:7: Complex.atan2/2164165Generated complex app166==> tablet167Compiling 2 files (.ex)168Generated tablet app169==> elixir_make170Compiling 8 files (.ex)171Generated elixir_make app172==> nerves_logging173 CC kmsg_tailer.o174 LD kmsg_tailer175Compiling 5 files (.ex)176Generated nerves_logging app177==> nerves_discovery178Compiling 5 files (.ex)179Generated nerves_discovery app180==> ring_logger181Compiling 7 files (.ex)182Generated ring_logger app183==> table184Compiling 5 files (.ex)185Generated table app186==> interactive_cmd187Compiling 1 file (.ex)188Generated interactive_cmd app189==> nerves190Compiling 65 files (.ex)191 warning: redefining module Mix.Tasks.Nerves.Init (current version loaded from /work/proj/_build/mangopi_mq_pro/lib/nerves/ebin/Elixir.Mix.Tasks.Nerves.Init.beam)192 │193 6 │ defmodule Mix.Tasks.Nerves.Init do194 │ ~~~~~~~~~~~~~~~~~~~~~~~~~~~~~~~~~~195 │196 └─ lib/mix/tasks/nerves.init.ex:6: Mix.Tasks.Nerves.Init (module)197198 warning: redefining module Nerves (current version loaded from /work/proj/_build/mangopi_mq_pro/lib/nerves/ebin/Elixir.Nerves.beam)199 │200 6 │ defmodule Nerves do201 │ ~~~~~~~~~~~~~~~~~~~202 │203 └─ lib/nerves.ex:6: Nerves (module)204205 warning: redefining module Nerves.ArtifactResolver (current version loaded from /work/proj/_build/mangopi_mq_pro/lib/nerves/ebin/Elixir.Nerves.ArtifactResolver.beam)206 │207 5 │ defmodule Nerves.ArtifactResolver do208 │ ~~~~~~~~~~~~~~~~~~~~~~~~~~~~~~~~~~~~209 │210 └─ lib/nerves/artifact_resolver.ex:5: Nerves.ArtifactResolver (module)211212 warning: redefining module Nerves.BuildAction.AppModes (current version loaded from /work/proj/_build/mangopi_mq_pro/lib/nerves/ebin/Elixir.Nerves.BuildAction.AppModes.beam)213 │214 6 │ defmodule Nerves.BuildAction.AppModes do215 │ ~~~~~~~~~~~~~~~~~~~~~~~~~~~~~~~~~~~~~~~~216 │217 └─ lib/nerves/build_action/app_modes.ex:6: Nerves.BuildAction.AppModes (module)218219 warning: redefining module Nerves.BuildAction.CheckExecutables (current version loaded from /work/proj/_build/mangopi_mq_pro/lib/nerves/ebin/Elixir.Nerves.BuildAction.CheckExecutables.beam)220 │221 5 │ defmodule Nerves.BuildAction.CheckExecutables do222 │ ~~~~~~~~~~~~~~~~~~~~~~~~~~~~~~~~~~~~~~~~~~~~~~~~223 │224 └─ lib/nerves/build_action/check_executables.ex:5: Nerves.BuildAction.CheckExecutables (module)225226 warning: redefining module Nerves.BuildAction.Erlinit (current version loaded from /work/proj/_build/mangopi_mq_pro/lib/nerves/ebin/Elixir.Nerves.BuildAction.Erlinit.beam)227 │228 8 │ defmodule Nerves.BuildAction.Erlinit do229 │ ~~~~~~~~~~~~~~~~~~~~~~~~~~~~~~~~~~~~~~~230 │231 └─ lib/nerves/build_action/erlinit.ex:8: Nerves.BuildAction.Erlinit (module)232233 warning: redefining module Nerves.BuildAction.Firmware (current version loaded from /work/proj/_build/mangopi_mq_pro/lib/nerves/ebin/Elixir.Nerves.BuildAction.Firmware.beam)234 │235 5 │ defmodule Nerves.BuildAction.Firmware do236 │ ~~~~~~~~~~~~~~~~~~~~~~~~~~~~~~~~~~~~~~~~237 │238 └─ lib/nerves/build_action/firmware.ex:5: Nerves.BuildAction.Firmware (module)239240 warning: redefining module Nerves.BuildAction.IExStartupCheck (current version loaded from /work/proj/_build/mangopi_mq_pro/lib/nerves/ebin/Elixir.Nerves.BuildAction.IExStartupCheck.beam)241 │242 7 │ defmodule Nerves.BuildAction.IExStartupCheck do243 │ ~~~~~~~~~~~~~~~~~~~~~~~~~~~~~~~~~~~~~~~~~~~~~~~244 │245 └─ lib/nerves/build_action/iex_startup_check.ex:7: Nerves.BuildAction.IExStartupCheck (module)246247 warning: redefining module Nerves.BuildAction.NervesV1System (current version loaded from /work/proj/_build/mangopi_mq_pro/lib/nerves/ebin/Elixir.Nerves.BuildAction.NervesV1System.beam)248 │249 5 │ defmodule Nerves.BuildAction.NervesV1System do250 │ ~~~~~~~~~~~~~~~~~~~~~~~~~~~~~~~~~~~~~~~~~~~~~~251 │252 └─ lib/nerves/build_action/nerves_v1_system.ex:5: Nerves.BuildAction.NervesV1System (module)253254 warning: redefining module Nerves.BuildAction.NervesV1Toolchain (current version loaded from /work/proj/_build/mangopi_mq_pro/lib/nerves/ebin/Elixir.Nerves.BuildAction.NervesV1Toolchain.beam)255 │256 5 │ defmodule Nerves.BuildAction.NervesV1Toolchain do257 │ ~~~~~~~~~~~~~~~~~~~~~~~~~~~~~~~~~~~~~~~~~~~~~~~~~258 │259 └─ lib/nerves/build_action/nerves_v1_toolchain.ex:5: Nerves.BuildAction.NervesV1Toolchain (module)260261 warning: redefining module Nerves.BuildAction.Rootfs (current version loaded from /work/proj/_build/mangopi_mq_pro/lib/nerves/ebin/Elixir.Nerves.BuildAction.Rootfs.beam)262 │263 5 │ defmodule Nerves.BuildAction.Rootfs do264 │ ~~~~~~~~~~~~~~~~~~~~~~~~~~~~~~~~~~~~~~265 │266 └─ lib/nerves/build_action/rootfs.ex:5: Nerves.BuildAction.Rootfs (module)267268 warning: redefining module Nerves.BuildAction.SortApps (current version loaded from /work/proj/_build/mangopi_mq_pro/lib/nerves/ebin/Elixir.Nerves.BuildAction.SortApps.beam)269 │270 6 │ defmodule Nerves.BuildAction.SortApps do271 │ ~~~~~~~~~~~~~~~~~~~~~~~~~~~~~~~~~~~~~~~~272 │273 └─ lib/nerves/build_action/sort_apps.ex:6: Nerves.BuildAction.SortApps (module)274275 warning: redefining module Nerves.BuildAction.StripAll (current version loaded from /work/proj/_build/mangopi_mq_pro/lib/nerves/ebin/Elixir.Nerves.BuildAction.StripAll.beam)276 │277 5 │ defmodule Nerves.BuildAction.StripAll do278 │ ~~~~~~~~~~~~~~~~~~~~~~~~~~~~~~~~~~~~~~~~279 │280 └─ lib/nerves/build_action/strip_all.ex:5: Nerves.BuildAction.StripAll (module)281282 warning: redefining module Nerves.BuildAction.Trimmer (current version loaded from /work/proj/_build/mangopi_mq_pro/lib/nerves/ebin/Elixir.Nerves.BuildAction.Trimmer.beam)283 │284 5 │ defmodule Nerves.BuildAction.Trimmer do285 │ ~~~~~~~~~~~~~~~~~~~~~~~~~~~~~~~~~~~~~~~286 │287 └─ lib/nerves/build_action/trimmer.ex:5: Nerves.BuildAction.Trimmer (module)288289 warning: redefining module Nerves.BuildPlan (current version loaded from /work/proj/_build/mangopi_mq_pro/lib/nerves/ebin/Elixir.Nerves.BuildPlan.beam)290 │291 5 │ defmodule Nerves.BuildPlan do292 │ ~~~~~~~~~~~~~~~~~~~~~~~~~~~~~293 │294 └─ lib/nerves/build_plan.ex:5: Nerves.BuildPlan (module)295296 warning: redefining module Nerves.BuildPlan.Checks (current version loaded from /work/proj/_build/mangopi_mq_pro/lib/nerves/ebin/Elixir.Nerves.BuildPlan.Checks.beam)297 │298 5 │ defmodule Nerves.BuildPlan.Checks do299 │ ~~~~~~~~~~~~~~~~~~~~~~~~~~~~~~~~~~~~300 │301 └─ lib/nerves/build_plan/checks.ex:5: Nerves.BuildPlan.Checks (module)302303 warning: redefining module Nerves.Container (current version loaded from /work/proj/_build/mangopi_mq_pro/lib/nerves/ebin/Elixir.Nerves.Container.beam)304 │305 6 │ defmodule Nerves.Container do306 │ ~~~~~~~~~~~~~~~~~~~~~~~~~~~~~307 │308 └─ lib/nerves/container.ex:6: Nerves.Container (module)309310 warning: redefining module Nerves.Fingerprint (current version loaded from /work/proj/_build/mangopi_mq_pro/lib/nerves/ebin/Elixir.Nerves.Fingerprint.beam)311 │312 5 │ defmodule Nerves.Fingerprint do313 │ ~~~~~~~~~~~~~~~~~~~~~~~~~~~~~~~314 │315 └─ lib/nerves/fingerprint.ex:5: Nerves.Fingerprint (module)316317 warning: redefining module Nerves.MixPackage (current version loaded from /work/proj/_build/mangopi_mq_pro/lib/nerves/ebin/Elixir.Nerves.MixPackage.beam)318 │319 5 │ defmodule Nerves.MixPackage do320 │ ~~~~~~~~~~~~~~~~~~~~~~~~~~~~~~321 │322 └─ lib/nerves/mix_package.ex:5: Nerves.MixPackage (module)323324 warning: redefining module Nerves.Paths (current version loaded from /work/proj/_build/mangopi_mq_pro/lib/nerves/ebin/Elixir.Nerves.Paths.beam)325 │326 5 │ defmodule Nerves.Paths do327 │ ~~~~~~~~~~~~~~~~~~~~~~~~~328 │329 └─ lib/nerves/paths.ex:5: Nerves.Paths (module)330331 warning: redefining module Nerves.TargetTuple (current version loaded from /work/proj/_build/mangopi_mq_pro/lib/nerves/ebin/Elixir.Nerves.TargetTuple.beam)332 │333 5 │ defmodule Nerves.TargetTuple do334 │ ~~~~~~~~~~~~~~~~~~~~~~~~~~~~~~~335 │336 └─ lib/nerves/target_tuple.ex:5: Nerves.TargetTuple (module)337338Generated nerves app339==> nerves_toolchain_riscv64_nerves_linux_gnu340Compiling 1 file (.ex)341Generated nerves_toolchain_riscv64_nerves_linux_gnu app342==> nerves_system_mangopi_mq_pro343Generated nerves_system_mangopi_mq_pro app344==> nerves_compatibility_test345===> Analyzing applications...346===> Compiling telemetry347==> nx348Compiling 42 files (.ex)349Compiling lib/nx/binary_backend.ex (it's taking more than 10s)350 warning: the following conditional expression will always succeed:351352 is_float(split)353354 because it evaluates to:355356 dynamic(true)357358 where "split" was given the types:359360 # type: dynamic(float() or integer())361 # from: lib/nx.ex:3608:43362 split * axis_size363364 # type: float()365 # from: lib/nx.ex:3618:9366 is_integer(split)367368 type warning found at:369 │370 3622 │ is_float(split) and float_split_index > 0 and float_split_index < axis_size ->371 │ ~~~~~~~~~~~~~~~~~~~~~~~~~~~~~~~~~~~~~~~~~~~~~~~~~~~~~~~~~~~~~~~~~~~~~~~~~~~~~~372 │373 └─ lib/nx.ex:3622: Nx.split/3374375 warning: this clause in cond will always match:376377 is_float(split)378379 since it has type:380381 dynamic(true)382383 where "split" was given the types:384385 # type: dynamic(float() or integer())386 # from: lib/nx.ex:3608:43387 split * axis_size388389 # type: float()390 # from: lib/nx.ex:3618:9391 is_integer(split)392393 type warning found at:394 │395 3625 │ is_float(split) ->396 │ ~397 │398 └─ lib/nx.ex:3625:25: Nx.split/3399400 warning: incompatible types given to Kernel.trunc/1:401402 trunc(x)403404 given types:405406 -dynamic(%Complex{407 re: :infinity or :nan or :neg_infinity or float(),408 im: :infinity or :nan or :neg_infinity or float()409 })-410411 but expected one of:412413 float() or integer()414415 where "x" was given the type:416417 # type: dynamic(%Complex{418 re: :infinity or :nan or :neg_infinity or float(),419 im: :infinity or :nan or :neg_infinity or float()420 })421 # from: lib/nx/binary_backend.ex:2080:17422 x =423 Nx.Shared.read_complex(424 x,425 arg1426 )427428 type warning found at:429 │430 2093 │ number_to_binary(trunc(x), output_type)431 │ ~432 │433 └─ lib/nx/binary_backend.ex:2093:36: Nx.BinaryBackend.as_type/2434435 warning: comparison with structs found:436437 a >= b438439 given types:440441 dynamic(442 %Complex{443 re: :infinity or :nan or :neg_infinity or float(),444 im: :infinity or :nan or :neg_infinity or float()445 } or float() or integer()446 ) >=447 dynamic(448 %Complex{449 re: :infinity or :nan or :neg_infinity or float(),450 im: :infinity or :nan or :neg_infinity or float()451 } or float() or integer()452 )453454 where "a" was given the type:455456 # type: dynamic(457 %Complex{458 re: :infinity or :nan or :neg_infinity or float(),459 im: :infinity or :nan or :neg_infinity or float()460 } or float() or integer()461 )462 # from: lib/nx/binary_backend.ex463 {a, b}464465 where "b" was given the type:466467 # type: dynamic(468 %Complex{469 re: :infinity or :nan or :neg_infinity or float(),470 im: :infinity or :nan or :neg_infinity or float()471 } or float() or integer()472 )473 # from: lib/nx/binary_backend.ex474 {a, b}475476 Comparison operators (>, <, >=, <=, min, and max) perform structural and not semantic comparison. Comparing with a struct won't give meaningful results. Structs that can be compared typically define a compare/2 function within their modules that can be used for semantic comparison.477478 type warning found at:479 │480 2138 │ {a, b} -> a >= b481 │ ~482 │483 └─ lib/nx/binary_backend.ex:2138:27: Nx.BinaryBackend.do_sort/4484485 warning: comparison with structs found:486487 a <= b488489 given types:490491 dynamic(492 %Complex{493 re: :infinity or :nan or :neg_infinity or float(),494 im: :infinity or :nan or :neg_infinity or float()495 } or float() or integer()496 ) <=497 dynamic(498 %Complex{499 re: :infinity or :nan or :neg_infinity or float(),500 im: :infinity or :nan or :neg_infinity or float()501 } or float() or integer()502 )503504 where "a" was given the type:505506 # type: dynamic(507 %Complex{508 re: :infinity or :nan or :neg_infinity or float(),509 im: :infinity or :nan or :neg_infinity or float()510 } or float() or integer()511 )512 # from: lib/nx/binary_backend.ex513 {a, b}514515 where "b" was given the type:516517 # type: dynamic(518 %Complex{519 re: :infinity or :nan or :neg_infinity or float(),520 im: :infinity or :nan or :neg_infinity or float()521 } or float() or integer()522 )523 # from: lib/nx/binary_backend.ex524 {a, b}525526 Comparison operators (>, <, >=, <=, min, and max) perform structural and not semantic comparison. Comparing with a struct won't give meaningful results. Structs that can be compared typically define a compare/2 function within their modules that can be used for semantic comparison.527528 type warning found at:529 │530 2152 │ {a, b} -> a <= b531 │ ~532 │533 └─ lib/nx/binary_backend.ex:2152:27: Nx.BinaryBackend.do_sort/4534535Generated nx app536==> kino537Compiling 50 files (.ex)538Generated kino app539==> phoenix_html540Compiling 6 files (.ex)541Generated phoenix_html app542==> uboot_env543Compiling 5 files (.ex)544Generated uboot_env app545==> cc_precompiler546Compiling 3 files (.ex)547Generated cc_precompiler app548==> vix549Setting up precompiled libvips...55055119:01:51.887 [debug] Fetching https://github.com/akash-akya/sharp-libvips/releases/download/v8.18.7-rc1/sharp-libvips-linux-x64.tar.gz55255319:01:54.072 [debug] Extracting to /work/proj/_build/mangopi_mq_pro/lib/vix/priv/sharp-libvips-linux-x64.tar.gz554 CC pipe.c555 CC utils.c556 CC vips_boxed.c557 CC vips_foreign.c558 CC vips_image.c559 CC vips_interpolate.c560 CC vips_operation.c561 CC vix.c562 CC g_boxed.c563 CC g_object.c564 CC g_param_spec.c565 CC g_type.c566 CC g_value.c567 LD vix.so568/home/nerves/.nerves/artifacts/nerves_toolchain_riscv64_nerves_linux_gnu-15.3.1/riscv64-nerves-linux-gnu/bin/ld: /work/proj/_build/mangopi_mq_pro/lib/vix/priv/precompiled_libvips/lib/libvips-cpp.so.8.18.7: error adding symbols: file in wrong format569collect2: error: ld returned 1 exit status570make[1]: *** [Makefile:240: /work/proj/_build/mangopi_mq_pro/lib/vix/priv/vix.so] Error 1571make: *** [Makefile:10: compile] Error 2572could not compile dependency :vix, "mix compile" failed. Errors may have been logged above. You can recompile this dependency with "mix deps.compile vix --force", update it with "mix deps.update vix" or clean it with "mix deps.clean vix"573==> nerves_compatibility_test574** (Mix) Could not compile with "make" (exit status: 2).575You need to have gcc and make installed. If you are using576Ubuntu or any other Debian-based system, install the packages577"build-essential". Also install "erlang-dev" package if not578included in your Erlang/OTP version. If you're on Fedora, run579"dnf group install 'Development Tools'".580