Build log
nerves_system_rpi5
membrane_element_ffmpeg_h264 0.4.1 · fail · run membrane_element_ffmpeg_h264-0.4.1-1790990065025
1447 of 1447 lines
1Resolving Hex dependencies...2Resolution completed in 0.145s3Unchanged:4 bunch 1.6.45 bunch_native 0.3.06 bundlex 0.4.17 circular_buffer 1.1.08 coerce 1.0.29 elixir_make 0.10.010 interactive_cmd 0.1.411 membrane_caps_video_h264 0.2.1 RETIRED!12 (renamed) Renamed to membrane_h264_format13 membrane_caps_video_raw 0.1.014 membrane_common_c 0.4.015 membrane_core 0.5.316 membrane_element_ffmpeg_h264 0.4.1 RETIRED!17 (renamed) Renamed to membrane_h264_ffmpeg_plugin18 nerves 2.0.0-pre.219 nerves_discovery 0.1.520 nerves_logging 0.2.421 nerves_runtime 0.13.1322 nerves_system_bbb 2.30.223 nerves_system_br 1.34.424 nerves_system_mangopi_mq_pro 0.17.225 nerves_system_qemu_aarch64 0.4.226 nerves_system_rpi0 2.1.227 nerves_system_rpi4 2.1.228 nerves_system_rpi5 2.1.229 nerves_system_trellis 0.5.030 nerves_system_x86_64 1.34.231 nerves_toolchain_aarch64_nerves_linux_gnu 15.3.132 nerves_toolchain_armv6_nerves_linux_gnueabihf 15.3.133 nerves_toolchain_armv7_nerves_linux_gnueabihf 15.3.134 nerves_toolchain_riscv64_nerves_linux_gnu 15.3.135 nerves_toolchain_x86_64_nerves_linux_musl 15.3.136 nerves_uevent 0.1.737 numbers 5.2.538 property_table 0.3.439 qex 0.5.240 ratio 2.4.241 ring_logger 0.11.742 secure_random 0.5.143 shmex 0.3.044 tablet 0.3.345 toolshed 0.5.046 uboot_env 1.0.247 unifex 0.3.348* Getting membrane_element_ffmpeg_h264 (Hex package)49* Getting nerves (Hex package)50* Getting ring_logger (Hex package)51* Getting toolshed (Hex package)52* Getting nerves_runtime (Hex package)53* Getting nerves_system_bbb (Hex package)54* Getting nerves_system_mangopi_mq_pro (Hex package)55* Getting nerves_system_qemu_aarch64 (Hex package)56* Getting nerves_system_rpi0 (Hex package)57* Getting nerves_system_rpi4 (Hex package)58* Getting nerves_system_rpi5 (Hex package)59* Getting nerves_system_trellis (Hex package)60* Getting nerves_system_x86_64 (Hex package)61* Getting nerves_system_br (Hex package)62* Getting nerves_toolchain_x86_64_nerves_linux_musl (Hex package)63* Getting nerves_toolchain_armv7_nerves_linux_gnueabihf (Hex package)64* Getting nerves_toolchain_aarch64_nerves_linux_gnu (Hex package)65* Getting nerves_toolchain_armv6_nerves_linux_gnueabihf (Hex package)66* Getting nerves_toolchain_riscv64_nerves_linux_gnu (Hex package)67* Getting nerves_logging (Hex package)68* Getting nerves_uevent (Hex package)69* Getting uboot_env (Hex package)70* Getting elixir_make (Hex package)71* Getting property_table (Hex package)72* Getting circular_buffer (Hex package)73* Getting interactive_cmd (Hex package)74* Getting nerves_discovery (Hex package)75* Getting tablet (Hex package)76* Getting bunch (Hex package)77* Getting membrane_caps_video_h264 (Hex package)78* Getting membrane_caps_video_raw (Hex package)79* Getting membrane_common_c (Hex package)80* Getting membrane_core (Hex package)81* Getting unifex (Hex package)82* Getting bundlex (Hex package)83* Getting shmex (Hex package)84* Getting bunch_native (Hex package)85* Getting qex (Hex package)86* Getting secure_random (Hex package)87* Getting ratio (Hex package)88* Getting numbers (Hex package)89* Getting coerce (Hex package)90Found retired packages, see above for details91==> nerves_system_br92Generated nerves_system_br app93==> membrane_caps_video_h26494Compiling 1 file (.ex)95Generated membrane_caps_video_h264 app96==> circular_buffer97Compiling 1 file (.ex)98Generated circular_buffer app99==> membrane_caps_video_raw100Compiling 1 file (.ex)101Generated membrane_caps_video_raw app102==> coerce103Compiling 3 files (.ex)104Generated coerce app105==> bunch106Compiling 19 files (.ex)107Generated bunch app108==> tablet109Compiling 2 files (.ex)110Generated tablet app111==> numbers112Compiling 7 files (.ex)113Generated numbers app114==> elixir_make115Compiling 8 files (.ex)116Generated elixir_make app117==> nerves_logging118 CC kmsg_tailer.o119 LD kmsg_tailer120Compiling 5 files (.ex)121Generated nerves_logging app122==> ratio123Compiling 5 files (.ex)124 warning: <|> is deprecated. Use another pipe-like operator125 │126 154 │ def numerator <|> denominator127 │ ~128 │129 └─ lib/ratio.ex:154:17130131 warning: <|> is deprecated. Use another pipe-like operator132 │133 156 │ def _numerator <|> 0 do134 │ ~135 │136 └─ lib/ratio.ex:156:18137138 warning: <|> is deprecated. Use another pipe-like operator139 │140 160 │ def numerator <|> denominator when is_integer(numerator) and is_integer(denominator) do141 │ ~142 │143 └─ lib/ratio.ex:160:17144145 warning: <|> is deprecated. Use another pipe-like operator146 │147 166 │ def numerator <|> denominator when is_float(numerator) do148 │ ~149 │150 └─ lib/ratio.ex:166:17151152 warning: <|> is deprecated. Use another pipe-like operator153 │154 170 │ def numerator <|> denominator when is_float(denominator) do155 │ ~156 │157 └─ lib/ratio.ex:170:17158159 warning: <|> is deprecated. Use another pipe-like operator160 │161 174 │ def (numerator = %Ratio{}) <|> (denominator = %Ratio{}) do162 │ ~163 │164 └─ lib/ratio.ex:174:30165166 warning: <|> is deprecated. Use another pipe-like operator167 │168 179 │ def (numerator = %Decimal{}) <|> (denominator = %Decimal{}) do169 │ ~170 │171 └─ lib/ratio.ex:179:34172173 warning: <|> is deprecated. Use another pipe-like operator174 │175 184 │ def (numerator = %Decimal{}) <|> denominator when is_float(denominator) do176 │ ~177 │178 └─ lib/ratio.ex:184:34179180 warning: <|> is deprecated. Use another pipe-like operator181 │182 189 │ def numerator <|> (denominator = %Decimal{}) when is_float(numerator) do183 │ ~184 │185 └─ lib/ratio.ex:189:19186187 warning: <|> is deprecated. Use another pipe-like operator188 │189 194 │ def (numerator = %Decimal{}) <|> denominator when is_integer(denominator) do190 │ ~191 │192 └─ lib/ratio.ex:194:34193194 warning: <|> is deprecated. Use another pipe-like operator195 │196 199 │ def numerator <|> (denominator = %Decimal{}) when is_integer(numerator) do197 │ ~198 │199 └─ lib/ratio.ex:199:19200201 warning: <|> is deprecated. Use another pipe-like operator202 │203 204 │ def numerator <|> denominator do204 │ ~205 │206 └─ lib/ratio.ex:204:17207208 warning: <|> is deprecated. Use another pipe-like operator209 │210 237 │ Ratio.DecimalConversion.decimal_to_rational(numerator) <|>211 │ ~212 │213 └─ lib/ratio.ex:237:62214215 warning: <|> is deprecated. Use another pipe-like operator216 │217 242 │ numerator <|> Ratio.DecimalConversion.decimal_to_rational(denominator)218 │ ~219 │220 └─ lib/ratio.ex:242:17221222 warning: <|> is deprecated. Use another pipe-like operator223 │224 247 │ numerator <|> denominator225 │ ~226 │227 └─ lib/ratio.ex:247:15228229 warning: <|> is deprecated. Use another pipe-like operator230 │231 261 │ do: Kernel.abs(numerator) <|> denominator232 │ ~233 │234 └─ lib/ratio.ex:261:31235236 warning: <|> is deprecated. Use another pipe-like operator237 │238 310 │ do: Kernel.+(a * lcm, b) <|> lcm239 │ ~240 │241 └─ lib/ratio.ex:310:30242243 warning: <|> is deprecated. Use another pipe-like operator244 │245 313 │ do: Kernel.+(b * lcm, a) <|> lcm246 │ ~247 │248 └─ lib/ratio.ex:313:30249250 warning: <|> is deprecated. Use another pipe-like operator251 │252 316 │ Kernel.+(a, c) <|> lcm253 │ ~254 │255 └─ lib/ratio.ex:316:20256257 warning: <|> is deprecated. Use another pipe-like operator258 │259 320 │ Kernel.+(a * d, c * b) <|> (b * d)260 │ ~261 │262 └─ lib/ratio.ex:320:28263264 warning: <|> is deprecated. Use another pipe-like operator265 │266 423 │ Kernel.*(numerator, number) <|> denominator267 │ ~268 │269 └─ lib/ratio.ex:423:33270271 warning: <|> is deprecated. Use another pipe-like operator272 │273 428 │ Kernel.*(numerator, number) <|> denominator274 │ ~275 │276 └─ lib/ratio.ex:428:33277278 warning: <|> is deprecated. Use another pipe-like operator279 │280 435 │ Kernel.*(numerator1, numerator2) <|> Kernel.*(denominator1, denominator2)281 │ ~282 │283 └─ lib/ratio.ex:435:38284285 warning: <|> is deprecated. Use another pipe-like operator286 │287 467 │ def div(a, b) when is_number(a) and is_integer(b), do: a <|> b288 │ ~289 │290 └─ lib/ratio.ex:467:60291292 warning: <|> is deprecated. Use another pipe-like operator293 │294 474 │ numerator <|> Kernel.*(denominator, number)295 │ ~296 │297 └─ lib/ratio.ex:474:15298299 warning: <|> is deprecated. Use another pipe-like operator300 │301 480 │ mult(number, denominator <|> numerator)302 │ ~303 │304 └─ lib/ratio.ex:480:30305306 warning: <|> is deprecated. Use another pipe-like operator307 │308 487 │ Kernel.*(numerator1, denominator2) <|> Kernel.*(denominator1, numerator2)309 │ ~310 │311 └─ lib/ratio.ex:487:40312313 warning: <|> is deprecated. Use another pipe-like operator314 │315 507 │ def a / b when is_number(a) and is_integer(b), do: a <|> b316 │ ~317 │318 └─ lib/ratio.ex:507:56319320 warning: <|> is deprecated. Use another pipe-like operator321 │322 852 │ if numerator <|> denominator == floor do323 │ ~324 │325 └─ lib/ratio.ex:852:18326327 warning: Application.get_env/2 is discouraged in the module body, use Application.compile_env/3 instead328 │329 133 │ Passed floats are rounded to `#{Application.get_env(:ratio, :max_float_to_rational_digits)}` digits, to make the result match expectations better.330 │ ~331 │332 └─ lib/ratio.ex:133:47: Ratio (module)333334 warning: <|> is deprecated. Use another pipe-like operator335 │336 55 │ (integer * numerator + decimal) <|> numerator337 │ ~338 │339 └─ lib/ratio/float_conversion.ex:55:37340341 warning: Application.get_env/2 is discouraged in the module body, use Application.compile_env/3 instead342 │343 4 │ @max_decimals Application.get_env(:ratio, :max_float_to_rational_digits)344 │ ~345 │346 └─ lib/ratio/float_conversion.ex:4:29: Ratio.FloatConversion (module)347348 warning: Ratio.DecimalConversion.decimal_to_rational/1 is undefined (module Ratio.DecimalConversion is not available or is yet to be defined)349 │350 17 │ {ratio, Ratio.DecimalConversion.decimal_to_rational(decimal)}351 │ ~352 │353 └─ lib/ratio/coerce.ex:17:37: Coerce.Implementations.Ratio.Decimal.coerce/2354355Generated ratio app356==> nerves_discovery357Compiling 5 files (.ex)358Generated nerves_discovery app359==> ring_logger360Compiling 7 files (.ex)361Generated ring_logger app362==> interactive_cmd363Compiling 1 file (.ex)364Generated interactive_cmd app365==> nerves366Compiling 65 files (.ex)367 warning: redefining module Mix.Tasks.Nerves.Init (current version loaded from /work/proj/_build/rpi5/lib/nerves/ebin/Elixir.Mix.Tasks.Nerves.Init.beam)368 │369 6 │ defmodule Mix.Tasks.Nerves.Init do370 │ ~~~~~~~~~~~~~~~~~~~~~~~~~~~~~~~~~~371 │372 └─ lib/mix/tasks/nerves.init.ex:6: Mix.Tasks.Nerves.Init (module)373374 warning: redefining module Nerves (current version loaded from /work/proj/_build/rpi5/lib/nerves/ebin/Elixir.Nerves.beam)375 │376 6 │ defmodule Nerves do377 │ ~~~~~~~~~~~~~~~~~~~378 │379 └─ lib/nerves.ex:6: Nerves (module)380381 warning: redefining module Nerves.ArtifactResolver (current version loaded from /work/proj/_build/rpi5/lib/nerves/ebin/Elixir.Nerves.ArtifactResolver.beam)382 │383 5 │ defmodule Nerves.ArtifactResolver do384 │ ~~~~~~~~~~~~~~~~~~~~~~~~~~~~~~~~~~~~385 │386 └─ lib/nerves/artifact_resolver.ex:5: Nerves.ArtifactResolver (module)387388 warning: redefining module Nerves.BuildAction.AppModes (current version loaded from /work/proj/_build/rpi5/lib/nerves/ebin/Elixir.Nerves.BuildAction.AppModes.beam)389 │390 6 │ defmodule Nerves.BuildAction.AppModes do391 │ ~~~~~~~~~~~~~~~~~~~~~~~~~~~~~~~~~~~~~~~~392 │393 └─ lib/nerves/build_action/app_modes.ex:6: Nerves.BuildAction.AppModes (module)394395 warning: redefining module Nerves.BuildAction.CheckExecutables (current version loaded from /work/proj/_build/rpi5/lib/nerves/ebin/Elixir.Nerves.BuildAction.CheckExecutables.beam)396 │397 5 │ defmodule Nerves.BuildAction.CheckExecutables do398 │ ~~~~~~~~~~~~~~~~~~~~~~~~~~~~~~~~~~~~~~~~~~~~~~~~399 │400 └─ lib/nerves/build_action/check_executables.ex:5: Nerves.BuildAction.CheckExecutables (module)401402 warning: redefining module Nerves.BuildAction.Erlinit (current version loaded from /work/proj/_build/rpi5/lib/nerves/ebin/Elixir.Nerves.BuildAction.Erlinit.beam)403 │404 8 │ defmodule Nerves.BuildAction.Erlinit do405 │ ~~~~~~~~~~~~~~~~~~~~~~~~~~~~~~~~~~~~~~~406 │407 └─ lib/nerves/build_action/erlinit.ex:8: Nerves.BuildAction.Erlinit (module)408409 warning: redefining module Nerves.BuildAction.Firmware (current version loaded from /work/proj/_build/rpi5/lib/nerves/ebin/Elixir.Nerves.BuildAction.Firmware.beam)410 │411 5 │ defmodule Nerves.BuildAction.Firmware do412 │ ~~~~~~~~~~~~~~~~~~~~~~~~~~~~~~~~~~~~~~~~413 │414 └─ lib/nerves/build_action/firmware.ex:5: Nerves.BuildAction.Firmware (module)415416 warning: redefining module Nerves.BuildAction.IExStartupCheck (current version loaded from /work/proj/_build/rpi5/lib/nerves/ebin/Elixir.Nerves.BuildAction.IExStartupCheck.beam)417 │418 7 │ defmodule Nerves.BuildAction.IExStartupCheck do419 │ ~~~~~~~~~~~~~~~~~~~~~~~~~~~~~~~~~~~~~~~~~~~~~~~420 │421 └─ lib/nerves/build_action/iex_startup_check.ex:7: Nerves.BuildAction.IExStartupCheck (module)422423 warning: redefining module Nerves.BuildAction.NervesV1System (current version loaded from /work/proj/_build/rpi5/lib/nerves/ebin/Elixir.Nerves.BuildAction.NervesV1System.beam)424 │425 5 │ defmodule Nerves.BuildAction.NervesV1System do426 │ ~~~~~~~~~~~~~~~~~~~~~~~~~~~~~~~~~~~~~~~~~~~~~~427 │428 └─ lib/nerves/build_action/nerves_v1_system.ex:5: Nerves.BuildAction.NervesV1System (module)429430 warning: redefining module Nerves.BuildAction.NervesV1Toolchain (current version loaded from /work/proj/_build/rpi5/lib/nerves/ebin/Elixir.Nerves.BuildAction.NervesV1Toolchain.beam)431 │432 5 │ defmodule Nerves.BuildAction.NervesV1Toolchain do433 │ ~~~~~~~~~~~~~~~~~~~~~~~~~~~~~~~~~~~~~~~~~~~~~~~~~434 │435 └─ lib/nerves/build_action/nerves_v1_toolchain.ex:5: Nerves.BuildAction.NervesV1Toolchain (module)436437 warning: redefining module Nerves.BuildAction.Rootfs (current version loaded from /work/proj/_build/rpi5/lib/nerves/ebin/Elixir.Nerves.BuildAction.Rootfs.beam)438 │439 5 │ defmodule Nerves.BuildAction.Rootfs do440 │ ~~~~~~~~~~~~~~~~~~~~~~~~~~~~~~~~~~~~~~441 │442 └─ lib/nerves/build_action/rootfs.ex:5: Nerves.BuildAction.Rootfs (module)443444 warning: redefining module Nerves.BuildAction.SortApps (current version loaded from /work/proj/_build/rpi5/lib/nerves/ebin/Elixir.Nerves.BuildAction.SortApps.beam)445 │446 6 │ defmodule Nerves.BuildAction.SortApps do447 │ ~~~~~~~~~~~~~~~~~~~~~~~~~~~~~~~~~~~~~~~~448 │449 └─ lib/nerves/build_action/sort_apps.ex:6: Nerves.BuildAction.SortApps (module)450451 warning: redefining module Nerves.BuildAction.StripAll (current version loaded from /work/proj/_build/rpi5/lib/nerves/ebin/Elixir.Nerves.BuildAction.StripAll.beam)452 │453 5 │ defmodule Nerves.BuildAction.StripAll do454 │ ~~~~~~~~~~~~~~~~~~~~~~~~~~~~~~~~~~~~~~~~455 │456 └─ lib/nerves/build_action/strip_all.ex:5: Nerves.BuildAction.StripAll (module)457458 warning: redefining module Nerves.BuildAction.Trimmer (current version loaded from /work/proj/_build/rpi5/lib/nerves/ebin/Elixir.Nerves.BuildAction.Trimmer.beam)459 │460 5 │ defmodule Nerves.BuildAction.Trimmer do461 │ ~~~~~~~~~~~~~~~~~~~~~~~~~~~~~~~~~~~~~~~462 │463 └─ lib/nerves/build_action/trimmer.ex:5: Nerves.BuildAction.Trimmer (module)464465 warning: redefining module Nerves.BuildPlan (current version loaded from /work/proj/_build/rpi5/lib/nerves/ebin/Elixir.Nerves.BuildPlan.beam)466 │467 5 │ defmodule Nerves.BuildPlan do468 │ ~~~~~~~~~~~~~~~~~~~~~~~~~~~~~469 │470 └─ lib/nerves/build_plan.ex:5: Nerves.BuildPlan (module)471472 warning: redefining module Nerves.BuildPlan.Checks (current version loaded from /work/proj/_build/rpi5/lib/nerves/ebin/Elixir.Nerves.BuildPlan.Checks.beam)473 │474 5 │ defmodule Nerves.BuildPlan.Checks do475 │ ~~~~~~~~~~~~~~~~~~~~~~~~~~~~~~~~~~~~476 │477 └─ lib/nerves/build_plan/checks.ex:5: Nerves.BuildPlan.Checks (module)478479 warning: redefining module Nerves.Container (current version loaded from /work/proj/_build/rpi5/lib/nerves/ebin/Elixir.Nerves.Container.beam)480 │481 6 │ defmodule Nerves.Container do482 │ ~~~~~~~~~~~~~~~~~~~~~~~~~~~~~483 │484 └─ lib/nerves/container.ex:6: Nerves.Container (module)485486 warning: redefining module Nerves.Fingerprint (current version loaded from /work/proj/_build/rpi5/lib/nerves/ebin/Elixir.Nerves.Fingerprint.beam)487 │488 5 │ defmodule Nerves.Fingerprint do489 │ ~~~~~~~~~~~~~~~~~~~~~~~~~~~~~~~490 │491 └─ lib/nerves/fingerprint.ex:5: Nerves.Fingerprint (module)492493 warning: redefining module Nerves.MixPackage (current version loaded from /work/proj/_build/rpi5/lib/nerves/ebin/Elixir.Nerves.MixPackage.beam)494 │495 5 │ defmodule Nerves.MixPackage do496 │ ~~~~~~~~~~~~~~~~~~~~~~~~~~~~~~497 │498 └─ lib/nerves/mix_package.ex:5: Nerves.MixPackage (module)499500 warning: redefining module Nerves.Paths (current version loaded from /work/proj/_build/rpi5/lib/nerves/ebin/Elixir.Nerves.Paths.beam)501 │502 5 │ defmodule Nerves.Paths do503 │ ~~~~~~~~~~~~~~~~~~~~~~~~~504 │505 └─ lib/nerves/paths.ex:5: Nerves.Paths (module)506507 warning: redefining module Nerves.TargetTuple (current version loaded from /work/proj/_build/rpi5/lib/nerves/ebin/Elixir.Nerves.TargetTuple.beam)508 │509 5 │ defmodule Nerves.TargetTuple do510 │ ~~~~~~~~~~~~~~~~~~~~~~~~~~~~~~~511 │512 └─ lib/nerves/target_tuple.ex:5: Nerves.TargetTuple (module)513514Generated nerves app515==> nerves_toolchain_aarch64_nerves_linux_gnu516Compiling 1 file (.ex)517Generated nerves_toolchain_aarch64_nerves_linux_gnu app518==> nerves_system_rpi5519Generated nerves_system_rpi5 app520==> secure_random521Compiling 1 file (.ex)522 warning: use Bitwise is deprecated. import Bitwise instead523 │524 2 │ use Bitwise525 │ ~~~~~~~~~~~526 │527 └─ lib/secure_random.ex:2: SecureRandom (module)528529Generated secure_random app530==> uboot_env531Compiling 5 files (.ex)532Generated uboot_env app533==> qex534Compiling 4 files (.ex)535warning: x..y inside match is deprecated, you must always match on the step: x..y//var or x..y//_ if you want to ignore it536 lib/qex.ex:45: Qex.new/1537538Generated qex app539==> membrane_core540Compiling 106 files (.ex)541 warning: unused require Record542 │543 35 │ require Record544 │ ~545 │546 └─ lib/membrane/caps/matcher.ex:35:3547548 warning: use Bunch.Typespec is deprecated. `use Bunch.Typespec` only brings to scope the deprecated @/1549 │550 15 │ use Bunch.Typespec551 │ ~~~~~~~~~~~~~~~~~~552 │553 └─ lib/membrane/pad.ex:15: Membrane.Pad (module)554555warning: Bunch.Typespec.@list_type is deprecated. Use Bunch.Typespec.enum_to_alternative/1 instead.556 (bunch 1.6.4) lib/bunch/typespec.ex:33: Bunch.Typespec."MACRO-@"/2557 (elixir 1.20.3) src/elixir_dispatch.erl:263: :elixir_dispatch.expand_macro_fun/7558 (elixir 1.20.3) src/elixir_dispatch.erl:122: :elixir_dispatch.dispatch_import/6559 (elixir 1.20.3) src/elixir_expand.erl:679: :elixir_expand.expand_block/5560 (elixir 1.20.3) src/elixir_expand.erl:53: :elixir_expand.expand/3561 (elixir 1.20.3) src/elixir_expand.erl:18: :elixir_expand.expand/3562563 warning: unused require Membrane.Pad564 │565 14 │ require Pad566 │ ~567 │568 └─ lib/membrane/core/element/state.ex:14:3569570 warning: unused require Membrane.Core.Message571 │572 8 │ require Message573 │ ~574 │575 └─ lib/membrane/core/bin/linking_buffer.ex:8:3576577 warning: unused require Membrane.Core.Child.PadModel578 │579 16 │ require PadModel580 │ ~581 │582 └─ lib/membrane/core/child/pad_controller.ex:16:3583584 warning: unused require Membrane.Core.Message585 │586 14 │ require Message587 │ ~588 │589 └─ lib/membrane/core/child/pad_controller.ex:14:3590591 warning: unused require Membrane.Core.Message592 │593 14 │ require Message594 │ ~595 │596 └─ lib/membrane/core/parent/child_life_controller/link_handler.ex:14:3597598 warning: unused require Membrane.Core.Child.PadModel599 │600 14 │ require PadModel601 │ ~602 │603 └─ lib/membrane/core/element/event_controller.ex:14:3604605 warning: unused require Membrane.Core.Message606 │607 13 │ require Message608 │ ~609 │610 └─ lib/membrane/core/element/event_controller.ex:13:3611612 warning: unused require Membrane.Core.Child.PadModel613 │614 19 │ require PadModel615 │ ~616 │617 └─ lib/membrane/core/element/demand_handler.ex:19:3618619 warning: unused require Membrane.Core.Message620 │621 18 │ require Message622 │ ~623 │624 └─ lib/membrane/core/element/demand_handler.ex:18:3625626 warning: unused require Membrane.Core.Child.PadModel627 │628 23 │ require PadModel629 │ ~630 │631 └─ lib/membrane/core/element/action_handler.ex:23:3632633 warning: unused require Membrane.Core.Message634 │635 22 │ require Message636 │ ~637 │638 └─ lib/membrane/core/element/action_handler.ex:22:3639640 warning: unused require Membrane.Pad641 │642 9 │ require Pad643 │ ~644 │645 └─ lib/membrane/core/child/pad_spec_handler.ex:9:3646647 warning: unused require Membrane.Core.Message648 │649 6 │ require Membrane.Core.Message650 │ ~651 │652 └─ lib/membrane/core/parent/child_life_controller/startup_handler.ex:6:3653654 warning: unused require Membrane.Core.Message655 │656 13 │ require Message657 │ ~658 │659 └─ lib/membrane/core/input_buffer.ex:13:3660661 warning: unused require Membrane.Core.Message662 │663 10 │ require Message664 │ ~665 │666 └─ lib/membrane/core/bin/action_handler.ex:10:3667668 warning: the variable "at_pos" is accessed inside size(...) of a bitstring but it was defined outside of the match. You must precede it with the pin operator669 │670 100 │ <<part1::binary-size(at_pos), part2::binary>> = payload671 │ ~672 │673 └─ lib/membrane/payload.ex:100:26: Membrane.Payload.BitString.split_at/2674675 warning: the variable "bytes" is accessed inside size(...) of a bitstring but it was defined outside of the match. You must precede it with the pin operator676 │677 113 │ <<_dropped::binary-size(bytes), rest::binary>> = payload678 │ ~679 │680 └─ lib/membrane/payload.ex:113:29: Membrane.Payload.BitString.drop/2681682 warning: unused require Membrane.Core.Message683 │684 30 │ require Message685 │ ~686 │687 └─ lib/membrane/pipeline.ex:30:3688689 warning: unused require Membrane.Element690 │691 28 │ require Element692 │ ~693 │694 └─ lib/membrane/pipeline.ex:28:3695696 warning: unused require Membrane.Pad697 │698 31 │ require Pad699 │ ~700 │701 └─ lib/membrane/pipeline.ex:31:3702703 warning: unused require Membrane.PlaybackState704 │705 29 │ require PlaybackState706 │ ~707 │708 └─ lib/membrane/pipeline.ex:29:3709710 warning: unused require Membrane.Core.Child.PadModel711 │712 40 │ require PadModel713 │ ~714 │715 └─ lib/membrane/bin.ex:40:3716717 warning: unused require Membrane.Element718 │719 36 │ require Element720 │ ~721 │722 └─ lib/membrane/bin.ex:36:3723724 warning: unused require Membrane.Pad725 │726 38 │ require Pad727 │ ~728 │729 └─ lib/membrane/bin.ex:38:3730731 warning: unused require Membrane.PlaybackState732 │733 41 │ require Membrane.PlaybackState734 │ ~735 │736 └─ lib/membrane/bin.ex:41:3737738 warning: unused require Membrane.Core.Message739 │740 15 │ require Message741 │ ~742 │743 └─ lib/membrane/core/playback_handler.ex:15:3744745 warning: unused require Membrane.Bin746 │747 6 │ require Membrane.Bin748 │ ~749 │750 └─ lib/membrane/core/parent/child_life_controller.ex:6:3751752 warning: unused require Membrane.Core.Message753 │754 7 │ require Membrane.Core.Message755 │ ~756 │757 └─ lib/membrane/core/parent/child_life_controller.ex:7:3758759 warning: unused require Membrane.Element760 │761 8 │ require Membrane.Element762 │ ~763 │764 └─ lib/membrane/core/parent/child_life_controller.ex:8:3765766 warning: unused require Membrane.PlaybackState767 │768 9 │ require Membrane.PlaybackState769 │ ~770 │771 └─ lib/membrane/core/parent/child_life_controller.ex:9:3772773 warning: unused require Membrane.Core.Child.PadModel774 │775 23 │ require PadModel776 │ ~777 │778 └─ lib/membrane/core/parent/lifecycle_controller.ex:23:3779780 warning: unused require Membrane.Core.Message781 │782 22 │ require Message783 │ ~784 │785 └─ lib/membrane/core/parent/lifecycle_controller.ex:22:3786787 warning: unused require Membrane.PlaybackState788 │789 24 │ require PlaybackState790 │ ~791 │792 └─ lib/membrane/core/parent/lifecycle_controller.ex:24:3793794 warning: unused require Membrane.Core.Child.PadModel795 │796 10 │ require Membrane.Core.Child.PadModel797 │ ~798 │799 └─ lib/membrane/core/element/lifecycle_controller.ex:10:3800801 warning: unused require Membrane.Core.Message802 │803 11 │ require Membrane.Core.Message804 │ ~805 │806 └─ lib/membrane/core/element/lifecycle_controller.ex:11:3807808 warning: unused require Membrane.Core.Playback809 │810 12 │ require Membrane.Core.Playback811 │ ~812 │813 └─ lib/membrane/core/element/lifecycle_controller.ex:12:381481581601:18:32.778 [warning] Passing :require_if option to Bunch.Config.parse/2 is deprecated, pass function returning constraints instead81781801:18:32.935 [warning] Passing :require_if option to Bunch.Config.parse/2 is deprecated, pass function returning constraints instead819 warning: a struct for Membrane.Core.InputBuffer is expected on struct update:820821 %Membrane.Core.InputBuffer{buf | toilet?: true}822823 but got type:824825 dynamic()826827 where "buf" was given the type:828829 # type: dynamic()830 # from: lib/membrane/core/input_buffer.ex:112:21831 buf832833 when defining the variable "buf", you must also pattern match on "%Membrane.Core.InputBuffer{}"834835 type warning found at:836 │837 112 │ def enable_toilet(buf), do: %__MODULE__{buf | toilet?: true}838 │ ~839 │840 └─ lib/membrane/core/input_buffer.ex:112:31: Membrane.Core.InputBuffer.enable_toilet/1841842 warning: expected a map or struct when accessing .input_buf_preferred_size in expression:843844 metric.input_buf_preferred_size845846 where "metric" was given the type:847848 # type: dynamic(Membrane.Buffer.Metric.ByteSize or Membrane.Buffer.Metric.Count)849 # from: lib/membrane/core/input_buffer.ex:91:12850 metric = Membrane.Buffer.Metric.from_unit(demand_unit)851852 hint: "var.field" (without parentheses) means "var" is a map() while "var.fun()" (with parentheses) means "var" is an atom()853854 type warning found at:855 │856 92 │ preferred_size = props[:preferred_size] || metric.input_buf_preferred_size857 │ ~858 │859 └─ lib/membrane/core/input_buffer.ex:92:55: Membrane.Core.InputBuffer.init/5860861 warning: expected a map or struct when accessing .membrane_element_type in expression:862863 &1.module.membrane_element_type864865 but got type:866867 dynamic(atom())868869 hint: "var.field" (without parentheses) means "var" is a map() while "var.fun()" (with parentheses) means "var" is an atom()870871 type warning found at:872 │873 37 │ &(Membrane.Element.element?(&1.module) and &1.module.membrane_element_type == :sink)874 │ ~875 │876 └─ lib/membrane/core/parent/child_life_controller/startup_handler.ex:37:62: Membrane.Core.Parent.ChildLifeController.StartupHandler.setup_syncs/2877878 warning: the following clause will never match:879880 {{:error, reason}, state} ->881882 it is expected to match on type:883884 none()885886 type warning found at:887 │888 56 │ do: {{:error, reason}, state} ->889 │ ~~~~~~~~~~~~~~~~~~~~~~~~~~~~~~~~890 │891 └─ lib/membrane/core/element/event_controller.ex:56: Membrane.Core.Element.EventController.exec_handle_event/4892893 warning: a struct for Membrane.Core.Parent.Link is expected on struct update:894895 %Membrane.Core.Parent.Link{896 &1897 | from: resolve_endpoint(&1.from, state),898 to: resolve_endpoint(&1.to, state)899 }900901 but got type:902903 dynamic()904905 instead of using &1, you must define an anonymous function, define a variable and pattern match on "%Membrane.Core.Parent.Link{}"906907 type warning found at:908 │909 22 │ &%Link{&1 | from: resolve_endpoint(&1.from, state), to: resolve_endpoint(&1.to, state)}910 │ ~911 │912 └─ lib/membrane/core/parent/child_life_controller/link_handler.ex:22:8: Membrane.Core.Parent.ChildLifeController.LinkHandler.resolve_links/2913914 warning: the following clause will never match:915916 {:error, reason} ->917918 it is expected to match on type:919920 none()921922 type warning found at:923 │924 56 │ {:error, reason} -> raise LinkError, "#{inspect(reason)}"925 │ ~~~~~~~~~~~~~~~~~~~~~~~~~~~~~~~~~~~~~~~~~~~~~~~~~~~~~~~~~926 │927 └─ lib/membrane/core/child/pad_controller.ex:56: Membrane.Core.Child.PadController.handle_link/7928929 warning: a struct for Membrane.Core.Timer is expected on struct update:930931 %Membrane.Core.Timer{timer | ratio: ratio}932933 but got type:934935 dynamic()936937 where "timer" was given the type:938939 # type: dynamic()940 # from: lib/membrane/core/timer.ex:36:20941 timer942943 when defining the variable "timer", you must also pattern match on "%Membrane.Core.Timer{}"944945 type warning found at:946 │947 37 │ %__MODULE__{timer | ratio: ratio}948 │ ~949 │950 └─ lib/membrane/core/timer.ex:37:5: Membrane.Core.Timer.update_ratio/2951952 warning: a struct for Membrane.Core.Timer is expected on struct update:953954 %Membrane.Core.Timer{timer | interval: interval}955956 but got type:957958 dynamic(not %Membrane.Core.Timer{interval: :no_interval})959960 where "timer" was given the type:961962 # type: dynamic(not %Membrane.Core.Timer{interval: :no_interval})963 # from: lib/membrane/core/timer.ex:67:20964 timer965966 when defining the variable "timer", you must also pattern match on "%Membrane.Core.Timer{}"967968 type warning found at:969 │970 68 │ %__MODULE__{timer | interval: interval}971 │ ~972 │973 └─ lib/membrane/core/timer.ex:68:5: Membrane.Core.Timer.set_interval/2974975Generated membrane_core app976==> bundlex977Compiling 29 files (.ex)978 warning: using single-quoted strings to represent charlists is deprecated.979 Use ~c"" if you indeed want a charlist or use "" instead.980 You may run "mix format --migrate" to change all single-quoted981 strings to use the ~c sigil and fix this warning.982 │983 38 │ {port, {:data, {:eol, 'ready'}}},984 │ ~985 │986 └─ lib/bundlex/cnode/server.ex:38:31987988 warning: using single-quoted strings to represent charlists is deprecated.989 Use ~c"" if you indeed want a charlist or use "" instead.990 You may run "mix format --migrate" to change all single-quoted991 strings to use the ~c sigil and fix this warning.992 │993 48 │ :ok = :win32reg.change_key(reg, '\\hklm\\SOFTWARE\\Microsoft\\Windows NT\\CurrentVersion')994 │ ~995 │996 └─ lib/bundlex/platform.ex:48:41997998 warning: using single-quoted strings to represent charlists is deprecated.999 Use ~c"" if you indeed want a charlist or use "" instead.1000 You may run "mix format --migrate" to change all single-quoted1001 strings to use the ~c sigil and fix this warning.1002 │1003 49 │ {:ok, build} = :win32reg.value(reg, 'BuildLabEx')1004 │ ~1005 │1006 └─ lib/bundlex/platform.ex:49:4510071008 warning: expected a map or struct when accessing .toolchain_module in expression:10091010 Bundlex.Platform.get_module(platform).toolchain_module10111012 but got type:10131014 dynamic(1015 Bundlex.Platform.Linux or Bundlex.Platform.MacOSX or Bundlex.Platform.Windows32 or1016 Bundlex.Platform.Windows641017 )10181019 where "platform" was given the type:10201021 # type: dynamic(:linux or :macosx or :windows32 or :windows64)1022 # from: lib/tasks/compile.bundlex.ex:34:371023 Bundlex.Platform.get_module(platform)10241025 hint: "var.field" (without parentheses) means "var" is a map() while "var.fun()" (with parentheses) means "var" is an atom()10261027 type warning found at:1028 │1029 34 │ commands = commands ++ Platform.get_module(platform).toolchain_module.before_all!(platform)1030 │ ~1031 │1032 └─ lib/tasks/compile.bundlex.ex:34:58: Mix.Tasks.Compile.Bundlex.run/110331034 warning: a struct for Bundlex.Native is expected on struct update:10351036 %Bundlex.Native{native | deps: parsed_deps, preprocessors: preprocessors}10371038 but got type:10391040 dynamic(%{..., sources: term()})10411042 where "native" was given the type:10431044 # type: dynamic(%{..., sources: term()})1045 # from: lib/bundlex/native.ex:126:511046 Enum.empty?(native.sources)10471048 when defining the variable "native", you must also pattern match on "%Bundlex.Native{}"10491050 type warning found at:1051 │1052 129 │ %__MODULE__{native | deps: parsed_deps, preprocessors: preprocessors}1053 │ ~1054 │1055 └─ lib/bundlex/native.ex:129:9: Bundlex.Native.parse_native/210561057 warning: expected a map or struct when accessing .toolchain_module in expression:10581059 Bundlex.Platform.get_module(platform).toolchain_module10601061 but got type:10621063 dynamic(1064 Bundlex.Platform.Linux or Bundlex.Platform.MacOSX or Bundlex.Platform.Windows32 or1065 Bundlex.Platform.Windows641066 )10671068 where "platform" was given the type:10691070 # type: dynamic(:linux or :macosx or :windows32 or :windows64)1071 # from: lib/bundlex/native.ex:106:271072 Bundlex.Platform.get_module(platform)10731074 hint: "var.field" (without parentheses) means "var" is a map() while "var.fun()" (with parentheses) means "var" is an atom()10751076 type warning found at:1077 │1078 106 │ commands = Platform.get_module(platform).toolchain_module.compiler_commands(native)1079 │ ~1080 │1081 └─ lib/bundlex/native.ex:106:48: Bundlex.Native.resolve_native/410821083Generated bundlex app1084warning: using map.field notation (without parentheses) to invoke function Bundlex.Platform.Linux.toolchain_module() is deprecated, you must add parentheses instead: remote.function()1085 (bundlex 0.4.1) lib/tasks/compile.bundlex.ex:34: Mix.Tasks.Compile.Bundlex.run/11086 (mix 1.20.3) lib/mix/task.ex:502: anonymous fn/3 in Mix.Task.run_task/51087 (mix 1.20.3) lib/mix/task.compiler.ex:299: Mix.Task.Compiler.run_compiler/21088 (mix 1.20.3) lib/mix/task.compiler.ex:287: Mix.Task.Compiler.run/41089 (mix 1.20.3) lib/mix/tasks/compile.all.ex:75: Mix.Tasks.Compile.All.do_run/210901091==> bunch_native1092Bundlex: Building natives: lib, bunch1093warning: using map.field notation (without parentheses) to invoke function Bundlex.Platform.Linux.toolchain_module() is deprecated, you must add parentheses instead: remote.function()1094 (bundlex 0.4.1) lib/bundlex/native.ex:106: Bundlex.Native.resolve_native/41095 (bunch 1.6.4) lib/bunch/enum.ex:244: Bunch.Enum.do_try_flat_map/31096 (bundlex 0.4.1) lib/tasks/compile.bundlex.ex:38: Mix.Tasks.Compile.Bundlex.run/11097 (mix 1.20.3) lib/mix/task.ex:502: anonymous fn/3 in Mix.Task.run_task/51098 (mix 1.20.3) lib/mix/task.compiler.ex:299: Mix.Task.Compiler.run_compiler/210991100Generated bunch_native app1101==> shmex1102Bundlex: Building natives: lib, shmex1103Compiling 2 files (.ex)1104 warning: the following pattern will never match:11051106 {:ok, trimmed_front} <- trim_leading(shm, bytes)11071108 because the right-hand side has type:11091110 none()11111112 where "bytes" was given the type:11131114 # type: dynamic()1115 # from: lib/shmex_native.ex:119:171116 bytes11171118 where "shm" was given the type:11191120 # type: dynamic()1121 # from: lib/shmex_native.ex:119:121122 shm11231124 type warning found at:1125 │1126 120 │ with {:ok, trimmed_front} <- trim_leading(shm, bytes),1127 │ ~~~~~~~~~~~~~~~~~~~~~~~~~~~~~~~~~~~~~~~~~~~~~~~~~~~~~~1128 │1129 └─ lib/shmex_native.ex:120: Shmex.Native.trim/211301131Generated shmex app1132==> unifex1133Bundlex: Building natives: unifex1134Compiling 27 files (.ex)1135 warning: unused require Bundlex.CNode1136 │1137 6 │ require Bundlex.CNode1138 │ ~1139 │1140 └─ lib/unifex/cnode.ex:6:311411142Generated unifex app1143==> membrane_common_c1144/usr/bin/sh: 1: clang-format: not found1145Bundlex: Building natives: membrane, membrane_ringbuffer1146/work/proj/deps_rpi5/membrane_common_c/c_src/membrane/log.c: In function ‘membrane_log’:1147/work/proj/deps_rpi5/membrane_common_c/c_src/membrane/log.c:54:31: warning: passing argument 7 of ‘send_membrane_log’ from incompatible pointer type [-Wincompatible-pointer-types]1148 54 | tags, 2);1149 | ^~~~1150 | |1151 | char **1152In file included from /work/proj/deps_rpi5/membrane_common_c/c_src/membrane/_generated/membrane.h:4,1153 from /work/proj/deps_rpi5/membrane_common_c/c_src/membrane/log.h:6,1154 from /work/proj/deps_rpi5/membrane_common_c/c_src/membrane/log.c:5:1155/work/proj/deps_rpi5/membrane_common_c/c_src/membrane/_generated/nif/membrane.h:48:138: note: expected ‘const char **’ but argument is of type ‘char **’1156 48 | int send_membrane_log(UnifexEnv* env, UnifexPid pid, int flags, const char* level, const char* message, const char* time, const char** tags, unsigned int tags_length);1157 | ~~~~~~~~~~~~~~^~~~1158Compiling 1 file (.ex)1159Generated membrane_common_c app1160==> membrane_element_ffmpeg_h2641161/usr/bin/sh: 1: clang-format: not found1162/usr/bin/sh: 1: clang-format: not found1163/usr/bin/sh: 1: clang-format: not found1164Bundlex: Building natives: parser, decoder, encoder1165In file included from /home/nerves/.nerves/artifacts/nerves_system_rpi5-2.1.2/staging/usr/include/math.h:37,1166 from /work/proj/deps_rpi5/shmex/c_src/shmex/shmex/lib.h:3,1167 from /work/proj/deps_rpi5/shmex/c_src/shmex/nif/shmex/shmex.h:6,1168 from /work/proj/deps_rpi5/unifex/c_src/unifex/nif/unifex/payload.h:4,1169 from /work/proj/deps_rpi5/membrane_element_ffmpeg_h264/c_src/membrane_element_ffmpeg_h264/_generated/nif/parser.h:7,1170 from /work/proj/deps_rpi5/membrane_element_ffmpeg_h264/c_src/membrane_element_ffmpeg_h264/_generated/nif/parser.c:1:1171/home/nerves/.nerves/artifacts/nerves_system_rpi5-2.1.2/staging/usr/include/bits/math-vector.h:192:9: error: unknown type name ‘__Float32x4_t’1172 192 | typedef __Float32x4_t __f32x4_t;1173 | ^~~~~~~~~~~~~1174/home/nerves/.nerves/artifacts/nerves_system_rpi5-2.1.2/staging/usr/include/bits/math-vector.h:193:9: error: unknown type name ‘__Float64x2_t’1175 193 | typedef __Float64x2_t __f64x2_t;1176 | ^~~~~~~~~~~~~1177/home/nerves/.nerves/artifacts/nerves_system_rpi5-2.1.2/staging/usr/include/bits/math-vector.h:202:9: error: unknown type name ‘__SVFloat32_t’1178 202 | typedef __SVFloat32_t __sv_f32_t;1179 | ^~~~~~~~~~~~~1180/home/nerves/.nerves/artifacts/nerves_system_rpi5-2.1.2/staging/usr/include/bits/math-vector.h:203:9: error: unknown type name ‘__SVFloat64_t’1181 203 | typedef __SVFloat64_t __sv_f64_t;1182 | ^~~~~~~~~~~~~1183/home/nerves/.nerves/artifacts/nerves_system_rpi5-2.1.2/staging/usr/include/bits/math-vector.h:204:9: error: unknown type name ‘__SVBool_t’1184 204 | typedef __SVBool_t __sv_bool_t;1185 | ^~~~~~~~~~1186/home/nerves/.nerves/artifacts/nerves_system_rpi5-2.1.2/staging/usr/include/bits/math-vector.h:214:1: warning: ‘aarch64_vector_pcs’ attribute directive ignored [-Wattributes]1187 214 | __vpcs __f32x4_t _ZGVnN4vv_atan2f (__f32x4_t, __f32x4_t);1188 | ^~~~~~1189/home/nerves/.nerves/artifacts/nerves_system_rpi5-2.1.2/staging/usr/include/bits/math-vector.h:215:1: warning: ‘aarch64_vector_pcs’ attribute directive ignored [-Wattributes]1190 215 | __vpcs __f32x4_t _ZGVnN4vv_atan2pif (__f32x4_t, __f32x4_t);1191 | ^~~~~~1192/home/nerves/.nerves/artifacts/nerves_system_rpi5-2.1.2/staging/usr/include/bits/math-vector.h:216:1: warning: ‘aarch64_vector_pcs’ attribute directive ignored [-Wattributes]1193 216 | __vpcs __f32x4_t _ZGVnN4v_acosf (__f32x4_t);1194 | ^~~~~~1195/home/nerves/.nerves/artifacts/nerves_system_rpi5-2.1.2/staging/usr/include/bits/math-vector.h:217:1: warning: ‘aarch64_vector_pcs’ attribute directive ignored [-Wattributes]1196 217 | __vpcs __f32x4_t _ZGVnN4v_acoshf (__f32x4_t);1197 | ^~~~~~1198/home/nerves/.nerves/artifacts/nerves_system_rpi5-2.1.2/staging/usr/include/bits/math-vector.h:218:1: warning: ‘aarch64_vector_pcs’ attribute directive ignored [-Wattributes]1199 218 | __vpcs __f32x4_t _ZGVnN4v_acospif (__f32x4_t);1200 | ^~~~~~1201/home/nerves/.nerves/artifacts/nerves_system_rpi5-2.1.2/staging/usr/include/bits/math-vector.h:219:1: warning: ‘aarch64_vector_pcs’ attribute directive ignored [-Wattributes]1202 219 | __vpcs __f32x4_t _ZGVnN4v_asinf (__f32x4_t);1203 | ^~~~~~1204/home/nerves/.nerves/artifacts/nerves_system_rpi5-2.1.2/staging/usr/include/bits/math-vector.h:220:1: warning: ‘aarch64_vector_pcs’ attribute directive ignored [-Wattributes]1205 220 | __vpcs __f32x4_t _ZGVnN4v_asinhf (__f32x4_t);1206 | ^~~~~~1207/home/nerves/.nerves/artifacts/nerves_system_rpi5-2.1.2/staging/usr/include/bits/math-vector.h:221:1: warning: ‘aarch64_vector_pcs’ attribute directive ignored [-Wattributes]1208 221 | __vpcs __f32x4_t _ZGVnN4v_asinpif (__f32x4_t);1209 | ^~~~~~1210/home/nerves/.nerves/artifacts/nerves_system_rpi5-2.1.2/staging/usr/include/bits/math-vector.h:222:1: warning: ‘aarch64_vector_pcs’ attribute directive ignored [-Wattributes]1211 222 | __vpcs __f32x4_t _ZGVnN4v_atanf (__f32x4_t);1212 | ^~~~~~1213/home/nerves/.nerves/artifacts/nerves_system_rpi5-2.1.2/staging/usr/include/bits/math-vector.h:223:1: warning: ‘aarch64_vector_pcs’ attribute directive ignored [-Wattributes]1214 223 | __vpcs __f32x4_t _ZGVnN4v_atanhf (__f32x4_t);1215 | ^~~~~~1216/home/nerves/.nerves/artifacts/nerves_system_rpi5-2.1.2/staging/usr/include/bits/math-vector.h:224:1: warning: ‘aarch64_vector_pcs’ attribute directive ignored [-Wattributes]1217 224 | __vpcs __f32x4_t _ZGVnN4v_atanpif (__f32x4_t);1218 | ^~~~~~1219/home/nerves/.nerves/artifacts/nerves_system_rpi5-2.1.2/staging/usr/include/bits/math-vector.h:225:1: warning: ‘aarch64_vector_pcs’ attribute directive ignored [-Wattributes]1220 225 | __vpcs __f32x4_t _ZGVnN4v_cbrtf (__f32x4_t);1221 | ^~~~~~1222/home/nerves/.nerves/artifacts/nerves_system_rpi5-2.1.2/staging/usr/include/bits/math-vector.h:226:1: warning: ‘aarch64_vector_pcs’ attribute directive ignored [-Wattributes]1223 226 | __vpcs __f32x4_t _ZGVnN4v_cosf (__f32x4_t);1224 | ^~~~~~1225/home/nerves/.nerves/artifacts/nerves_system_rpi5-2.1.2/staging/usr/include/bits/math-vector.h:227:1: warning: ‘aarch64_vector_pcs’ attribute directive ignored [-Wattributes]1226 227 | __vpcs __f32x4_t _ZGVnN4v_coshf (__f32x4_t);1227 | ^~~~~~1228/home/nerves/.nerves/artifacts/nerves_system_rpi5-2.1.2/staging/usr/include/bits/math-vector.h:228:1: warning: ‘aarch64_vector_pcs’ attribute directive ignored [-Wattributes]1229 228 | __vpcs __f32x4_t _ZGVnN4v_cospif (__f32x4_t);1230 | ^~~~~~1231/home/nerves/.nerves/artifacts/nerves_system_rpi5-2.1.2/staging/usr/include/bits/math-vector.h:229:1: warning: ‘aarch64_vector_pcs’ attribute directive ignored [-Wattributes]1232 229 | __vpcs __f32x4_t _ZGVnN4v_erff (__f32x4_t);1233 | ^~~~~~1234/home/nerves/.nerves/artifacts/nerves_system_rpi5-2.1.2/staging/usr/include/bits/math-vector.h:230:1: warning: ‘aarch64_vector_pcs’ attribute directive ignored [-Wattributes]1235 230 | __vpcs __f32x4_t _ZGVnN4v_erfcf (__f32x4_t);1236 | ^~~~~~1237/home/nerves/.nerves/artifacts/nerves_system_rpi5-2.1.2/staging/usr/include/bits/math-vector.h:231:1: warning: ‘aarch64_vector_pcs’ attribute directive ignored [-Wattributes]1238 231 | __vpcs __f32x4_t _ZGVnN4v_expf (__f32x4_t);1239 | ^~~~~~1240/home/nerves/.nerves/artifacts/nerves_system_rpi5-2.1.2/staging/usr/include/bits/math-vector.h:232:1: warning: ‘aarch64_vector_pcs’ attribute directive ignored [-Wattributes]1241 232 | __vpcs __f32x4_t _ZGVnN4v_exp10f (__f32x4_t);1242 | ^~~~~~1243/home/nerves/.nerves/artifacts/nerves_system_rpi5-2.1.2/staging/usr/include/bits/math-vector.h:233:1: warning: ‘aarch64_vector_pcs’ attribute directive ignored [-Wattributes]1244 233 | __vpcs __f32x4_t _ZGVnN4v_exp2f (__f32x4_t);1245 | ^~~~~~1246/home/nerves/.nerves/artifacts/nerves_system_rpi5-2.1.2/staging/usr/include/bits/math-vector.h:234:1: warning: ‘aarch64_vector_pcs’ attribute directive ignored [-Wattributes]1247 234 | __vpcs __f32x4_t _ZGVnN4v_expm1f (__f32x4_t);1248 | ^~~~~~1249/home/nerves/.nerves/artifacts/nerves_system_rpi5-2.1.2/staging/usr/include/bits/math-vector.h:235:1: warning: ‘aarch64_vector_pcs’ attribute directive ignored [-Wattributes]1250 235 | __vpcs __f32x4_t _ZGVnN4v_exp2m1f (__f32x4_t);1251 | ^~~~~~1252/home/nerves/.nerves/artifacts/nerves_system_rpi5-2.1.2/staging/usr/include/bits/math-vector.h:236:1: warning: ‘aarch64_vector_pcs’ attribute directive ignored [-Wattributes]1253 236 | __vpcs __f32x4_t _ZGVnN4v_exp10m1f (__f32x4_t);1254 | ^~~~~~1255/home/nerves/.nerves/artifacts/nerves_system_rpi5-2.1.2/staging/usr/include/bits/math-vector.h:237:1: warning: ‘aarch64_vector_pcs’ attribute directive ignored [-Wattributes]1256 237 | __vpcs __f32x4_t _ZGVnN4vv_hypotf (__f32x4_t, __f32x4_t);1257 | ^~~~~~1258/home/nerves/.nerves/artifacts/nerves_system_rpi5-2.1.2/staging/usr/include/bits/math-vector.h:238:1: warning: ‘aarch64_vector_pcs’ attribute directive ignored [-Wattributes]1259 238 | __vpcs __f32x4_t _ZGVnN4v_logf (__f32x4_t);1260 | ^~~~~~1261/home/nerves/.nerves/artifacts/nerves_system_rpi5-2.1.2/staging/usr/include/bits/math-vector.h:239:1: warning: ‘aarch64_vector_pcs’ attribute directive ignored [-Wattributes]1262 239 | __vpcs __f32x4_t _ZGVnN4v_log10f (__f32x4_t);1263 | ^~~~~~1264/home/nerves/.nerves/artifacts/nerves_system_rpi5-2.1.2/staging/usr/include/bits/math-vector.h:240:1: warning: ‘aarch64_vector_pcs’ attribute directive ignored [-Wattributes]1265 240 | __vpcs __f32x4_t _ZGVnN4v_log10p1f (__f32x4_t);1266 | ^~~~~~1267/home/nerves/.nerves/artifacts/nerves_system_rpi5-2.1.2/staging/usr/include/bits/math-vector.h:241:1: warning: ‘aarch64_vector_pcs’ attribute directive ignored [-Wattributes]1268 241 | __vpcs __f32x4_t _ZGVnN4v_log1pf (__f32x4_t);1269 | ^~~~~~1270/home/nerves/.nerves/artifacts/nerves_system_rpi5-2.1.2/staging/usr/include/bits/math-vector.h:242:1: warning: ‘aarch64_vector_pcs’ attribute directive ignored [-Wattributes]1271 242 | __vpcs __f32x4_t _ZGVnN4v_log2f (__f32x4_t);1272 | ^~~~~~1273/home/nerves/.nerves/artifacts/nerves_system_rpi5-2.1.2/staging/usr/include/bits/math-vector.h:243:1: warning: ‘aarch64_vector_pcs’ attribute directive ignored [-Wattributes]1274 243 | __vpcs __f32x4_t _ZGVnN4v_log2p1f (__f32x4_t);1275 | ^~~~~~1276/home/nerves/.nerves/artifacts/nerves_system_rpi5-2.1.2/staging/usr/include/bits/math-vector.h:244:1: warning: ‘aarch64_vector_pcs’ attribute directive ignored [-Wattributes]1277 244 | __vpcs __f32x4_t _ZGVnN4v_logp1f (__f32x4_t);1278 | ^~~~~~1279/home/nerves/.nerves/artifacts/nerves_system_rpi5-2.1.2/staging/usr/include/bits/math-vector.h:245:1: warning: ‘aarch64_vector_pcs’ attribute directive ignored [-Wattributes]1280 245 | __vpcs __f32x4_t _ZGVnN4vv_powf (__f32x4_t, __f32x4_t);1281 | ^~~~~~1282/home/nerves/.nerves/artifacts/nerves_system_rpi5-2.1.2/staging/usr/include/bits/math-vector.h:246:1: warning: ‘aarch64_vector_pcs’ attribute directive ignored [-Wattributes]1283 246 | __vpcs __f32x4_t _ZGVnN4v_rsqrtf (__f32x4_t);1284 | ^~~~~~1285/home/nerves/.nerves/artifacts/nerves_system_rpi5-2.1.2/staging/usr/include/bits/math-vector.h:247:1: warning: ‘aarch64_vector_pcs’ attribute directive ignored [-Wattributes]1286 247 | __vpcs __f32x4_t _ZGVnN4v_sinf (__f32x4_t);1287 | ^~~~~~1288/home/nerves/.nerves/artifacts/nerves_system_rpi5-2.1.2/staging/usr/include/bits/math-vector.h:248:1: warning: ‘aarch64_vector_pcs’ attribute directive ignored [-Wattributes]1289 248 | __vpcs __f32x4_t _ZGVnN4v_sinhf (__f32x4_t);1290 | ^~~~~~1291/home/nerves/.nerves/artifacts/nerves_system_rpi5-2.1.2/staging/usr/include/bits/math-vector.h:249:1: warning: ‘aarch64_vector_pcs’ attribute directive ignored [-Wattributes]1292 249 | __vpcs __f32x4_t _ZGVnN4v_sinpif (__f32x4_t);1293 | ^~~~~~1294/home/nerves/.nerves/artifacts/nerves_system_rpi5-2.1.2/staging/usr/include/bits/math-vector.h:250:1: warning: ‘aarch64_vector_pcs’ attribute directive ignored [-Wattributes]1295 250 | __vpcs __f32x4_t _ZGVnN4v_tanf (__f32x4_t);1296 | ^~~~~~1297/home/nerves/.nerves/artifacts/nerves_system_rpi5-2.1.2/staging/usr/include/bits/math-vector.h:251:1: warning: ‘aarch64_vector_pcs’ attribute directive ignored [-Wattributes]1298 251 | __vpcs __f32x4_t _ZGVnN4v_tanhf (__f32x4_t);1299 | ^~~~~~1300/home/nerves/.nerves/artifacts/nerves_system_rpi5-2.1.2/staging/usr/include/bits/math-vector.h:252:1: warning: ‘aarch64_vector_pcs’ attribute directive ignored [-Wattributes]1301 252 | __vpcs __f32x4_t _ZGVnN4v_tanpif (__f32x4_t);1302 | ^~~~~~1303/home/nerves/.nerves/artifacts/nerves_system_rpi5-2.1.2/staging/usr/include/bits/math-vector.h:254:1: warning: ‘aarch64_vector_pcs’ attribute directive ignored [-Wattributes]1304 254 | __vpcs __f64x2_t _ZGVnN2vv_atan2 (__f64x2_t, __f64x2_t);1305 | ^~~~~~1306/home/nerves/.nerves/artifacts/nerves_system_rpi5-2.1.2/staging/usr/include/bits/math-vector.h:255:1: warning: ‘aarch64_vector_pcs’ attribute directive ignored [-Wattributes]1307 255 | __vpcs __f64x2_t _ZGVnN2vv_atan2pi (__f64x2_t, __f64x2_t);1308 | ^~~~~~1309/home/nerves/.nerves/artifacts/nerves_system_rpi5-2.1.2/staging/usr/include/bits/math-vector.h:256:1: warning: ‘aarch64_vector_pcs’ attribute directive ignored [-Wattributes]1310 256 | __vpcs __f64x2_t _ZGVnN2v_acos (__f64x2_t);1311 | ^~~~~~1312/home/nerves/.nerves/artifacts/nerves_system_rpi5-2.1.2/staging/usr/include/bits/math-vector.h:257:1: warning: ‘aarch64_vector_pcs’ attribute directive ignored [-Wattributes]1313 257 | __vpcs __f64x2_t _ZGVnN2v_acosh (__f64x2_t);1314 | ^~~~~~1315/home/nerves/.nerves/artifacts/nerves_system_rpi5-2.1.2/staging/usr/include/bits/math-vector.h:258:1: warning: ‘aarch64_vector_pcs’ attribute directive ignored [-Wattributes]1316 258 | __vpcs __f64x2_t _ZGVnN2v_acospi (__f64x2_t);1317 | ^~~~~~1318/home/nerves/.nerves/artifacts/nerves_system_rpi5-2.1.2/staging/usr/include/bits/math-vector.h:259:1: warning: ‘aarch64_vector_pcs’ attribute directive ignored [-Wattributes]1319 259 | __vpcs __f64x2_t _ZGVnN2v_asin (__f64x2_t);1320 | ^~~~~~1321/home/nerves/.nerves/artifacts/nerves_system_rpi5-2.1.2/staging/usr/include/bits/math-vector.h:260:1: warning: ‘aarch64_vector_pcs’ attribute directive ignored [-Wattributes]1322 260 | __vpcs __f64x2_t _ZGVnN2v_asinh (__f64x2_t);1323 | ^~~~~~1324/home/nerves/.nerves/artifacts/nerves_system_rpi5-2.1.2/staging/usr/include/bits/math-vector.h:261:1: warning: ‘aarch64_vector_pcs’ attribute directive ignored [-Wattributes]1325 261 | __vpcs __f64x2_t _ZGVnN2v_asinpi (__f64x2_t);1326 | ^~~~~~1327/home/nerves/.nerves/artifacts/nerves_system_rpi5-2.1.2/staging/usr/include/bits/math-vector.h:262:1: warning: ‘aarch64_vector_pcs’ attribute directive ignored [-Wattributes]1328 262 | __vpcs __f64x2_t _ZGVnN2v_atan (__f64x2_t);1329 | ^~~~~~1330/home/nerves/.nerves/artifacts/nerves_system_rpi5-2.1.2/staging/usr/include/bits/math-vector.h:263:1: warning: ‘aarch64_vector_pcs’ attribute directive ignored [-Wattributes]1331 263 | __vpcs __f64x2_t _ZGVnN2v_atanh (__f64x2_t);1332 | ^~~~~~1333/home/nerves/.nerves/artifacts/nerves_system_rpi5-2.1.2/staging/usr/include/bits/math-vector.h:264:1: warning: ‘aarch64_vector_pcs’ attribute directive ignored [-Wattributes]1334 264 | __vpcs __f64x2_t _ZGVnN2v_atanpi (__f64x2_t);1335 | ^~~~~~1336/home/nerves/.nerves/artifacts/nerves_system_rpi5-2.1.2/staging/usr/include/bits/math-vector.h:265:1: warning: ‘aarch64_vector_pcs’ attribute directive ignored [-Wattributes]1337 265 | __vpcs __f64x2_t _ZGVnN2v_cbrt (__f64x2_t);1338 | ^~~~~~1339/home/nerves/.nerves/artifacts/nerves_system_rpi5-2.1.2/staging/usr/include/bits/math-vector.h:266:1: warning: ‘aarch64_vector_pcs’ attribute directive ignored [-Wattributes]1340 266 | __vpcs __f64x2_t _ZGVnN2v_cos (__f64x2_t);1341 | ^~~~~~1342/home/nerves/.nerves/artifacts/nerves_system_rpi5-2.1.2/staging/usr/include/bits/math-vector.h:267:1: warning: ‘aarch64_vector_pcs’ attribute directive ignored [-Wattributes]1343 267 | __vpcs __f64x2_t _ZGVnN2v_cosh (__f64x2_t);1344 | ^~~~~~1345/home/nerves/.nerves/artifacts/nerves_system_rpi5-2.1.2/staging/usr/include/bits/math-vector.h:268:1: warning: ‘aarch64_vector_pcs’ attribute directive ignored [-Wattributes]1346 268 | __vpcs __f64x2_t _ZGVnN2v_cospi (__f64x2_t);1347 | ^~~~~~1348/home/nerves/.nerves/artifacts/nerves_system_rpi5-2.1.2/staging/usr/include/bits/math-vector.h:269:1: warning: ‘aarch64_vector_pcs’ attribute directive ignored [-Wattributes]1349 269 | __vpcs __f64x2_t _ZGVnN2v_erf (__f64x2_t);1350 | ^~~~~~1351/home/nerves/.nerves/artifacts/nerves_system_rpi5-2.1.2/staging/usr/include/bits/math-vector.h:270:1: warning: ‘aarch64_vector_pcs’ attribute directive ignored [-Wattributes]1352 270 | __vpcs __f64x2_t _ZGVnN2v_erfc (__f64x2_t);1353 | ^~~~~~1354/home/nerves/.nerves/artifacts/nerves_system_rpi5-2.1.2/staging/usr/include/bits/math-vector.h:271:1: warning: ‘aarch64_vector_pcs’ attribute directive ignored [-Wattributes]1355 271 | __vpcs __f64x2_t _ZGVnN2v_exp (__f64x2_t);1356 | ^~~~~~1357/home/nerves/.nerves/artifacts/nerves_system_rpi5-2.1.2/staging/usr/include/bits/math-vector.h:272:1: warning: ‘aarch64_vector_pcs’ attribute directive ignored [-Wattributes]1358 272 | __vpcs __f64x2_t _ZGVnN2v_exp10 (__f64x2_t);1359 | ^~~~~~1360/home/nerves/.nerves/artifacts/nerves_system_rpi5-2.1.2/staging/usr/include/bits/math-vector.h:273:1: warning: ‘aarch64_vector_pcs’ attribute directive ignored [-Wattributes]1361 273 | __vpcs __f64x2_t _ZGVnN2v_exp2 (__f64x2_t);1362 | ^~~~~~1363/home/nerves/.nerves/artifacts/nerves_system_rpi5-2.1.2/staging/usr/include/bits/math-vector.h:274:1: warning: ‘aarch64_vector_pcs’ attribute directive ignored [-Wattributes]1364 274 | __vpcs __f64x2_t _ZGVnN2v_expm1 (__f64x2_t);1365 | ^~~~~~1366/home/nerves/.nerves/artifacts/nerves_system_rpi5-2.1.2/staging/usr/include/bits/math-vector.h:275:1: warning: ‘aarch64_vector_pcs’ attribute directive ignored [-Wattributes]1367 275 | __vpcs __f64x2_t _ZGVnN2v_exp2m1 (__f64x2_t);1368 | ^~~~~~1369/home/nerves/.nerves/artifacts/nerves_system_rpi5-2.1.2/staging/usr/include/bits/math-vector.h:276:1: warning: ‘aarch64_vector_pcs’ attribute directive ignored [-Wattributes]1370 276 | __vpcs __f64x2_t _ZGVnN2v_exp10m1 (__f64x2_t);1371 | ^~~~~~1372/home/nerves/.nerves/artifacts/nerves_system_rpi5-2.1.2/staging/usr/include/bits/math-vector.h:277:1: warning: ‘aarch64_vector_pcs’ attribute directive ignored [-Wattributes]1373 277 | __vpcs __f64x2_t _ZGVnN2vv_hypot (__f64x2_t, __f64x2_t);1374 | ^~~~~~1375/home/nerves/.nerves/artifacts/nerves_system_rpi5-2.1.2/staging/usr/include/bits/math-vector.h:278:1: warning: ‘aarch64_vector_pcs’ attribute directive ignored [-Wattributes]1376 278 | __vpcs __f64x2_t _ZGVnN2v_log (__f64x2_t);1377 | ^~~~~~1378/home/nerves/.nerves/artifacts/nerves_system_rpi5-2.1.2/staging/usr/include/bits/math-vector.h:279:1: warning: ‘aarch64_vector_pcs’ attribute directive ignored [-Wattributes]1379 279 | __vpcs __f64x2_t _ZGVnN2v_log10 (__f64x2_t);1380 | ^~~~~~1381/home/nerves/.nerves/artifacts/nerves_system_rpi5-2.1.2/staging/usr/include/bits/math-vector.h:280:1: warning: ‘aarch64_vector_pcs’ attribute directive ignored [-Wattributes]1382 280 | __vpcs __f64x2_t _ZGVnN2v_log10p1 (__f64x2_t);1383 | ^~~~~~1384/home/nerves/.nerves/artifacts/nerves_system_rpi5-2.1.2/staging/usr/include/bits/math-vector.h:281:1: warning: ‘aarch64_vector_pcs’ attribute directive ignored [-Wattributes]1385 281 | __vpcs __f64x2_t _ZGVnN2v_log1p (__f64x2_t);1386 | ^~~~~~1387/home/nerves/.nerves/artifacts/nerves_system_rpi5-2.1.2/staging/usr/include/bits/math-vector.h:282:1: warning: ‘aarch64_vector_pcs’ attribute directive ignored [-Wattributes]1388 282 | __vpcs __f64x2_t _ZGVnN2v_log2 (__f64x2_t);1389 | ^~~~~~1390/home/nerves/.nerves/artifacts/nerves_system_rpi5-2.1.2/staging/usr/include/bits/math-vector.h:283:1: warning: ‘aarch64_vector_pcs’ attribute directive ignored [-Wattributes]1391 283 | __vpcs __f64x2_t _ZGVnN2v_log2p1 (__f64x2_t);1392 | ^~~~~~1393/home/nerves/.nerves/artifacts/nerves_system_rpi5-2.1.2/staging/usr/include/bits/math-vector.h:284:1: warning: ‘aarch64_vector_pcs’ attribute directive ignored [-Wattributes]1394 284 | __vpcs __f64x2_t _ZGVnN2v_logp1 (__f64x2_t);1395 | ^~~~~~1396/home/nerves/.nerves/artifacts/nerves_system_rpi5-2.1.2/staging/usr/include/bits/math-vector.h:285:1: warning: ‘aarch64_vector_pcs’ attribute directive ignored [-Wattributes]1397 285 | __vpcs __f64x2_t _ZGVnN2vv_pow (__f64x2_t, __f64x2_t);1398 | ^~~~~~1399/home/nerves/.nerves/artifacts/nerves_system_rpi5-2.1.2/staging/usr/include/bits/math-vector.h:286:1: warning: ‘aarch64_vector_pcs’ attribute directive ignored [-Wattributes]1400 286 | __vpcs __f64x2_t _ZGVnN2v_rsqrt (__f64x2_t);1401 | ^~~~~~1402/home/nerves/.nerves/artifacts/nerves_system_rpi5-2.1.2/staging/usr/include/bits/math-vector.h:287:1: warning: ‘aarch64_vector_pcs’ attribute directive ignored [-Wattributes]1403 287 | __vpcs __f64x2_t _ZGVnN2v_sin (__f64x2_t);1404 | ^~~~~~1405/home/nerves/.nerves/artifacts/nerves_system_rpi5-2.1.2/staging/usr/include/bits/math-vector.h:288:1: warning: ‘aarch64_vector_pcs’ attribute directive ignored [-Wattributes]1406 288 | __vpcs __f64x2_t _ZGVnN2v_sinh (__f64x2_t);1407 | ^~~~~~1408/home/nerves/.nerves/artifacts/nerves_system_rpi5-2.1.2/staging/usr/include/bits/math-vector.h:289:1: warning: ‘aarch64_vector_pcs’ attribute directive ignored [-Wattributes]1409 289 | __vpcs __f64x2_t _ZGVnN2v_sinpi (__f64x2_t);1410 | ^~~~~~1411/home/nerves/.nerves/artifacts/nerves_system_rpi5-2.1.2/staging/usr/include/bits/math-vector.h:290:1: warning: ‘aarch64_vector_pcs’ attribute directive ignored [-Wattributes]1412 290 | __vpcs __f64x2_t _ZGVnN2v_tan (__f64x2_t);1413 | ^~~~~~1414/home/nerves/.nerves/artifacts/nerves_system_rpi5-2.1.2/staging/usr/include/bits/math-vector.h:291:1: warning: ‘aarch64_vector_pcs’ attribute directive ignored [-Wattributes]1415 291 | __vpcs __f64x2_t _ZGVnN2v_tanh (__f64x2_t);1416 | ^~~~~~1417/home/nerves/.nerves/artifacts/nerves_system_rpi5-2.1.2/staging/usr/include/bits/math-vector.h:292:1: warning: ‘aarch64_vector_pcs’ attribute directive ignored [-Wattributes]1418 292 | __vpcs __f64x2_t _ZGVnN2v_tanpi (__f64x2_t);1419 | ^~~~~~1420could not compile dependency :membrane_element_ffmpeg_h264, "mix compile" failed. Errors may have been logged above. You can recompile this dependency with "mix deps.compile membrane_element_ffmpeg_h264 --force", update it with "mix deps.update membrane_element_ffmpeg_h264" or clean it with "mix deps.clean membrane_element_ffmpeg_h264"1421==> nerves_compatibility_test1422** (Mix) Bundlex: Build script:14231424(mkdir -p "/work/proj/_build/rpi5/lib/membrane_element_ffmpeg_h264/priv/bundlex/nif/parser_obj") && \1425(gcc -fPIC -Wall -Wextra -c -std=c11 -O2 -g -DBUNDLEX_NIF -o "/work/proj/_build/rpi5/lib/membrane_element_ffmpeg_h264/priv/bundlex/nif/parser_obj/parser.c_E737148544810E1F002AE5DC1F990E617C20D443.o" -I"/work/proj/deps_rpi5/bunch_native/c_src/bunch" -I"/work/proj/deps_rpi5/bunch_native/c_src/bunch/nif" -I"/work/proj/deps_rpi5/shmex/c_src/shmex" -I"/work/proj/deps_rpi5/shmex/c_src/shmex/nif" -I"/work/proj/deps_rpi5/unifex/c_src/unifex/nif" -I"/usr/local/lib/erlang/usr/include" -I"/work/proj/deps_rpi5/membrane_element_ffmpeg_h264/c_src" -I/home/nerves/.nerves/artifacts/nerves_system_rpi5-2.1.2/staging/usr/include "/work/proj/deps_rpi5/membrane_element_ffmpeg_h264/c_src/membrane_element_ffmpeg_h264/_generated/nif/parser.c"1426) && \1427(gcc -fPIC -Wall -Wextra -c -std=c11 -O2 -g -DBUNDLEX_NIF -o "/work/proj/_build/rpi5/lib/membrane_element_ffmpeg_h264/priv/bundlex/nif/parser_obj/parser.c_0DB408832D15121899A757AC12DA1AAE558626E9.o" -I"/work/proj/deps_rpi5/bunch_native/c_src/bunch" -I"/work/proj/deps_rpi5/bunch_native/c_src/bunch/nif" -I"/work/proj/deps_rpi5/shmex/c_src/shmex" -I"/work/proj/deps_rpi5/shmex/c_src/shmex/nif" -I"/work/proj/deps_rpi5/unifex/c_src/unifex/nif" -I"/usr/local/lib/erlang/usr/include" -I"/work/proj/deps_rpi5/membrane_element_ffmpeg_h264/c_src" -I/home/nerves/.nerves/artifacts/nerves_system_rpi5-2.1.2/staging/usr/include "/work/proj/deps_rpi5/membrane_element_ffmpeg_h264/c_src/membrane_element_ffmpeg_h264/parser.c"1428) && \1429(gcc -rdynamic -shared -o "/work/proj/_build/rpi5/lib/membrane_element_ffmpeg_h264/priv/bundlex/nif/parser.so" -Wl,--whole-archive "/work/proj/_build/rpi5/lib/bunch_native/priv/bundlex/lib.a" "/work/proj/_build/rpi5/lib/shmex/priv/bundlex/lib.a" "/work/proj/_build/rpi5/lib/bunch_native/priv/bundlex/nif/bunch.a" "/work/proj/_build/rpi5/lib/shmex/priv/bundlex/nif/shmex.a" "/work/proj/_build/rpi5/lib/unifex/priv/bundlex/nif/unifex.a" -Wl,--no-whole-archive "/work/proj/_build/rpi5/lib/membrane_element_ffmpeg_h264/priv/bundlex/nif/parser_obj/parser.c_E737148544810E1F002AE5DC1F990E617C20D443.o" "/work/proj/_build/rpi5/lib/membrane_element_ffmpeg_h264/priv/bundlex/nif/parser_obj/parser.c_0DB408832D15121899A757AC12DA1AAE558626E9.o" -L/home/nerves/.nerves/artifacts/nerves_system_rpi5-2.1.2/staging/usr/lib -lavcodec -lavutil -lrt1430) && \1431(mkdir -p "/work/proj/_build/rpi5/lib/membrane_element_ffmpeg_h264/priv/bundlex/nif/decoder_obj") && \1432(gcc -fPIC -Wall -Wextra -c -std=c11 -O2 -g -DBUNDLEX_NIF -o "/work/proj/_build/rpi5/lib/membrane_element_ffmpeg_h264/priv/bundlex/nif/decoder_obj/decoder.c_0209C91839D49488974781AC994B0BA2F7B41EF5.o" -I"/work/proj/deps_rpi5/bunch_native/c_src/bunch" -I"/work/proj/deps_rpi5/bunch_native/c_src/bunch/nif" -I"/work/proj/deps_rpi5/shmex/c_src/shmex" -I"/work/proj/deps_rpi5/shmex/c_src/shmex/nif" -I"/work/proj/deps_rpi5/unifex/c_src/unifex/nif" -I"/usr/local/lib/erlang/usr/include" -I"/work/proj/deps_rpi5/membrane_element_ffmpeg_h264/c_src" -I/home/nerves/.nerves/artifacts/nerves_system_rpi5-2.1.2/staging/usr/include "/work/proj/deps_rpi5/membrane_element_ffmpeg_h264/c_src/membrane_element_ffmpeg_h264/_generated/nif/decoder.c"1433) && \1434(gcc -fPIC -Wall -Wextra -c -std=c11 -O2 -g -DBUNDLEX_NIF -o "/work/proj/_build/rpi5/lib/membrane_element_ffmpeg_h264/priv/bundlex/nif/decoder_obj/decoder.c_C08A5441339E63C8D0D08EF456431515AB667CA8.o" -I"/work/proj/deps_rpi5/bunch_native/c_src/bunch" -I"/work/proj/deps_rpi5/bunch_native/c_src/bunch/nif" -I"/work/proj/deps_rpi5/shmex/c_src/shmex" -I"/work/proj/deps_rpi5/shmex/c_src/shmex/nif" -I"/work/proj/deps_rpi5/unifex/c_src/unifex/nif" -I"/usr/local/lib/erlang/usr/include" -I"/work/proj/deps_rpi5/membrane_element_ffmpeg_h264/c_src" -I/home/nerves/.nerves/artifacts/nerves_system_rpi5-2.1.2/staging/usr/include "/work/proj/deps_rpi5/membrane_element_ffmpeg_h264/c_src/membrane_element_ffmpeg_h264/decoder.c"1435) && \1436(gcc -rdynamic -shared -o "/work/proj/_build/rpi5/lib/membrane_element_ffmpeg_h264/priv/bundlex/nif/decoder.so" -Wl,--whole-archive "/work/proj/_build/rpi5/lib/bunch_native/priv/bundlex/lib.a" "/work/proj/_build/rpi5/lib/shmex/priv/bundlex/lib.a" "/work/proj/_build/rpi5/lib/bunch_native/priv/bundlex/nif/bunch.a" "/work/proj/_build/rpi5/lib/shmex/priv/bundlex/nif/shmex.a" "/work/proj/_build/rpi5/lib/unifex/priv/bundlex/nif/unifex.a" -Wl,--no-whole-archive "/work/proj/_build/rpi5/lib/membrane_element_ffmpeg_h264/priv/bundlex/nif/decoder_obj/decoder.c_0209C91839D49488974781AC994B0BA2F7B41EF5.o" "/work/proj/_build/rpi5/lib/membrane_element_ffmpeg_h264/priv/bundlex/nif/decoder_obj/decoder.c_C08A5441339E63C8D0D08EF456431515AB667CA8.o" -L/home/nerves/.nerves/artifacts/nerves_system_rpi5-2.1.2/staging/usr/lib -lavcodec -lavutil -lrt1437) && \1438(mkdir -p "/work/proj/_build/rpi5/lib/membrane_element_ffmpeg_h264/priv/bundlex/nif/encoder_obj") && \1439(gcc -fPIC -Wall -Wextra -c -std=c11 -O2 -g -DBUNDLEX_NIF -o "/work/proj/_build/rpi5/lib/membrane_element_ffmpeg_h264/priv/bundlex/nif/encoder_obj/encoder.c_0955E382890106C93374A9AA7EDD328DB0DF826C.o" -I"/work/proj/deps_rpi5/bunch_native/c_src/bunch" -I"/work/proj/deps_rpi5/bunch_native/c_src/bunch/nif" -I"/work/proj/deps_rpi5/shmex/c_src/shmex" -I"/work/proj/deps_rpi5/shmex/c_src/shmex/nif" -I"/work/proj/deps_rpi5/unifex/c_src/unifex/nif" -I"/usr/local/lib/erlang/usr/include" -I"/work/proj/deps_rpi5/membrane_element_ffmpeg_h264/c_src" -I/home/nerves/.nerves/artifacts/nerves_system_rpi5-2.1.2/staging/usr/include "/work/proj/deps_rpi5/membrane_element_ffmpeg_h264/c_src/membrane_element_ffmpeg_h264/_generated/nif/encoder.c"1440) && \1441(gcc -fPIC -Wall -Wextra -c -std=c11 -O2 -g -DBUNDLEX_NIF -o "/work/proj/_build/rpi5/lib/membrane_element_ffmpeg_h264/priv/bundlex/nif/encoder_obj/encoder.c_4F2CA89A2AC426127BD5FBBE8E689B7ABC12AE64.o" -I"/work/proj/deps_rpi5/bunch_native/c_src/bunch" -I"/work/proj/deps_rpi5/bunch_native/c_src/bunch/nif" -I"/work/proj/deps_rpi5/shmex/c_src/shmex" -I"/work/proj/deps_rpi5/shmex/c_src/shmex/nif" -I"/work/proj/deps_rpi5/unifex/c_src/unifex/nif" -I"/usr/local/lib/erlang/usr/include" -I"/work/proj/deps_rpi5/membrane_element_ffmpeg_h264/c_src" -I/home/nerves/.nerves/artifacts/nerves_system_rpi5-2.1.2/staging/usr/include "/work/proj/deps_rpi5/membrane_element_ffmpeg_h264/c_src/membrane_element_ffmpeg_h264/encoder.c"1442) && \1443(gcc -rdynamic -shared -o "/work/proj/_build/rpi5/lib/membrane_element_ffmpeg_h264/priv/bundlex/nif/encoder.so" -Wl,--whole-archive "/work/proj/_build/rpi5/lib/bunch_native/priv/bundlex/lib.a" "/work/proj/_build/rpi5/lib/shmex/priv/bundlex/lib.a" "/work/proj/_build/rpi5/lib/bunch_native/priv/bundlex/nif/bunch.a" "/work/proj/_build/rpi5/lib/shmex/priv/bundlex/nif/shmex.a" "/work/proj/_build/rpi5/lib/unifex/priv/bundlex/nif/unifex.a" -Wl,--no-whole-archive "/work/proj/_build/rpi5/lib/membrane_element_ffmpeg_h264/priv/bundlex/nif/encoder_obj/encoder.c_0955E382890106C93374A9AA7EDD328DB0DF826C.o" "/work/proj/_build/rpi5/lib/membrane_element_ffmpeg_h264/priv/bundlex/nif/encoder_obj/encoder.c_4F2CA89A2AC426127BD5FBBE8E689B7ABC12AE64.o" -L/home/nerves/.nerves/artifacts/nerves_system_rpi5-2.1.2/staging/usr/lib -lavcodec -lavutil -lrt1444)144514461447returned non-zero code: 1