membrane_srt_plugin

Build log

nerves_system_qemu_aarch64

membrane_srt_plugin 0.2.3 · fail · run membrane_srt_plugin-0.2.3-1790997891145
862 of 862 lines
1Resolving Hex dependencies...2Resolution completed in 0.296s3Unchanged:4  bimap 1.3.05  bunch 1.6.46  bunch_native 0.5.27  bundlex 1.5.88  circular_buffer 1.1.09  coerce 1.0.210  crc 0.11.011  elixir_make 0.10.012  elixir_uuid 1.2.113  ex_libsrt 0.2.114  finch 0.24.015  heap 2.0.216  hpax 1.1.017  interactive_cmd 0.1.418  jason 1.4.519  membrane_aac_format 0.8.120  membrane_aac_plugin 0.19.421  membrane_core 1.3.422  membrane_h264_format 0.6.123  membrane_h265_format 0.2.024  membrane_h26x_plugin 0.10.925  membrane_mpeg_ts_plugin 1.3.426  membrane_mpegts_plugin 0.6.327  membrane_precompiled_dependency_provider 0.2.428  membrane_srt_plugin 0.2.329  membrane_timestamp_queue 0.2.330  mime 2.0.731  mint 1.11.032  mpeg_ts 2.2.033  nerves 2.0.0-pre.234  nerves_discovery 0.1.535  nerves_logging 0.2.436  nerves_runtime 0.13.1337  nerves_system_bbb 2.30.238  nerves_system_br 1.34.439  nerves_system_mangopi_mq_pro 0.17.240  nerves_system_qemu_aarch64 0.4.241  nerves_system_rpi0 2.1.242  nerves_system_rpi4 2.1.243  nerves_system_rpi5 2.1.244  nerves_system_trellis 0.5.045  nerves_system_x86_64 1.34.246  nerves_toolchain_aarch64_nerves_linux_gnu 15.3.147  nerves_toolchain_armv6_nerves_linux_gnueabihf 15.3.148  nerves_toolchain_armv7_nerves_linux_gnueabihf 15.3.149  nerves_toolchain_riscv64_nerves_linux_gnu 15.3.150  nerves_toolchain_x86_64_nerves_linux_musl 15.3.151  nerves_uevent 0.1.752  nimble_options 1.1.153  nimble_pool 1.1.054  numbers 5.2.555  property_table 0.3.456  qex 0.5.257  ratio 4.0.158  req 0.7.459  ring_logger 0.11.760  shmex 0.5.261  tablet 0.3.362  telemetry 1.4.263  toolshed 0.5.064  uboot_env 1.0.265  unifex 1.2.566  zarex 1.0.667* Getting membrane_srt_plugin (Hex package)68* Getting nerves (Hex package)69* Getting ring_logger (Hex package)70* Getting toolshed (Hex package)71* Getting nerves_runtime (Hex package)72* Getting nerves_system_bbb (Hex package)73* Getting nerves_system_mangopi_mq_pro (Hex package)74* Getting nerves_system_qemu_aarch64 (Hex package)75* Getting nerves_system_rpi0 (Hex package)76* Getting nerves_system_rpi4 (Hex package)77* Getting nerves_system_rpi5 (Hex package)78* Getting nerves_system_trellis (Hex package)79* Getting nerves_system_x86_64 (Hex package)80* Getting nerves_system_br (Hex package)81* Getting nerves_toolchain_x86_64_nerves_linux_musl (Hex package)82* Getting nerves_toolchain_armv7_nerves_linux_gnueabihf (Hex package)83* Getting nerves_toolchain_aarch64_nerves_linux_gnu (Hex package)84* Getting nerves_toolchain_armv6_nerves_linux_gnueabihf (Hex package)85* Getting nerves_toolchain_riscv64_nerves_linux_gnu (Hex package)86* Getting nerves_logging (Hex package)87* Getting nerves_uevent (Hex package)88* Getting uboot_env (Hex package)89* Getting elixir_make (Hex package)90* Getting property_table (Hex package)91* Getting circular_buffer (Hex package)92* Getting interactive_cmd (Hex package)93* Getting nerves_discovery (Hex package)94* Getting tablet (Hex package)95* Getting ex_libsrt (Hex package)96* Getting membrane_core (Hex package)97* Getting membrane_mpeg_ts_plugin (Hex package)98* Getting membrane_mpegts_plugin (Hex package)99* Getting crc (Hex package)100* Getting membrane_aac_plugin (Hex package)101* Getting membrane_h26x_plugin (Hex package)102* Getting membrane_timestamp_queue (Hex package)103* Getting heap (Hex package)104* Getting bunch (Hex package)105* Getting membrane_h264_format (Hex package)106* Getting membrane_h265_format (Hex package)107* Getting membrane_aac_format (Hex package)108* Getting bimap (Hex package)109* Getting mpeg_ts (Hex package)110* Getting qex (Hex package)111* Getting ratio (Hex package)112* Getting telemetry (Hex package)113* Getting numbers (Hex package)114* Getting coerce (Hex package)115* Getting membrane_precompiled_dependency_provider (Hex package)116* Getting unifex (Hex package)117* Getting bundlex (Hex package)118* Getting shmex (Hex package)119* Getting bunch_native (Hex package)120* Getting elixir_uuid (Hex package)121* Getting jason (Hex package)122* Getting req (Hex package)123* Getting zarex (Hex package)124* Getting finch (Hex package)125* Getting mime (Hex package)126* Getting mint (Hex package)127* Getting nimble_options (Hex package)128* Getting nimble_pool (Hex package)129* Getting hpax (Hex package)130==> nerves_system_br131Generated nerves_system_br app132==> mime133Compiling 1 file (.ex)134Generated mime app135==> circular_buffer136Compiling 1 file (.ex)137Generated circular_buffer app138==> nimble_options139Compiling 3 files (.ex)140Generated nimble_options app141==> jason142Compiling 10 files (.ex)143Generated jason app144 C      crc_8.c145 C      checksum_xor.c146 C      crc_algorithm.c147 C      crc_model.c148 C      crc_nif.c149 C      crc_resource.c150 C      xnif_slice.c151 LD     crc_nif.so152==> crc153Compiling 7 files (.erl)154Compiling 3 files (.ex)155Generated crc app156==> hpax157Compiling 4 files (.ex)158Generated hpax app159==> mint160Compiling 1 file (.erl)161Compiling 21 files (.ex)162Generated mint app163==> coerce164Compiling 3 files (.ex)165Generated coerce app166==> bunch167Compiling 19 files (.ex)168Generated bunch app169==> mpeg_ts170Compiling 11 files (.ex)171    warning: the variable "content_length" is accessed inside size(...) of a bitstring but it was defined outside of the match. You must precede it with the pin operator172    │173 38 │         <<raw_data::binary-size(content_length), _crc::@crc_length-binary, _::binary>> ->174    │                                 ~175    │176    └─ lib/mpeg/ts/psi.ex:38:33: MPEG.TS.PSI.unmarshal/2177178     warning: the variable "leader" is accessed inside size(...) of a bitstring but it was defined outside of the match. You must precede it with the pin operator179     │180 126 │           <<payload::binary-size(leader.length)-unit(8), _rest::binary>> = payload181     │                                  ~182     │183     └─ lib/mpeg/ts/stream_queue.ex:126:34: MPEG.TS.StreamQueue.depayload/1184185    warning: the variable "program_info_length" is accessed inside size(...) of a bitstring but it was defined outside of the match. You must precede it with the pin operator186    │187 73 │     <<_program_descriptors::binary-size(program_info_length), rest::binary>> = data188    │                                         ~189    │190    └─ lib/mpeg/ts/pmt.ex:73:41: MPEG.TS.PMT.parse_program_info/2191192    warning: unused require Logger193    │194 22 │   require Logger195    │   ~196    │197    └─ lib/mpeg/ts/partial_pes.ex:22:3198199    warning: a struct for MPEG.TS.Demuxer is expected on struct update:200201        %MPEG.TS.Demuxer{state | buffered_bytes: <<>>}202203    but got type:204205        dynamic(%{..., buffered_bytes: binary()})206207    where "state" was given the type:208209        # type: dynamic(%{..., buffered_bytes: binary()})210        # from: lib/mpeg/ts/demuxer.ex:34211        <<state.buffered_bytes::binary, ...>>212213    when defining the variable "state", you must also pattern match on "%MPEG.TS.Demuxer{}"214215    type warning found at:216    │217 41 │     state = push_packets(%__MODULE__{state | buffered_bytes: <<>>}, ok)218    │                          ~219    │220    └─ lib/mpeg/ts/demuxer.ex:41:26: MPEG.TS.Demuxer.push_buffer/3221222     warning: a struct for MPEG.TS.Demuxer is expected on struct update:223224         %MPEG.TS.Demuxer{state | pmt: pmt}225226     but got type:227228         dynamic()229230     where "state" was given the type:231232         # type: dynamic()233         # from: lib/mpeg/ts/demuxer.ex:113:25234         state235236     when defining the variable "state", you must also pattern match on "%MPEG.TS.Demuxer{}"237238     type warning found at:239     │240 129 │     %__MODULE__{state | pmt: pmt}241     │     ~242     │243     └─ lib/mpeg/ts/demuxer.ex:129:5: MPEG.TS.Demuxer.push_pmt_packets/2244245Generated mpeg_ts app246==> tablet247Compiling 2 files (.ex)248Generated tablet app249==> zarex250Compiling 1 file (.ex)251Generated zarex app252==> numbers253Compiling 7 files (.ex)254Generated numbers app255==> elixir_make256Compiling 8 files (.ex)257Generated elixir_make app258==> nerves_logging259 CC kmsg_tailer.o260 LD kmsg_tailer261Compiling 5 files (.ex)262Generated nerves_logging app263==> ratio264Compiling 5 files (.ex)265Generated ratio app266==> elixir_uuid267Compiling 1 file (.ex)268    warning: use Bitwise is deprecated. import Bitwise instead269    │270  2 │   use Bitwise, only_operators: true271    │   ~~~~~~~~~~~~~~~~~~~~~~~~~~~~~~~~~272    │273    └─ lib/uuid.ex:2: UUID (module)274275Generated elixir_uuid app276==> nerves_discovery277Compiling 5 files (.ex)278Generated nerves_discovery app279==> ring_logger280Compiling 7 files (.ex)281Generated ring_logger app282==> interactive_cmd283Compiling 1 file (.ex)284Generated interactive_cmd app285==> nerves286Compiling 65 files (.ex)287    warning: redefining module Mix.Tasks.Nerves.Init (current version loaded from /work/proj/_build/qemu_aarch64/lib/nerves/ebin/Elixir.Mix.Tasks.Nerves.Init.beam)288    │289  6 │ defmodule Mix.Tasks.Nerves.Init do290    │ ~~~~~~~~~~~~~~~~~~~~~~~~~~~~~~~~~~291    │292    └─ lib/mix/tasks/nerves.init.ex:6: Mix.Tasks.Nerves.Init (module)293294    warning: redefining module Nerves (current version loaded from /work/proj/_build/qemu_aarch64/lib/nerves/ebin/Elixir.Nerves.beam)295    │296  6 │ defmodule Nerves do297    │ ~~~~~~~~~~~~~~~~~~~298    │299    └─ lib/nerves.ex:6: Nerves (module)300301    warning: redefining module Nerves.ArtifactResolver (current version loaded from /work/proj/_build/qemu_aarch64/lib/nerves/ebin/Elixir.Nerves.ArtifactResolver.beam)302    │303  5 │ defmodule Nerves.ArtifactResolver do304    │ ~~~~~~~~~~~~~~~~~~~~~~~~~~~~~~~~~~~~305    │306    └─ lib/nerves/artifact_resolver.ex:5: Nerves.ArtifactResolver (module)307308    warning: redefining module Nerves.BuildAction.AppModes (current version loaded from /work/proj/_build/qemu_aarch64/lib/nerves/ebin/Elixir.Nerves.BuildAction.AppModes.beam)309    │310  6 │ defmodule Nerves.BuildAction.AppModes do311    │ ~~~~~~~~~~~~~~~~~~~~~~~~~~~~~~~~~~~~~~~~312    │313    └─ lib/nerves/build_action/app_modes.ex:6: Nerves.BuildAction.AppModes (module)314315    warning: redefining module Nerves.BuildAction.CheckExecutables (current version loaded from /work/proj/_build/qemu_aarch64/lib/nerves/ebin/Elixir.Nerves.BuildAction.CheckExecutables.beam)316    │317  5 │ defmodule Nerves.BuildAction.CheckExecutables do318    │ ~~~~~~~~~~~~~~~~~~~~~~~~~~~~~~~~~~~~~~~~~~~~~~~~319    │320    └─ lib/nerves/build_action/check_executables.ex:5: Nerves.BuildAction.CheckExecutables (module)321322    warning: redefining module Nerves.BuildAction.Erlinit (current version loaded from /work/proj/_build/qemu_aarch64/lib/nerves/ebin/Elixir.Nerves.BuildAction.Erlinit.beam)323    │324  8 │ defmodule Nerves.BuildAction.Erlinit do325    │ ~~~~~~~~~~~~~~~~~~~~~~~~~~~~~~~~~~~~~~~326    │327    └─ lib/nerves/build_action/erlinit.ex:8: Nerves.BuildAction.Erlinit (module)328329    warning: redefining module Nerves.BuildAction.Firmware (current version loaded from /work/proj/_build/qemu_aarch64/lib/nerves/ebin/Elixir.Nerves.BuildAction.Firmware.beam)330    │331  5 │ defmodule Nerves.BuildAction.Firmware do332    │ ~~~~~~~~~~~~~~~~~~~~~~~~~~~~~~~~~~~~~~~~333    │334    └─ lib/nerves/build_action/firmware.ex:5: Nerves.BuildAction.Firmware (module)335336    warning: redefining module Nerves.BuildAction.IExStartupCheck (current version loaded from /work/proj/_build/qemu_aarch64/lib/nerves/ebin/Elixir.Nerves.BuildAction.IExStartupCheck.beam)337    │338  7 │ defmodule Nerves.BuildAction.IExStartupCheck do339    │ ~~~~~~~~~~~~~~~~~~~~~~~~~~~~~~~~~~~~~~~~~~~~~~~340    │341    └─ lib/nerves/build_action/iex_startup_check.ex:7: Nerves.BuildAction.IExStartupCheck (module)342343    warning: redefining module Nerves.BuildAction.NervesV1System (current version loaded from /work/proj/_build/qemu_aarch64/lib/nerves/ebin/Elixir.Nerves.BuildAction.NervesV1System.beam)344    │345  5 │ defmodule Nerves.BuildAction.NervesV1System do346    │ ~~~~~~~~~~~~~~~~~~~~~~~~~~~~~~~~~~~~~~~~~~~~~~347    │348    └─ lib/nerves/build_action/nerves_v1_system.ex:5: Nerves.BuildAction.NervesV1System (module)349350    warning: redefining module Nerves.BuildAction.NervesV1Toolchain (current version loaded from /work/proj/_build/qemu_aarch64/lib/nerves/ebin/Elixir.Nerves.BuildAction.NervesV1Toolchain.beam)351    │352  5 │ defmodule Nerves.BuildAction.NervesV1Toolchain do353    │ ~~~~~~~~~~~~~~~~~~~~~~~~~~~~~~~~~~~~~~~~~~~~~~~~~354    │355    └─ lib/nerves/build_action/nerves_v1_toolchain.ex:5: Nerves.BuildAction.NervesV1Toolchain (module)356357    warning: redefining module Nerves.BuildAction.Rootfs (current version loaded from /work/proj/_build/qemu_aarch64/lib/nerves/ebin/Elixir.Nerves.BuildAction.Rootfs.beam)358    │359  5 │ defmodule Nerves.BuildAction.Rootfs do360    │ ~~~~~~~~~~~~~~~~~~~~~~~~~~~~~~~~~~~~~~361    │362    └─ lib/nerves/build_action/rootfs.ex:5: Nerves.BuildAction.Rootfs (module)363364    warning: redefining module Nerves.BuildAction.SortApps (current version loaded from /work/proj/_build/qemu_aarch64/lib/nerves/ebin/Elixir.Nerves.BuildAction.SortApps.beam)365    │366  6 │ defmodule Nerves.BuildAction.SortApps do367    │ ~~~~~~~~~~~~~~~~~~~~~~~~~~~~~~~~~~~~~~~~368    │369    └─ lib/nerves/build_action/sort_apps.ex:6: Nerves.BuildAction.SortApps (module)370371    warning: redefining module Nerves.BuildAction.StripAll (current version loaded from /work/proj/_build/qemu_aarch64/lib/nerves/ebin/Elixir.Nerves.BuildAction.StripAll.beam)372    │373  5 │ defmodule Nerves.BuildAction.StripAll do374    │ ~~~~~~~~~~~~~~~~~~~~~~~~~~~~~~~~~~~~~~~~375    │376    └─ lib/nerves/build_action/strip_all.ex:5: Nerves.BuildAction.StripAll (module)377378    warning: redefining module Nerves.BuildAction.Trimmer (current version loaded from /work/proj/_build/qemu_aarch64/lib/nerves/ebin/Elixir.Nerves.BuildAction.Trimmer.beam)379    │380  5 │ defmodule Nerves.BuildAction.Trimmer do381    │ ~~~~~~~~~~~~~~~~~~~~~~~~~~~~~~~~~~~~~~~382    │383    └─ lib/nerves/build_action/trimmer.ex:5: Nerves.BuildAction.Trimmer (module)384385    warning: redefining module Nerves.BuildPlan (current version loaded from /work/proj/_build/qemu_aarch64/lib/nerves/ebin/Elixir.Nerves.BuildPlan.beam)386    │387  5 │ defmodule Nerves.BuildPlan do388    │ ~~~~~~~~~~~~~~~~~~~~~~~~~~~~~389    │390    └─ lib/nerves/build_plan.ex:5: Nerves.BuildPlan (module)391392    warning: redefining module Nerves.BuildPlan.Checks (current version loaded from /work/proj/_build/qemu_aarch64/lib/nerves/ebin/Elixir.Nerves.BuildPlan.Checks.beam)393    │394  5 │ defmodule Nerves.BuildPlan.Checks do395    │ ~~~~~~~~~~~~~~~~~~~~~~~~~~~~~~~~~~~~396    │397    └─ lib/nerves/build_plan/checks.ex:5: Nerves.BuildPlan.Checks (module)398399    warning: redefining module Nerves.Container (current version loaded from /work/proj/_build/qemu_aarch64/lib/nerves/ebin/Elixir.Nerves.Container.beam)400    │401  6 │ defmodule Nerves.Container do402    │ ~~~~~~~~~~~~~~~~~~~~~~~~~~~~~403    │404    └─ lib/nerves/container.ex:6: Nerves.Container (module)405406    warning: redefining module Nerves.Fingerprint (current version loaded from /work/proj/_build/qemu_aarch64/lib/nerves/ebin/Elixir.Nerves.Fingerprint.beam)407    │408  5 │ defmodule Nerves.Fingerprint do409    │ ~~~~~~~~~~~~~~~~~~~~~~~~~~~~~~~410    │411    └─ lib/nerves/fingerprint.ex:5: Nerves.Fingerprint (module)412413    warning: redefining module Nerves.MixPackage (current version loaded from /work/proj/_build/qemu_aarch64/lib/nerves/ebin/Elixir.Nerves.MixPackage.beam)414    │415  5 │ defmodule Nerves.MixPackage do416    │ ~~~~~~~~~~~~~~~~~~~~~~~~~~~~~~417    │418    └─ lib/nerves/mix_package.ex:5: Nerves.MixPackage (module)419420    warning: redefining module Nerves.Paths (current version loaded from /work/proj/_build/qemu_aarch64/lib/nerves/ebin/Elixir.Nerves.Paths.beam)421    │422  5 │ defmodule Nerves.Paths do423    │ ~~~~~~~~~~~~~~~~~~~~~~~~~424    │425    └─ lib/nerves/paths.ex:5: Nerves.Paths (module)426427    warning: redefining module Nerves.TargetTuple (current version loaded from /work/proj/_build/qemu_aarch64/lib/nerves/ebin/Elixir.Nerves.TargetTuple.beam)428    │429  5 │ defmodule Nerves.TargetTuple do430    │ ~~~~~~~~~~~~~~~~~~~~~~~~~~~~~~~431    │432    └─ lib/nerves/target_tuple.ex:5: Nerves.TargetTuple (module)433434Generated nerves app435==> nerves_toolchain_aarch64_nerves_linux_gnu436Compiling 1 file (.ex)437Generated nerves_toolchain_aarch64_nerves_linux_gnu app438==> nerves_system_qemu_aarch64439Compiling 1 file (.ex)440Generated nerves_system_qemu_aarch64 app441==> nerves_compatibility_test442===> Analyzing applications...443===> Compiling telemetry444==> membrane_h265_format445Compiling 1 file (.ex)446Generated membrane_h265_format app447==> membrane_h264_format448Compiling 1 file (.ex)449Generated membrane_h264_format app450==> heap451Compiling 4 files (.ex)452Generated heap app453==> bimap454Compiling 2 files (.ex)455Generated bimap app456==> membrane_aac_format457Compiling 1 file (.ex)458Generated membrane_aac_format app459==> uboot_env460Compiling 5 files (.ex)461Generated uboot_env app462==> qex463Compiling 4 files (.ex)464warning: x..y inside match is deprecated, you must always match on the step: x..y//var or x..y//_ if you want to ignore it465  lib/qex.ex:45: Qex.new/1466467Generated qex app468==> membrane_core469Compiling 143 files (.ex)470Generated membrane_core app471==> membrane_mpeg_ts_plugin472Compiling 4 files (.ex)473     warning: the variable "min_size" is accessed inside size(...) of a bitstring but it was defined outside of the match. You must precede it with the pin operator474     │475 409 │         <<payload::binary-size(min_size)-unit(8), rest::binary>> = payload476     │                                ~477     │478     └─ lib/membrane/mpeg/ts/muxer.ex:409:32: Membrane.MPEG.TS.Muxer.do_marshal_ts/5479480     warning: the variable "size" is accessed inside size(...) of a bitstring but it was defined outside of the match. You must precede it with the pin operator481     │482 470 │           <<payload::binary-size(size)-unit(8), rest::binary>> = payload483     │                                  ~484     │485     └─ lib/membrane/mpeg/ts/muxer.ex:470:34: Membrane.MPEG.TS.Muxer.do_marshal_ts/5486487     warning: a struct for MPEG.TS.Demuxer is expected on struct update:488489         %MPEG.TS.Demuxer{state.demuxer | packet_filter: &Enum.__in__(&1, followed_stream_ids)}490491     but got type:492493         dynamic()494495     where "state" was given the type:496497         # type: dynamic(%{..., demuxer: term()})498         # from: lib/membrane/mpeg/ts/demuxer.ex:165:15499         %MPEG.TS.Demuxer{...}500501     you must assign "state.demuxer" to variable and pattern match on "%MPEG.TS.Demuxer{}"502503     type warning found at:504     │505 165 │     demuxer = %TS.Demuxer{state.demuxer | packet_filter: &(&1 in followed_stream_ids)}506     │               ~507     │508     └─ lib/membrane/mpeg/ts/demuxer.ex:165:15: Membrane.MPEG.TS.Demuxer.handle_info/3509510Generated membrane_mpeg_ts_plugin app511==> membrane_aac_plugin512Compiling 6 files (.ex)513    warning: the variable "size" is accessed inside size(...) of a bitstring but it was defined outside of the match. You must precede it with the pin operator514    │515 89 │       <<frame::binary-size(size), rest::binary>> -> {:frame, frame, rest}516    │                            ~517    │518    └─ lib/membrane/aac/parser/adts.ex:89:28: Membrane.AAC.Parser.ADTS.extract_frame/4519520    warning: the variable "adts_size" is accessed inside size(...) of a bitstring but it was defined outside of the match. You must precede it with the pin operator521    │522 98 │       <<_adts::binary-size(adts_size), frame::binary-size(frame_size), rest::binary>> ->523    │                            ~524    │525    └─ lib/membrane/aac/parser/adts.ex:98:28: Membrane.AAC.Parser.ADTS.extract_frame/4526527    warning: the variable "frame_size" is accessed inside size(...) of a bitstring but it was defined outside of the match. You must precede it with the pin operator528    │529 98 │       <<_adts::binary-size(adts_size), frame::binary-size(frame_size), rest::binary>> ->530    │                                                           ~531    │532    └─ lib/membrane/aac/parser/adts.ex:98:59: Membrane.AAC.Parser.ADTS.extract_frame/4533534    warning: the variable "custom_frequency_length" is accessed inside size(...) of a bitstring but it was defined outside of the match. You must precede it with the pin operator535    │536 32 │     <<custom_frequency::integer-size(custom_frequency_length), channel_config_id::4,537    │                                      ~538    │539    └─ lib/membrane/aac/parser/audio_specific_config.ex:32:38: Membrane.AAC.Parser.AudioSpecificConfig.parse_audio_specific_config/1540541    warning: the variable "url_length" is accessed inside size(...) of a bitstring but it was defined outside of the match. You must precede it with the pin operator542    │543 58 │         <<_url::binary-size(url_length), rest::binary>> = rest544    │                             ~545    │546    └─ lib/membrane/aac/parser/esds.ex:58:29: Membrane.AAC.Parser.Esds.parse_esds/1547548    warning: the variable "payload_size" is accessed inside size(...) of a bitstring but it was defined outside of the match. You must precede it with the pin operator549    │550 93 │         <<payload::binary-size(payload_size), rest::binary>> = rest551    │                                ~552    │553    └─ lib/membrane/aac/parser/esds.ex:93:32: Membrane.AAC.Parser.Esds.unpack_esds_section/2554555    warning: the variable "payload_size" is accessed inside size(...) of a bitstring but it was defined outside of the match. You must precede it with the pin operator556    │557 97 │         <<payload::binary-size(payload_size), rest::binary>> = rest558    │                                ~559    │560    └─ lib/membrane/aac/parser/esds.ex:97:32: Membrane.AAC.Parser.Esds.unpack_esds_section/2561562Generated membrane_aac_plugin app563==> membrane_h26x_plugin564Compiling 31 files (.ex)565Generated membrane_h26x_plugin app566==> membrane_timestamp_queue567Compiling 1 file (.ex)568Generated membrane_timestamp_queue app569==> membrane_mpegts_plugin570Compiling 8 files (.ex)571Generated membrane_mpegts_plugin app572==> nimble_pool573Compiling 2 files (.ex)574Generated nimble_pool app575==> finch576Compiling 23 files (.ex)577Generated finch app578==> req579Compiling 24 files (.ex)580Generated req app581==> bundlex582Compiling 39 files (.ex)583    warning: the following clause will never match:584585        :custom ->586587    because it attempts to match on the result of:588589        Bundlex.Platform.get_target!()590591    which has type:592593        dynamic(:nerves)594595    type warning found at:596    │597 82 │       :custom -> :nerves598    │       ~~~~~~~~~~~~~~~~~~599    │600    └─ lib/bundlex.ex:82: Bundlex.platform/0601602Generated bundlex app603==> membrane_precompiled_dependency_provider604Compiling 1 file (.ex)605Generated membrane_precompiled_dependency_provider app606==> bunch_native607Bundlex: Building natives: lib, bunch608Generated bunch_native app609==> shmex610Bundlex: Building natives: lib, shmex611Compiling 2 files (.ex)612Generated shmex app613==> unifex614Bundlex: Building natives: unifex615/work/proj/deps_qemu_aarch64/unifex/c_src/unifex/cnode/unifex/cnode.c: In function 'unifex_cnode_init':616/work/proj/deps_qemu_aarch64/unifex/c_src/unifex/cnode/unifex/cnode.c:172:49: warning: 'calloc' sizes specified with 'sizeof' in the earlier argument and not in the later argument [-Wcalloc-transposed-args]617  172 |   *env = (UnifexEnv){.node_name = calloc(sizeof(char), 256),618      |                                                 ^~~~619/work/proj/deps_qemu_aarch64/unifex/c_src/unifex/cnode/unifex/cnode.c:172:49: note: earlier argument should specify number of elements, later size of each element620Compiling 33 files (.ex)621    warning: unused require Bundlex.CNode622    │623  6 │   require Bundlex.CNode624    │   ~625    │626    └─ lib/unifex/cnode.ex:6:3627628Generated unifex app629==> ex_libsrt630Bundlex: Building natives: srt_nif63163203:31:35.735 [debug] redirecting to https://release-assets.githubusercontent.com/github-production-release-asset/984224907/bfcbbe57-2442-42cb-bfdb-681a4d141322?sp=r&sv=2018-11-09&sr=b&spr=https&se=2026-10-03T04%3A12%3A58Z&rscd=attachment%3B+filename%3Dsrt_linux_arm.tar.gz&rsct=application%2Foctet-stream&skoid=96c2d410-5711-43a1-aedd-ab1947aa7ab0&sktid=398a6654-997b-47e9-b12b-9515b896b4de&skt=2026-10-03T03%3A12%3A55Z&ske=2026-10-03T04%3A12%3A58Z&sks=b&skv=2018-11-09&sig=o0JY3ahzD2IFM%2FArWtKgNc72A2RzEetVBkoHPBTWQic%3D&jwt=eyJ0eXAiOiJKV1QiLCJhbGciOiJIUzI1NiJ9.eyJpc3MiOiJnaXRodWIuY29tIiwiYXVkIjoicmVsZWFzZS1hc3NldHMuZ2l0aHVidXNlcmNvbnRlbnQuY29tIiwia2V5Ijoia2V5MSIsImV4cCI6MTc5MDk5ODU5NSwibmJmIjoxNzkwOTk4Mjk1LCJwYXRoIjoicmVsZWFzZWFzc2V0cHJvZHVjdGlvbi5ibG9iLmNvcmUud2luZG93cy5uZXQifQ.cj_n0oztjvFh0WLlnjfeTc-gQjY1Nqg18CAGK6f9ncA&response-content-disposition=attachment%3B%20filename%3Dsrt_linux_arm.tar.gz&response-content-type=application%2Foctet-stream633Bundlex: Successfully downloaded precompiled srt build from https://github.com/membraneframework-precompiled/precompiled_srt/releases/download/v1.5.4/srt_linux_arm.tar.gz634In file included from /work/proj/deps_qemu_aarch64/ex_libsrt/c_src/ex_libsrt/server/server.h:3,635                 from /work/proj/deps_qemu_aarch64/ex_libsrt/c_src/ex_libsrt/server/server.cpp:1:636/work/proj/deps_qemu_aarch64/ex_libsrt/c_src/ex_libsrt/server/../common/srt_socket_stats.h:6:3: error: 'int64_t' does not name a type637    6 |   int64_t msTimeStamp;638      |   ^~~~~~~639/work/proj/deps_qemu_aarch64/ex_libsrt/c_src/ex_libsrt/server/../common/srt_socket_stats.h:4:1: note: 'int64_t' is defined in header '<cstdint>'; this is probably fixable by adding '#include <cstdint>'640    3 | #include <memory>641  +++ |+#include <cstdint>642    4 | 643/work/proj/deps_qemu_aarch64/ex_libsrt/c_src/ex_libsrt/server/../common/srt_socket_stats.h:7:3: error: 'int64_t' does not name a type644    7 |   int64_t pktSentTotal;645      |   ^~~~~~~646/work/proj/deps_qemu_aarch64/ex_libsrt/c_src/ex_libsrt/server/../common/srt_socket_stats.h:7:3: note: 'int64_t' is defined in header '<cstdint>'; this is probably fixable by adding '#include <cstdint>'647/work/proj/deps_qemu_aarch64/ex_libsrt/c_src/ex_libsrt/server/../common/srt_socket_stats.h:8:3: error: 'int64_t' does not name a type648    8 |   int64_t pktRecvTotal;649      |   ^~~~~~~650/work/proj/deps_qemu_aarch64/ex_libsrt/c_src/ex_libsrt/server/../common/srt_socket_stats.h:8:3: note: 'int64_t' is defined in header '<cstdint>'; this is probably fixable by adding '#include <cstdint>'651/work/proj/deps_qemu_aarch64/ex_libsrt/c_src/ex_libsrt/server/../common/srt_socket_stats.h:9:3: error: 'int64_t' does not name a type652    9 |   int64_t pktSentUniqueTotal;653      |   ^~~~~~~654/work/proj/deps_qemu_aarch64/ex_libsrt/c_src/ex_libsrt/server/../common/srt_socket_stats.h:9:3: note: 'int64_t' is defined in header '<cstdint>'; this is probably fixable by adding '#include <cstdint>'655/work/proj/deps_qemu_aarch64/ex_libsrt/c_src/ex_libsrt/server/../common/srt_socket_stats.h:10:3: error: 'int64_t' does not name a type656   10 |   int64_t pktRecvUniqueTotal;657      |   ^~~~~~~658/work/proj/deps_qemu_aarch64/ex_libsrt/c_src/ex_libsrt/server/../common/srt_socket_stats.h:10:3: note: 'int64_t' is defined in header '<cstdint>'; this is probably fixable by adding '#include <cstdint>'659/work/proj/deps_qemu_aarch64/ex_libsrt/c_src/ex_libsrt/server/../common/srt_socket_stats.h:11:3: error: 'int32_t' does not name a type660   11 |   int32_t pktSndLossTotal;661      |   ^~~~~~~662/work/proj/deps_qemu_aarch64/ex_libsrt/c_src/ex_libsrt/server/../common/srt_socket_stats.h:11:3: note: 'int32_t' is defined in header '<cstdint>'; this is probably fixable by adding '#include <cstdint>'663/work/proj/deps_qemu_aarch64/ex_libsrt/c_src/ex_libsrt/server/../common/srt_socket_stats.h:12:3: error: 'int32_t' does not name a type664   12 |   int32_t pktRcvLossTotal;665      |   ^~~~~~~666/work/proj/deps_qemu_aarch64/ex_libsrt/c_src/ex_libsrt/server/../common/srt_socket_stats.h:12:3: note: 'int32_t' is defined in header '<cstdint>'; this is probably fixable by adding '#include <cstdint>'667/work/proj/deps_qemu_aarch64/ex_libsrt/c_src/ex_libsrt/server/../common/srt_socket_stats.h:13:3: error: 'int32_t' does not name a type668   13 |   int32_t pktRetransTotal;669      |   ^~~~~~~670/work/proj/deps_qemu_aarch64/ex_libsrt/c_src/ex_libsrt/server/../common/srt_socket_stats.h:13:3: note: 'int32_t' is defined in header '<cstdint>'; this is probably fixable by adding '#include <cstdint>'671/work/proj/deps_qemu_aarch64/ex_libsrt/c_src/ex_libsrt/server/../common/srt_socket_stats.h:14:3: error: 'int32_t' does not name a type672   14 |   int32_t pktSentACKTotal;673      |   ^~~~~~~674/work/proj/deps_qemu_aarch64/ex_libsrt/c_src/ex_libsrt/server/../common/srt_socket_stats.h:14:3: note: 'int32_t' is defined in header '<cstdint>'; this is probably fixable by adding '#include <cstdint>'675/work/proj/deps_qemu_aarch64/ex_libsrt/c_src/ex_libsrt/server/../common/srt_socket_stats.h:15:3: error: 'int32_t' does not name a type676   15 |   int32_t pktRecvACKTotal;677      |   ^~~~~~~678/work/proj/deps_qemu_aarch64/ex_libsrt/c_src/ex_libsrt/server/../common/srt_socket_stats.h:15:3: note: 'int32_t' is defined in header '<cstdint>'; this is probably fixable by adding '#include <cstdint>'679/work/proj/deps_qemu_aarch64/ex_libsrt/c_src/ex_libsrt/server/../common/srt_socket_stats.h:16:3: error: 'int32_t' does not name a type680   16 |   int32_t pktSentNAKTotal;681      |   ^~~~~~~682/work/proj/deps_qemu_aarch64/ex_libsrt/c_src/ex_libsrt/server/../common/srt_socket_stats.h:16:3: note: 'int32_t' is defined in header '<cstdint>'; this is probably fixable by adding '#include <cstdint>'683/work/proj/deps_qemu_aarch64/ex_libsrt/c_src/ex_libsrt/server/../common/srt_socket_stats.h:17:3: error: 'int32_t' does not name a type684   17 |   int32_t pktRecvNAKTotal;685      |   ^~~~~~~686/work/proj/deps_qemu_aarch64/ex_libsrt/c_src/ex_libsrt/server/../common/srt_socket_stats.h:17:3: note: 'int32_t' is defined in header '<cstdint>'; this is probably fixable by adding '#include <cstdint>'687/work/proj/deps_qemu_aarch64/ex_libsrt/c_src/ex_libsrt/server/../common/srt_socket_stats.h:18:3: error: 'int64_t' does not name a type688   18 |   int64_t usSndDurationTotal;689      |   ^~~~~~~690/work/proj/deps_qemu_aarch64/ex_libsrt/c_src/ex_libsrt/server/../common/srt_socket_stats.h:18:3: note: 'int64_t' is defined in header '<cstdint>'; this is probably fixable by adding '#include <cstdint>'691/work/proj/deps_qemu_aarch64/ex_libsrt/c_src/ex_libsrt/server/../common/srt_socket_stats.h:19:3: error: 'int32_t' does not name a type692   19 |   int32_t pktSndDropTotal;693      |   ^~~~~~~694/work/proj/deps_qemu_aarch64/ex_libsrt/c_src/ex_libsrt/server/../common/srt_socket_stats.h:19:3: note: 'int32_t' is defined in header '<cstdint>'; this is probably fixable by adding '#include <cstdint>'695/work/proj/deps_qemu_aarch64/ex_libsrt/c_src/ex_libsrt/server/../common/srt_socket_stats.h:20:3: error: 'int32_t' does not name a type696   20 |   int32_t pktRcvDropTotal;697      |   ^~~~~~~698/work/proj/deps_qemu_aarch64/ex_libsrt/c_src/ex_libsrt/server/../common/srt_socket_stats.h:20:3: note: 'int32_t' is defined in header '<cstdint>'; this is probably fixable by adding '#include <cstdint>'699/work/proj/deps_qemu_aarch64/ex_libsrt/c_src/ex_libsrt/server/../common/srt_socket_stats.h:21:3: error: 'int32_t' does not name a type700   21 |   int32_t pktRcvUndecryptTotal;701      |   ^~~~~~~702/work/proj/deps_qemu_aarch64/ex_libsrt/c_src/ex_libsrt/server/../common/srt_socket_stats.h:21:3: note: 'int32_t' is defined in header '<cstdint>'; this is probably fixable by adding '#include <cstdint>'703/work/proj/deps_qemu_aarch64/ex_libsrt/c_src/ex_libsrt/server/../common/srt_socket_stats.h:22:3: error: 'int32_t' does not name a type704   22 |   int32_t pktSndFilterExtraTotal;705      |   ^~~~~~~706/work/proj/deps_qemu_aarch64/ex_libsrt/c_src/ex_libsrt/server/../common/srt_socket_stats.h:22:3: note: 'int32_t' is defined in header '<cstdint>'; this is probably fixable by adding '#include <cstdint>'707/work/proj/deps_qemu_aarch64/ex_libsrt/c_src/ex_libsrt/server/../common/srt_socket_stats.h:23:3: error: 'int32_t' does not name a type708   23 |   int32_t pktRcvFilterExtraTotal;709      |   ^~~~~~~710/work/proj/deps_qemu_aarch64/ex_libsrt/c_src/ex_libsrt/server/../common/srt_socket_stats.h:23:3: note: 'int32_t' is defined in header '<cstdint>'; this is probably fixable by adding '#include <cstdint>'711/work/proj/deps_qemu_aarch64/ex_libsrt/c_src/ex_libsrt/server/../common/srt_socket_stats.h:24:3: error: 'int32_t' does not name a type712   24 |   int32_t pktRcvFilterSupplyTotal;713      |   ^~~~~~~714/work/proj/deps_qemu_aarch64/ex_libsrt/c_src/ex_libsrt/server/../common/srt_socket_stats.h:24:3: note: 'int32_t' is defined in header '<cstdint>'; this is probably fixable by adding '#include <cstdint>'715/work/proj/deps_qemu_aarch64/ex_libsrt/c_src/ex_libsrt/server/../common/srt_socket_stats.h:25:3: error: 'int32_t' does not name a type716   25 |   int32_t pktRcvFilterLossTotal;717      |   ^~~~~~~718/work/proj/deps_qemu_aarch64/ex_libsrt/c_src/ex_libsrt/server/../common/srt_socket_stats.h:25:3: note: 'int32_t' is defined in header '<cstdint>'; this is probably fixable by adding '#include <cstdint>'719/work/proj/deps_qemu_aarch64/ex_libsrt/c_src/ex_libsrt/server/../common/srt_socket_stats.h:26:3: error: 'uint64_t' does not name a type720   26 |   uint64_t byteSentTotal;721      |   ^~~~~~~~722/work/proj/deps_qemu_aarch64/ex_libsrt/c_src/ex_libsrt/server/../common/srt_socket_stats.h:26:3: note: 'uint64_t' is defined in header '<cstdint>'; this is probably fixable by adding '#include <cstdint>'723/work/proj/deps_qemu_aarch64/ex_libsrt/c_src/ex_libsrt/server/../common/srt_socket_stats.h:27:3: error: 'uint64_t' does not name a type724   27 |   uint64_t byteRecvTotal;725      |   ^~~~~~~~726/work/proj/deps_qemu_aarch64/ex_libsrt/c_src/ex_libsrt/server/../common/srt_socket_stats.h:27:3: note: 'uint64_t' is defined in header '<cstdint>'; this is probably fixable by adding '#include <cstdint>'727/work/proj/deps_qemu_aarch64/ex_libsrt/c_src/ex_libsrt/server/../common/srt_socket_stats.h:28:3: error: 'uint64_t' does not name a type728   28 |   uint64_t byteSentUniqueTotal;729      |   ^~~~~~~~730/work/proj/deps_qemu_aarch64/ex_libsrt/c_src/ex_libsrt/server/../common/srt_socket_stats.h:28:3: note: 'uint64_t' is defined in header '<cstdint>'; this is probably fixable by adding '#include <cstdint>'731/work/proj/deps_qemu_aarch64/ex_libsrt/c_src/ex_libsrt/server/../common/srt_socket_stats.h:29:3: error: 'uint64_t' does not name a type732   29 |   uint64_t byteRecvUniqueTotal;733      |   ^~~~~~~~734/work/proj/deps_qemu_aarch64/ex_libsrt/c_src/ex_libsrt/server/../common/srt_socket_stats.h:29:3: note: 'uint64_t' is defined in header '<cstdint>'; this is probably fixable by adding '#include <cstdint>'735/work/proj/deps_qemu_aarch64/ex_libsrt/c_src/ex_libsrt/server/../common/srt_socket_stats.h:30:3: error: 'uint64_t' does not name a type736   30 |   uint64_t byteRcvLossTotal;737      |   ^~~~~~~~738/work/proj/deps_qemu_aarch64/ex_libsrt/c_src/ex_libsrt/server/../common/srt_socket_stats.h:30:3: note: 'uint64_t' is defined in header '<cstdint>'; this is probably fixable by adding '#include <cstdint>'739/work/proj/deps_qemu_aarch64/ex_libsrt/c_src/ex_libsrt/server/../common/srt_socket_stats.h:31:3: error: 'uint64_t' does not name a type740   31 |   uint64_t byteRetransTotal;741      |   ^~~~~~~~742/work/proj/deps_qemu_aarch64/ex_libsrt/c_src/ex_libsrt/server/../common/srt_socket_stats.h:31:3: note: 'uint64_t' is defined in header '<cstdint>'; this is probably fixable by adding '#include <cstdint>'743/work/proj/deps_qemu_aarch64/ex_libsrt/c_src/ex_libsrt/server/../common/srt_socket_stats.h:32:3: error: 'uint64_t' does not name a type744   32 |   uint64_t byteSndDropTotal;745      |   ^~~~~~~~746/work/proj/deps_qemu_aarch64/ex_libsrt/c_src/ex_libsrt/server/../common/srt_socket_stats.h:32:3: note: 'uint64_t' is defined in header '<cstdint>'; this is probably fixable by adding '#include <cstdint>'747/work/proj/deps_qemu_aarch64/ex_libsrt/c_src/ex_libsrt/server/../common/srt_socket_stats.h:33:3: error: 'uint64_t' does not name a type748   33 |   uint64_t byteRcvDropTotal;749      |   ^~~~~~~~750/work/proj/deps_qemu_aarch64/ex_libsrt/c_src/ex_libsrt/server/../common/srt_socket_stats.h:33:3: note: 'uint64_t' is defined in header '<cstdint>'; this is probably fixable by adding '#include <cstdint>'751/work/proj/deps_qemu_aarch64/ex_libsrt/c_src/ex_libsrt/server/../common/srt_socket_stats.h:34:3: error: 'uint64_t' does not name a type752   34 |   uint64_t byteRcvUndecryptTotal;753      |   ^~~~~~~~754/work/proj/deps_qemu_aarch64/ex_libsrt/c_src/ex_libsrt/server/../common/srt_socket_stats.h:34:3: note: 'uint64_t' is defined in header '<cstdint>'; this is probably fixable by adding '#include <cstdint>'755/work/proj/deps_qemu_aarch64/ex_libsrt/c_src/ex_libsrt/server/../common/srt_socket_stats.h:35:3: error: 'int64_t' does not name a type756   35 |   int64_t pktSent;757      |   ^~~~~~~758/work/proj/deps_qemu_aarch64/ex_libsrt/c_src/ex_libsrt/server/../common/srt_socket_stats.h:35:3: note: 'int64_t' is defined in header '<cstdint>'; this is probably fixable by adding '#include <cstdint>'759/work/proj/deps_qemu_aarch64/ex_libsrt/c_src/ex_libsrt/server/../common/srt_socket_stats.h:36:3: error: 'int64_t' does not name a type760   36 |   int64_t pktRecv;761      |   ^~~~~~~762/work/proj/deps_qemu_aarch64/ex_libsrt/c_src/ex_libsrt/server/../common/srt_socket_stats.h:36:3: note: 'int64_t' is defined in header '<cstdint>'; this is probably fixable by adding '#include <cstdint>'763/work/proj/deps_qemu_aarch64/ex_libsrt/c_src/ex_libsrt/server/../common/srt_socket_stats.h:37:3: error: 'int64_t' does not name a type764   37 |   int64_t pktSentUnique;765      |   ^~~~~~~766/work/proj/deps_qemu_aarch64/ex_libsrt/c_src/ex_libsrt/server/../common/srt_socket_stats.h:37:3: note: 'int64_t' is defined in header '<cstdint>'; this is probably fixable by adding '#include <cstdint>'767/work/proj/deps_qemu_aarch64/ex_libsrt/c_src/ex_libsrt/server/../common/srt_socket_stats.h:38:3: error: 'int64_t' does not name a type768   38 |   int64_t pktRecvUnique;769      |   ^~~~~~~770/work/proj/deps_qemu_aarch64/ex_libsrt/c_src/ex_libsrt/server/../common/srt_socket_stats.h:38:3: note: 'int64_t' is defined in header '<cstdint>'; this is probably fixable by adding '#include <cstdint>'771/work/proj/deps_qemu_aarch64/ex_libsrt/c_src/ex_libsrt/server/../common/srt_socket_stats.h:39:3: error: 'int32_t' does not name a type772   39 |   int32_t pktSndLoss;773      |   ^~~~~~~774/work/proj/deps_qemu_aarch64/ex_libsrt/c_src/ex_libsrt/server/../common/srt_socket_stats.h:39:3: note: 'int32_t' is defined in header '<cstdint>'; this is probably fixable by adding '#include <cstdint>'775/work/proj/deps_qemu_aarch64/ex_libsrt/c_src/ex_libsrt/server/../common/srt_socket_stats.h:40:3: error: 'int32_t' does not name a type776   40 |   int32_t pktRcvLoss;777      |   ^~~~~~~778/work/proj/deps_qemu_aarch64/ex_libsrt/c_src/ex_libsrt/server/../common/srt_socket_stats.h:40:3: note: 'int32_t' is defined in header '<cstdint>'; this is probably fixable by adding '#include <cstdint>'779/work/proj/deps_qemu_aarch64/ex_libsrt/c_src/ex_libsrt/server/../common/srt_socket_stats.h:41:3: error: 'int32_t' does not name a type780   41 |   int32_t pktRetrans;781      |   ^~~~~~~782/work/proj/deps_qemu_aarch64/ex_libsrt/c_src/ex_libsrt/server/../common/srt_socket_stats.h:41:3: note: 'int32_t' is defined in header '<cstdint>'; this is probably fixable by adding '#include <cstdint>'783/work/proj/deps_qemu_aarch64/ex_libsrt/c_src/ex_libsrt/server/../common/srt_socket_stats.h:42:3: error: 'int32_t' does not name a type784   42 |   int32_t pktRcvRetrans;785      |   ^~~~~~~786/work/proj/deps_qemu_aarch64/ex_libsrt/c_src/ex_libsrt/server/../common/srt_socket_stats.h:42:3: note: 'int32_t' is defined in header '<cstdint>'; this is probably fixable by adding '#include <cstdint>'787/work/proj/deps_qemu_aarch64/ex_libsrt/c_src/ex_libsrt/server/../common/srt_socket_stats.h:43:3: error: 'int32_t' does not name a type788   43 |   int32_t pktSentACK;789      |   ^~~~~~~790/work/proj/deps_qemu_aarch64/ex_libsrt/c_src/ex_libsrt/server/../common/srt_socket_stats.h:43:3: note: 'int32_t' is defined in header '<cstdint>'; this is probably fixable by adding '#include <cstdint>'791/work/proj/deps_qemu_aarch64/ex_libsrt/c_src/ex_libsrt/server/../common/srt_socket_stats.h:44:3: error: 'int32_t' does not name a type792   44 |   int32_t pktRecvACK;793      |   ^~~~~~~794/work/proj/deps_qemu_aarch64/ex_libsrt/c_src/ex_libsrt/server/../common/srt_socket_stats.h:44:3: note: 'int32_t' is defined in header '<cstdint>'; this is probably fixable by adding '#include <cstdint>'795/work/proj/deps_qemu_aarch64/ex_libsrt/c_src/ex_libsrt/server/../common/srt_socket_stats.h:45:3: error: 'int32_t' does not name a type796   45 |   int32_t pktSentNAK;797      |   ^~~~~~~798/work/proj/deps_qemu_aarch64/ex_libsrt/c_src/ex_libsrt/server/../common/srt_socket_stats.h:45:3: note: 'int32_t' is defined in header '<cstdint>'; this is probably fixable by adding '#include <cstdint>'799/work/proj/deps_qemu_aarch64/ex_libsrt/c_src/ex_libsrt/server/../common/srt_socket_stats.h:46:3: error: 'int32_t' does not name a type800   46 |   int32_t pktRecvNAK;801      |   ^~~~~~~802/work/proj/deps_qemu_aarch64/ex_libsrt/c_src/ex_libsrt/server/../common/srt_socket_stats.h:46:3: note: 'int32_t' is defined in header '<cstdint>'; this is probably fixable by adding '#include <cstdint>'803/work/proj/deps_qemu_aarch64/ex_libsrt/c_src/ex_libsrt/server/../common/srt_socket_stats.h:47:3: error: 'int32_t' does not name a type804   47 |   int32_t pktSndFilterExtra;805      |   ^~~~~~~806/work/proj/deps_qemu_aarch64/ex_libsrt/c_src/ex_libsrt/server/../common/srt_socket_stats.h:47:3: note: 'int32_t' is defined in header '<cstdint>'; this is probably fixable by adding '#include <cstdint>'807/work/proj/deps_qemu_aarch64/ex_libsrt/c_src/ex_libsrt/server/../common/srt_socket_stats.h:48:3: error: 'int32_t' does not name a type808   48 |   int32_t pktRcvFilterExtra;809      |   ^~~~~~~810/work/proj/deps_qemu_aarch64/ex_libsrt/c_src/ex_libsrt/server/../common/srt_socket_stats.h:48:3: note: 'int32_t' is defined in header '<cstdint>'; this is probably fixable by adding '#include <cstdint>'811/work/proj/deps_qemu_aarch64/ex_libsrt/c_src/ex_libsrt/server/../common/srt_socket_stats.h:49:3: error: 'int32_t' does not name a type812   49 |   int32_t pktRcvFilterSupply;813      |   ^~~~~~~814/work/proj/deps_qemu_aarch64/ex_libsrt/c_src/ex_libsrt/server/../common/srt_socket_stats.h:49:3: note: 'int32_t' is defined in header '<cstdint>'; this is probably fixable by adding '#include <cstdint>'815/work/proj/deps_qemu_aarch64/ex_libsrt/c_src/ex_libsrt/server/../common/srt_socket_stats.h:50:3: error: 'int32_t' does not name a type816   50 |   int32_t pktRcvFilterLoss;817      |   ^~~~~~~818/work/proj/deps_qemu_aarch64/ex_libsrt/c_src/ex_libsrt/server/../common/srt_socket_stats.h:50:3: note: 'int32_t' is defined in header '<cstdint>'; this is probably fixable by adding '#include <cstdint>'819/work/proj/deps_qemu_aarch64/ex_libsrt/c_src/ex_libsrt/server/../common/srt_socket_stats.h:53:3: error: 'int64_t' does not name a type820   53 |   int64_t usSndDuration;821      |   ^~~~~~~822/work/proj/deps_qemu_aarch64/ex_libsrt/c_src/ex_libsrt/server/../common/srt_socket_stats.h:53:3: note: 'int64_t' is defined in header '<cstdint>'; this is probably fixable by adding '#include <cstdint>'823/work/proj/deps_qemu_aarch64/ex_libsrt/c_src/ex_libsrt/server/../common/srt_socket_stats.h:54:3: error: 'int32_t' does not name a type824   54 |   int32_t pktReorderDistance;825      |   ^~~~~~~826/work/proj/deps_qemu_aarch64/ex_libsrt/c_src/ex_libsrt/server/../common/srt_socket_stats.h:54:3: note: 'int32_t' is defined in header '<cstdint>'; this is probably fixable by adding '#include <cstdint>'827/work/proj/deps_qemu_aarch64/ex_libsrt/c_src/ex_libsrt/server/../common/srt_socket_stats.h:55:3: error: 'int64_t' does not name a type828   55 |   int64_t pktRcvBelated;829      |   ^~~~~~~830/work/proj/deps_qemu_aarch64/ex_libsrt/c_src/ex_libsrt/server/../common/srt_socket_stats.h:55:3: note: 'int64_t' is defined in header '<cstdint>'; this is probably fixable by adding '#include <cstdint>'831/work/proj/deps_qemu_aarch64/ex_libsrt/c_src/ex_libsrt/server/../common/srt_socket_stats.h:56:3: error: 'int32_t' does not name a type832   56 |   int32_t pktSndDrop;833      |   ^~~~~~~834/work/proj/deps_qemu_aarch64/ex_libsrt/c_src/ex_libsrt/server/../common/srt_socket_stats.h:56:3: note: 'int32_t' is defined in header '<cstdint>'; this is probably fixable by adding '#include <cstdint>'835/work/proj/deps_qemu_aarch64/ex_libsrt/c_src/ex_libsrt/server/../common/srt_socket_stats.h:57:3: error: 'int32_t' does not name a type836   57 |   int32_t pktRcvDrop;837      |   ^~~~~~~838/work/proj/deps_qemu_aarch64/ex_libsrt/c_src/ex_libsrt/server/../common/srt_socket_stats.h:57:3: note: 'int32_t' is defined in header '<cstdint>'; this is probably fixable by adding '#include <cstdint>'839could not compile dependency :ex_libsrt, "mix compile" failed. Errors may have been logged above. You can recompile this dependency with "mix deps.compile ex_libsrt --force", update it with "mix deps.update ex_libsrt" or clean it with "mix deps.clean ex_libsrt"840==> nerves_compatibility_test841** (Mix) Bundlex: Failed to build the native part of package ex_libsrt. Errors may have been logged above.842Make sure that all required packages are properly installed in your system.843Requirements and installation guide may be found in the readme of package ex_libsrt.844845Returned code: 1846Build script:847848(mkdir -p "/work/proj/_build/qemu_aarch64/lib/ex_libsrt/priv/bundlex/nif/srt_nif_obj") && \849(/home/nerves/.nerves/artifacts/nerves_toolchain_aarch64_nerves_linux_gnu-15.3.1/bin/aarch64-nerves-linux-gnu-g++ -mabi=lp64 -fstack-protector-strong -mcpu=cortex-a53 -fPIE -pie -D_LARGEFILE_SOURCE -D_LARGEFILE64_SOURCE -D_FILE_OFFSET_BITS=64  -pipe -O2 --sysroot /home/nerves/.nerves/artifacts/nerves_system_qemu_aarch64-0.4.2/staging -fPIC -Wall -Wextra -c -O2 -g -DBUNDLEX_NIF -std=c++17 -I/work/proj/_build/qemu_aarch64/lib/bundlex/priv/shared/precompiled/httpsgithub.commembraneframework-precompiledprecompiled_srtreleasesdownloadv1.5.4srt_linux_arm.tar.gz/include -I/home/nerves/.nerves/artifacts/nerves_system_qemu_aarch64-0.4.2/staging/usr/include -o "/work/proj/_build/qemu_aarch64/lib/ex_libsrt/priv/bundlex/nif/srt_nif_obj/srt_nif.cpp_09B47872DF2190C103883F87D3270E7CCF5FB674.o" -I"/work/proj/deps_qemu_aarch64/bunch_native/c_src/bunch" -I"/work/proj/deps_qemu_aarch64/bunch_native/c_src/bunch/nif" -I"/work/proj/deps_qemu_aarch64/shmex/c_src/shmex" -I"/work/proj/deps_qemu_aarch64/shmex/c_src/shmex/nif" -I"/work/proj/deps_qemu_aarch64/unifex/c_src/unifex/nif" -I"/work/proj/deps_qemu_aarch64/bunch_native/c_src/bunch" -I"/work/proj/deps_qemu_aarch64/bunch_native/c_src/bunch/nif" -I"/work/proj/deps_qemu_aarch64/shmex/c_src/shmex" -I"/work/proj/deps_qemu_aarch64/shmex/c_src/shmex/nif" -I"/work/proj/deps_qemu_aarch64/unifex/c_src/unifex/nif" -I"/usr/local/lib/erlang/usr/include" -I"/work/proj/deps_qemu_aarch64/ex_libsrt/c_src" "/work/proj/deps_qemu_aarch64/ex_libsrt/c_src/ex_libsrt/_generated/nif/srt_nif.cpp"850) && \851(/home/nerves/.nerves/artifacts/nerves_toolchain_aarch64_nerves_linux_gnu-15.3.1/bin/aarch64-nerves-linux-gnu-g++ -mabi=lp64 -fstack-protector-strong -mcpu=cortex-a53 -fPIE -pie -D_LARGEFILE_SOURCE -D_LARGEFILE64_SOURCE -D_FILE_OFFSET_BITS=64  -pipe -O2 --sysroot /home/nerves/.nerves/artifacts/nerves_system_qemu_aarch64-0.4.2/staging -fPIC -Wall -Wextra -c -O2 -g -DBUNDLEX_NIF -std=c++17 -I/work/proj/_build/qemu_aarch64/lib/bundlex/priv/shared/precompiled/httpsgithub.commembraneframework-precompiledprecompiled_srtreleasesdownloadv1.5.4srt_linux_arm.tar.gz/include -I/home/nerves/.nerves/artifacts/nerves_system_qemu_aarch64-0.4.2/staging/usr/include -o "/work/proj/_build/qemu_aarch64/lib/ex_libsrt/priv/bundlex/nif/srt_nif_obj/srt_nif.cpp_80102C777A81B4B6B830DCF2C2593C30FA2FAB24.o" -I"/work/proj/deps_qemu_aarch64/bunch_native/c_src/bunch" -I"/work/proj/deps_qemu_aarch64/bunch_native/c_src/bunch/nif" -I"/work/proj/deps_qemu_aarch64/shmex/c_src/shmex" -I"/work/proj/deps_qemu_aarch64/shmex/c_src/shmex/nif" -I"/work/proj/deps_qemu_aarch64/unifex/c_src/unifex/nif" -I"/work/proj/deps_qemu_aarch64/bunch_native/c_src/bunch" -I"/work/proj/deps_qemu_aarch64/bunch_native/c_src/bunch/nif" -I"/work/proj/deps_qemu_aarch64/shmex/c_src/shmex" -I"/work/proj/deps_qemu_aarch64/shmex/c_src/shmex/nif" -I"/work/proj/deps_qemu_aarch64/unifex/c_src/unifex/nif" -I"/usr/local/lib/erlang/usr/include" -I"/work/proj/deps_qemu_aarch64/ex_libsrt/c_src" "/work/proj/deps_qemu_aarch64/ex_libsrt/c_src/ex_libsrt/srt_nif.cpp"852) && \853(/home/nerves/.nerves/artifacts/nerves_toolchain_aarch64_nerves_linux_gnu-15.3.1/bin/aarch64-nerves-linux-gnu-g++ -mabi=lp64 -fstack-protector-strong -mcpu=cortex-a53 -fPIE -pie -D_LARGEFILE_SOURCE -D_LARGEFILE64_SOURCE -D_FILE_OFFSET_BITS=64  -pipe -O2 --sysroot /home/nerves/.nerves/artifacts/nerves_system_qemu_aarch64-0.4.2/staging -fPIC -Wall -Wextra -c -O2 -g -DBUNDLEX_NIF -std=c++17 -I/work/proj/_build/qemu_aarch64/lib/bundlex/priv/shared/precompiled/httpsgithub.commembraneframework-precompiledprecompiled_srtreleasesdownloadv1.5.4srt_linux_arm.tar.gz/include -I/home/nerves/.nerves/artifacts/nerves_system_qemu_aarch64-0.4.2/staging/usr/include -o "/work/proj/_build/qemu_aarch64/lib/ex_libsrt/priv/bundlex/nif/srt_nif_obj/server.cpp_B5764135472E0CE913FC2E19DB20A5A5521A2D31.o" -I"/work/proj/deps_qemu_aarch64/bunch_native/c_src/bunch" -I"/work/proj/deps_qemu_aarch64/bunch_native/c_src/bunch/nif" -I"/work/proj/deps_qemu_aarch64/shmex/c_src/shmex" -I"/work/proj/deps_qemu_aarch64/shmex/c_src/shmex/nif" -I"/work/proj/deps_qemu_aarch64/unifex/c_src/unifex/nif" -I"/work/proj/deps_qemu_aarch64/bunch_native/c_src/bunch" -I"/work/proj/deps_qemu_aarch64/bunch_native/c_src/bunch/nif" -I"/work/proj/deps_qemu_aarch64/shmex/c_src/shmex" -I"/work/proj/deps_qemu_aarch64/shmex/c_src/shmex/nif" -I"/work/proj/deps_qemu_aarch64/unifex/c_src/unifex/nif" -I"/usr/local/lib/erlang/usr/include" -I"/work/proj/deps_qemu_aarch64/ex_libsrt/c_src" "/work/proj/deps_qemu_aarch64/ex_libsrt/c_src/ex_libsrt/server/server.cpp"854) && \855(/home/nerves/.nerves/artifacts/nerves_toolchain_aarch64_nerves_linux_gnu-15.3.1/bin/aarch64-nerves-linux-gnu-g++ -mabi=lp64 -fstack-protector-strong -mcpu=cortex-a53 -fPIE -pie -D_LARGEFILE_SOURCE -D_LARGEFILE64_SOURCE -D_FILE_OFFSET_BITS=64  -pipe -O2 --sysroot /home/nerves/.nerves/artifacts/nerves_system_qemu_aarch64-0.4.2/staging -fPIC -Wall -Wextra -c -O2 -g -DBUNDLEX_NIF -std=c++17 -I/work/proj/_build/qemu_aarch64/lib/bundlex/priv/shared/precompiled/httpsgithub.commembraneframework-precompiledprecompiled_srtreleasesdownloadv1.5.4srt_linux_arm.tar.gz/include -I/home/nerves/.nerves/artifacts/nerves_system_qemu_aarch64-0.4.2/staging/usr/include -o "/work/proj/_build/qemu_aarch64/lib/ex_libsrt/priv/bundlex/nif/srt_nif_obj/client.cpp_3A70AF1836CD349B01E59F933E9FB1608D216812.o" -I"/work/proj/deps_qemu_aarch64/bunch_native/c_src/bunch" -I"/work/proj/deps_qemu_aarch64/bunch_native/c_src/bunch/nif" -I"/work/proj/deps_qemu_aarch64/shmex/c_src/shmex" -I"/work/proj/deps_qemu_aarch64/shmex/c_src/shmex/nif" -I"/work/proj/deps_qemu_aarch64/unifex/c_src/unifex/nif" -I"/work/proj/deps_qemu_aarch64/bunch_native/c_src/bunch" -I"/work/proj/deps_qemu_aarch64/bunch_native/c_src/bunch/nif" -I"/work/proj/deps_qemu_aarch64/shmex/c_src/shmex" -I"/work/proj/deps_qemu_aarch64/shmex/c_src/shmex/nif" -I"/work/proj/deps_qemu_aarch64/unifex/c_src/unifex/nif" -I"/usr/local/lib/erlang/usr/include" -I"/work/proj/deps_qemu_aarch64/ex_libsrt/c_src" "/work/proj/deps_qemu_aarch64/ex_libsrt/c_src/ex_libsrt/client/client.cpp"856) && \857(/home/nerves/.nerves/artifacts/nerves_toolchain_aarch64_nerves_linux_gnu-15.3.1/bin/aarch64-nerves-linux-gnu-g++ -mabi=lp64 -fstack-protector-strong -mcpu=cortex-a53 -fPIE -pie -D_LARGEFILE_SOURCE -D_LARGEFILE64_SOURCE -D_FILE_OFFSET_BITS=64  -pipe -O2 --sysroot /home/nerves/.nerves/artifacts/nerves_system_qemu_aarch64-0.4.2/staging -fPIC -Wall -Wextra -c -O2 -g -DBUNDLEX_NIF -std=c++17 -I/work/proj/_build/qemu_aarch64/lib/bundlex/priv/shared/precompiled/httpsgithub.commembraneframework-precompiledprecompiled_srtreleasesdownloadv1.5.4srt_linux_arm.tar.gz/include -I/home/nerves/.nerves/artifacts/nerves_system_qemu_aarch64-0.4.2/staging/usr/include -o "/work/proj/_build/qemu_aarch64/lib/ex_libsrt/priv/bundlex/nif/srt_nif_obj/srt_socket_stats.cpp_4B3A9313C5E84635F19A84341E4B91E1D24883B7.o" -I"/work/proj/deps_qemu_aarch64/bunch_native/c_src/bunch" -I"/work/proj/deps_qemu_aarch64/bunch_native/c_src/bunch/nif" -I"/work/proj/deps_qemu_aarch64/shmex/c_src/shmex" -I"/work/proj/deps_qemu_aarch64/shmex/c_src/shmex/nif" -I"/work/proj/deps_qemu_aarch64/unifex/c_src/unifex/nif" -I"/work/proj/deps_qemu_aarch64/bunch_native/c_src/bunch" -I"/work/proj/deps_qemu_aarch64/bunch_native/c_src/bunch/nif" -I"/work/proj/deps_qemu_aarch64/shmex/c_src/shmex" -I"/work/proj/deps_qemu_aarch64/shmex/c_src/shmex/nif" -I"/work/proj/deps_qemu_aarch64/unifex/c_src/unifex/nif" -I"/usr/local/lib/erlang/usr/include" -I"/work/proj/deps_qemu_aarch64/ex_libsrt/c_src" "/work/proj/deps_qemu_aarch64/ex_libsrt/c_src/ex_libsrt/common/srt_socket_stats.cpp"858) && \859(/home/nerves/.nerves/artifacts/nerves_toolchain_aarch64_nerves_linux_gnu-15.3.1/bin/aarch64-nerves-linux-gnu-g++ --sysroot=/home/nerves/.nerves/artifacts/nerves_system_qemu_aarch64-0.4.2/staging -rdynamic -shared -o "/work/proj/_build/qemu_aarch64/lib/ex_libsrt/priv/bundlex/nif/srt_nif.so" -Wl,--disable-new-dtags,--whole-archive "/work/proj/_build/qemu_aarch64/lib/bunch_native/priv/bundlex/lib.a" "/work/proj/_build/qemu_aarch64/lib/shmex/priv/bundlex/lib.a" "/work/proj/_build/qemu_aarch64/lib/bunch_native/priv/bundlex/nif/bunch.a" "/work/proj/_build/qemu_aarch64/lib/shmex/priv/bundlex/nif/shmex.a" "/work/proj/_build/qemu_aarch64/lib/unifex/priv/bundlex/nif/unifex.a" -Wl,--no-whole-archive "/work/proj/_build/qemu_aarch64/lib/ex_libsrt/priv/bundlex/nif/srt_nif_obj/srt_nif.cpp_09B47872DF2190C103883F87D3270E7CCF5FB674.o" "/work/proj/_build/qemu_aarch64/lib/ex_libsrt/priv/bundlex/nif/srt_nif_obj/srt_nif.cpp_80102C777A81B4B6B830DCF2C2593C30FA2FAB24.o" "/work/proj/_build/qemu_aarch64/lib/ex_libsrt/priv/bundlex/nif/srt_nif_obj/server.cpp_B5764135472E0CE913FC2E19DB20A5A5521A2D31.o" "/work/proj/_build/qemu_aarch64/lib/ex_libsrt/priv/bundlex/nif/srt_nif_obj/client.cpp_3A70AF1836CD349B01E59F933E9FB1608D216812.o" "/work/proj/_build/qemu_aarch64/lib/ex_libsrt/priv/bundlex/nif/srt_nif_obj/srt_socket_stats.cpp_4B3A9313C5E84635F19A84341E4B91E1D24883B7.o"  -lrt -lrt -lpthread -L/work/proj/_build/qemu_aarch64/lib/bundlex/priv/shared/precompiled/httpsgithub.commembraneframework-precompiledprecompiled_srtreleasesdownloadv1.5.4srt_linux_arm.tar.gz/lib -Wl,-rpath,\$ORIGIN/httpsgithub.commembraneframework-precompiledprecompiled_srtreleasesdownloadv1.5.4srt_linux_arm.tar.gz -Wl,-rpath,/opt/homebrew/lib -lsrt -L/home/nerves/.nerves/artifacts/nerves_system_qemu_aarch64-0.4.2/staging/usr/lib -lssl -lcrypto860)861862