midi_player

Build log

host

midi_player 0.2.0 · fail · run midi_player-0.2.0-1791002249869
74 of 74 lines
1Resolving Hex dependencies...2Resolution completed in 0.117s3Unchanged:4  circular_buffer 1.1.05  combine 0.10.06  elixir_make 0.10.07  expo 1.1.18  gettext 0.26.29  interactive_cmd 0.1.410  midi_player 0.2.011  midi_synth 0.4.212  nerves 2.0.0-pre.213  nerves_discovery 0.1.514  nerves_logging 0.2.415  nerves_runtime 0.13.1316  nerves_system_bbb 2.30.217  nerves_system_br 1.34.418  nerves_system_mangopi_mq_pro 0.17.219  nerves_system_qemu_aarch64 0.4.220  nerves_system_rpi0 2.1.221  nerves_system_rpi4 2.1.222  nerves_system_rpi5 2.1.223  nerves_system_trellis 0.5.024  nerves_system_x86_64 1.34.225  nerves_toolchain_aarch64_nerves_linux_gnu 15.3.126  nerves_toolchain_armv6_nerves_linux_gnueabihf 15.3.127  nerves_toolchain_armv7_nerves_linux_gnueabihf 15.3.128  nerves_toolchain_riscv64_nerves_linux_gnu 15.3.129  nerves_toolchain_x86_64_nerves_linux_musl 15.3.130  nerves_uevent 0.1.731  property_table 0.3.432  ring_logger 0.11.733  tablet 0.3.334  timex 3.7.1335  toolshed 0.5.036  tzdata 1.2.237  uboot_env 1.0.238All dependencies have been fetched39==> midi_synth40/usr/bin/make -C c_src all41make[1]: Entering directory '/work/proj/deps/midi_synth/c_src'42mkdir -p /work/proj/_build/host/lib/midi_synth/priv43mkdir -p /work/proj/_build/host/lib/midi_synth/obj44Package fluidsynth was not found in the pkg-config search path.45Perhaps you should add the directory containing `fluidsynth.pc'46to the PKG_CONFIG_PATH environment variable47Package 'fluidsynth', required by 'virtual:world', not found48cc -c -O2 -Wall -Wextra -Wno-unused-parameter -std=c99 -D_GNU_SOURCE  -o /work/proj/_build/host/lib/midi_synth/obj/midi_synth.o midi_synth.c49curl -LO https://github.com/fhunleth/midi_synth/releases/download/v0.1.0/FluidR3_GM.sf250midi_synth.c:4:10: fatal error: fluidsynth.h: No such file or directory51    4 | #include <fluidsynth.h>52      |          ^~~~~~~~~~~~~~53compilation terminated.54make[1]: *** [Makefile:48: /work/proj/_build/host/lib/midi_synth/obj/midi_synth.o] Error 155make[1]: *** Waiting for unfinished jobs....56  % Total    % Received % Xferd  Average Speed   Time    Time     Time  Current57                                 Dload  Upload   Total   Spent    Left  Speed58  0     0    0     0    0     0      0      0 --:--:-- --:--:-- --:--:--     0  0     0    0     0    0     0      0      0 --:--:-- --:--:-- --:--:--     0  0     0    0     0    0     0      0      0 --:--:--  0:00:01 --:--:--     0  0     0    0     0    0     0      0      0 --:--:--  0:00:02 --:--:--     0  0     0    0     0    0     0      0      0 --:--:--  0:00:03 --:--:--     0  0     0    0     0    0     0      0      0 --:--:--  0:00:04 --:--:--     0  0     0    0     0    0     0      0      0 --:--:--  0:00:05 --:--:--     0  0     0    0     0    0     0      0      0 --:--:--  0:00:05 --:--:--     059  5  141M    5 8358k    0     0  1328k      0  0:01:49  0:00:06  0:01:43 1328k  9  141M    9 13.8M    0     0  1946k      0  0:01:14  0:00:07  0:01:07 5911k 19  141M   19 28.1M    0     0  3494k      0  0:00:41  0:00:08  0:00:33 10.1M 32  141M   32 46.4M    0     0  5141k      0  0:00:28  0:00:09  0:00:19 12.9M 42  141M   42 60.1M    0     0  6017k      0  0:00:24  0:00:10  0:00:14 13.1M 49  141M   49 70.4M    0     0  6421k      0  0:00:22  0:00:11  0:00:11 12.6M 65  141M   65 93.1M    0     0  7793k      0  0:00:18  0:00:12  0:00:06 15.9M 84  141M   84  120M    0     0  9275k      0  0:00:15  0:00:13  0:00:02 18.3M100  141M  100  141M    0     0  10.1M      0  0:00:13  0:00:13 --:--:-- 20.1M60make[1]: Leaving directory '/work/proj/deps/midi_synth/c_src'61make: *** [Makefile:5: all] Error 262could not compile dependency :midi_synth, "mix compile" failed. Errors may have been logged above. You can recompile this dependency with "mix deps.compile midi_synth --force", update it with "mix deps.update midi_synth" or clean it with "mix deps.clean midi_synth"63==> nerves_compatibility_test64** (Mix) Could not compile with "make" (exit status: 2).65This is usually due to not being able to find the fluidsynth library. Try66installing it and then rerun the build to see if that fixes the error.6768On MacOS, run `brew install fluidsynth pkg-config`.6970On Ubuntu, try `sudo apt install libfluidsynth-dev`7172If this does not fix the issue, the C compiler error message right above73this help text may provide a clue.74