nanodrop

Build log

nerves_system_mangopi_mq_pro

nanodrop 0.3.1 · fail · run nanodrop-0.3.1-1789379031709
293 of 293 lines
1Resolving Hex dependencies...2Resolution completed in 0.242s3Unchanged:4  cc_precompiler 0.1.115  circular_buffer 1.1.06  complex 0.7.07  elixir_make 0.10.08  interactive_cmd 0.1.49  jason 1.4.510  nanodrop 0.3.111  nerves 1.15.012  nerves_discovery 0.1.513  nerves_logging 0.2.414  nerves_runtime 0.13.1315  nerves_system_bbb 2.30.216  nerves_system_br 1.34.417  nerves_system_mangopi_mq_pro 0.17.218  nerves_system_qemu_aarch64 0.4.219  nerves_system_rpi 2.1.220  nerves_system_rpi0 2.1.221  nerves_system_rpi0_2 2.1.222  nerves_system_rpi2 2.1.223  nerves_system_rpi3 2.1.224  nerves_system_rpi4 2.1.225  nerves_system_rpi5 2.1.226  nerves_system_x86_64 1.34.227  nerves_toolchain_aarch64_nerves_linux_gnu 15.3.128  nerves_toolchain_armv6_nerves_linux_gnueabihf 15.3.129  nerves_toolchain_armv7_nerves_linux_gnueabihf 15.3.130  nerves_toolchain_riscv64_nerves_linux_gnu 15.3.131  nerves_toolchain_x86_64_nerves_linux_musl 15.3.132  nerves_uevent 0.1.733  nx 0.13.134  property_table 0.3.435  protoss 1.1.036  ring_logger 0.11.737  shoehorn 0.9.338  tablet 0.3.339  telemetry 1.4.240  toolshed 0.5.041  uboot_env 1.0.242  vix 0.41.043* Getting nanodrop (Hex package)44* Getting nerves (Hex package)45* Getting shoehorn (Hex package)46* Getting ring_logger (Hex package)47* Getting toolshed (Hex package)48* Getting nerves_runtime (Hex package)49* Getting nerves_system_bbb (Hex package)50* Getting nerves_system_mangopi_mq_pro (Hex package)51* Getting nerves_system_qemu_aarch64 (Hex package)52* Getting nerves_system_rpi (Hex package)53* Getting nerves_system_rpi0 (Hex package)54* Getting nerves_system_rpi0_2 (Hex package)55* Getting nerves_system_rpi2 (Hex package)56* Getting nerves_system_rpi3 (Hex package)57* Getting nerves_system_rpi4 (Hex package)58* Getting nerves_system_rpi5 (Hex package)59* Getting nerves_system_x86_64 (Hex package)60* Getting nerves_system_br (Hex package)61* Getting nerves_toolchain_x86_64_nerves_linux_musl (Hex package)62* Getting nerves_toolchain_aarch64_nerves_linux_gnu (Hex package)63* Getting nerves_toolchain_armv7_nerves_linux_gnueabihf (Hex package)64* Getting nerves_toolchain_armv6_nerves_linux_gnueabihf (Hex package)65* Getting nerves_toolchain_riscv64_nerves_linux_gnu (Hex package)66* Getting nerves_logging (Hex package)67* Getting nerves_uevent (Hex package)68* Getting uboot_env (Hex package)69* Getting elixir_make (Hex package)70* Getting property_table (Hex package)71* Getting circular_buffer (Hex package)72* Getting interactive_cmd (Hex package)73* Getting jason (Hex package)74* Getting nerves_discovery (Hex package)75* Getting tablet (Hex package)76* Getting nx (Hex package)77* Getting protoss (Hex package)78* Getting vix (Hex package)79* Getting cc_precompiler (Hex package)80* Getting complex (Hex package)81* Getting telemetry (Hex package)82==> jason83Compiling 10 files (.ex)84Generated jason app85==> tablet86Compiling 2 files (.ex)87Generated tablet app88==> elixir_make89Compiling 8 files (.ex)90Generated elixir_make app91==> nerves_discovery92Compiling 5 files (.ex)93Generated nerves_discovery app94==> interactive_cmd95Compiling 1 file (.ex)96Generated interactive_cmd app97==> nerves98HOST_CC port.o99HOST_LD port100Compiling 55 files (.ex)101Generated nerves app102==> nerves_compatibility_test103104Nerves environment105  MIX_TARGET:   mangopi_mq_pro106  MIX_ENV:      prod107108Checking for prebuilt Nerves artifacts...109  Found nerves_system_mangopi_mq_pro in cache110    /home/nerves/.nerves/artifacts/nerves_system_mangopi_mq_pro-portable-0.17.2111  Found nerves_toolchain_riscv64_nerves_linux_gnu in cache112    /home/nerves/.nerves/artifacts/nerves_toolchain_riscv64_nerves_linux_gnu-linux_x86_64-15.3.1113==> jason114Compiling 10 files (.ex)115Compiling lib/encode.ex (it's taking more than 10s)116Compiling lib/decoder.ex (it's taking more than 10s)117Generated jason app118==> tablet119Compiling 2 files (.ex)120Generated tablet app121==> elixir_make122Compiling 8 files (.ex)123Generated elixir_make app124==> nerves_discovery125Compiling 5 files (.ex)126Generated nerves_discovery app127==> interactive_cmd128Compiling 1 file (.ex)129Generated interactive_cmd app130==> nerves131HOST_CC port.o132HOST_LD port133Compiling 55 files (.ex)134Generated nerves app135==> nerves_system_br136Generated nerves_system_br app137==> nerves_toolchain_riscv64_nerves_linux_gnu138Compiling 1 file (.ex)139Generated nerves_toolchain_riscv64_nerves_linux_gnu app140==> nerves_system_mangopi_mq_pro141Generated nerves_system_mangopi_mq_pro app142==> nerves_compatibility_test143144Nerves environment145  MIX_TARGET:   mangopi_mq_pro146  MIX_ENV:      prod147148==> circular_buffer149Compiling 1 file (.ex)150Generated circular_buffer app151==> complex152Compiling 2 files (.ex)153     warning: the following clause is redundant:154155         def divide(n, b) when is_number(n) and (b === :infinity or b === :neg_infinity)156157     it has type:158159         dynamic(float() or integer()), dynamic(:infinity or :neg_infinity)160161     previous clauses have already matched on the following types:162163         :infinity or :nan or :neg_infinity, :infinity or :nan or :neg_infinity164         :nan, float() or integer()165         float() or integer(), :nan166         float() or integer(), :infinity167         float() or integer(), :neg_infinity168         float() or integer(), float() or integer()169170     │171 590 │   def divide(n, b) when is_number(n) and b in [:infinity, :neg_infinity] do172     │       ~173     │174     └─ lib/complex.ex:590:7: Complex.divide/2175176      warning: the following clause is redundant:177178          def pow(%Complex{re: re, im: im}, :neg_infinity) when re == 0 and im == 0179180      it has type:181182          dynamic(%Complex{re: float() or integer(), im: float() or integer()}), :neg_infinity183184      previous clauses have already matched on the following types:185186          :infinity or :nan or :neg_infinity, %Complex{}187          %Complex{}, :infinity or :nan or :neg_infinity188          %Complex{re: :infinity or :nan or :neg_infinity}, term()189          %Complex{im: :infinity or :nan or :neg_infinity}, term()190          term(), %Complex{re: :infinity or :nan or :neg_infinity}191          term(), %Complex{im: :infinity or :nan or :neg_infinity}192          :nan, term()193          term(), :nan194195      │196 1143 │   def pow(%Complex{re: re, im: im}, :neg_infinity) when re == 0 and im == 0, do: new(:infinity, 0)197      │       ~198      │199      └─ lib/complex.ex:1143:7: Complex.pow/2200201      warning: the following clause is redundant:202203          def atan2(:nan, :nan)204205      it has type:206207          :nan, :nan208209      previous clauses have already matched on the following types:210211          float() or integer(), float() or integer()212          :infinity, :infinity213          :infinity, :neg_infinity214          :infinity, :nan215          :infinity, float() or integer()216          :neg_infinity, :infinity217          :neg_infinity, :neg_infinity218          :neg_infinity, :nan219          :neg_infinity, float() or integer()220          :nan, :infinity or :nan or :neg_infinity or float() or integer()221          :infinity or :nan or :neg_infinity or float() or integer(), :nan222223      │224 1458 │   def atan2(:nan, :nan), do: :nan225      │       ~226      │227      └─ lib/complex.ex:1458:7: Complex.atan2/2228229Generated complex app230==> protoss231Compiling 1 file (.ex)232Generated protoss app233==> nerves_logging234 CC kmsg_tailer.o235 LD kmsg_tailer236Compiling 5 files (.ex)237Generated nerves_logging app238==> ring_logger239Compiling 7 files (.ex)240Generated ring_logger app241==> shoehorn242Compiling 8 files (.ex)243Generated shoehorn app244==> nerves_compatibility_test245===> Analyzing applications...246===> Compiling telemetry247==> nx248Compiling 43 files (.ex)249Compiling lib/nx/defn/tree.ex (it's taking more than 10s)250Compiling lib/nx/defn/graph.ex (it's taking more than 10s)251Compiling lib/nx/defn/grad.ex (it's taking more than 10s)252Compiling lib/nx/binary_backend.ex (it's taking more than 10s)253Compiling lib/nx.ex (it's taking more than 10s)254Generated nx app255==> uboot_env256Compiling 5 files (.ex)257Generated uboot_env app258==> cc_precompiler259Compiling 3 files (.ex)260Generated cc_precompiler app261==> vix262Setting up precompiled libvips...26326409:51:37.377 [debug] Fetching https://github.com/akash-akya/sharp-libvips/releases/download/v8.18.3-rc1/sharp-libvips-linux-x64.tar.gz26526609:51:40.589 [debug] Extracting to /work/proj/_build/mangopi_mq_pro/lib/vix/priv/sharp-libvips-linux-x64.tar.gz267 CC     pipe.c268 CC     utils.c269 CC     vips_boxed.c270 CC     vips_foreign.c271 CC     vips_image.c272 CC     vips_interpolate.c273 CC     vips_operation.c274 CC     vix.c275 CC     g_boxed.c276 CC     g_object.c277 CC     g_param_spec.c278 CC     g_type.c279 CC     g_value.c280 LD     vix.so281/home/nerves/.nerves/artifacts/nerves_toolchain_riscv64_nerves_linux_gnu-linux_x86_64-15.3.1/riscv64-nerves-linux-gnu/bin/ld: /work/proj/_build/mangopi_mq_pro/lib/vix/priv/precompiled_libvips/lib/libvips-cpp.so.8.18.3: error adding symbols: file in wrong format282collect2: error: ld returned 1 exit status283make[1]: *** [Makefile:240: /work/proj/_build/mangopi_mq_pro/lib/vix/priv/vix.so] Error 1284make: *** [Makefile:10: compile] Error 2285could not compile dependency :vix, "mix compile" failed. Errors may have been logged above. You can recompile this dependency with "mix deps.compile vix --force", update it with "mix deps.update vix" or clean it with "mix deps.clean vix"286==> nerves_compatibility_test287** (Mix) Could not compile with "make" (exit status: 2).288You need to have gcc and make installed. If you are using289Ubuntu or any other Debian-based system, install the packages290"build-essential". Also install "erlang-dev" package if not291included in your Erlang/OTP version. If you're on Fedora, run292"dnf group install 'Development Tools'".293