Build log
host
nerves_pack 0.7.2 · fail · run nerves_pack-0.7.2-1791012507340
104 of 104 lines
1Resolving Hex dependencies...2Resolution completed in 0.475s3Unchanged:4 beam_notify 1.1.15 circular_buffer 1.1.06 elixir_make 0.10.07 interactive_cmd 0.1.48 mdns_lite 0.9.29 muontrap 1.8.010 nerves 2.0.0-pre.211 nerves_discovery 0.1.512 nerves_logging 0.2.413 nerves_motd 0.1.1714 nerves_pack 0.7.215 nerves_runtime 0.13.1316 nerves_ssh 1.3.117 nerves_system_bbb 2.30.218 nerves_system_br 1.34.419 nerves_system_mangopi_mq_pro 0.17.220 nerves_system_qemu_aarch64 0.4.221 nerves_system_rpi0 2.1.222 nerves_system_rpi4 2.1.223 nerves_system_rpi5 2.1.224 nerves_system_trellis 0.5.025 nerves_system_x86_64 1.34.226 nerves_time 0.4.1227 nerves_toolchain_aarch64_nerves_linux_gnu 15.3.128 nerves_toolchain_armv6_nerves_linux_gnueabihf 15.3.129 nerves_toolchain_armv7_nerves_linux_gnueabihf 15.3.130 nerves_toolchain_riscv64_nerves_linux_gnu 15.3.131 nerves_toolchain_x86_64_nerves_linux_musl 15.3.132 nerves_uevent 0.1.733 one_dhcpd 3.0.034 property_table 0.3.435 ring_logger 0.11.736 ssh_subsystem_fwup 0.6.937 tablet 0.3.338 toolshed 0.5.039 uboot_env 1.0.240 vintage_net 0.13.1341 vintage_net_direct 0.10.842 vintage_net_ethernet 0.11.243 vintage_net_wifi 0.12.1144All dependencies have been fetched45==> one_dhcpd46 CC arp_set.o47 LD arp_set48Compiling 8 files (.ex)49Generated one_dhcpd app50==> ssh_subsystem_fwup51Compiling 4 files (.ex)52Generated ssh_subsystem_fwup app53==> nerves_ssh54Compiling 6 files (.ex)55Generated nerves_ssh app56==> beam_notify57 CC beam_notify.o58 LD beam_notify59Compiling 1 file (.ex)60Generated beam_notify app61==> vintage_net62 CC if_monitor.o63 LD if_monitor64Compiling 55 files (.ex)65Generated vintage_net app66==> mdns_lite67Compiling 19 files (.ex)68Generated mdns_lite app69==> vintage_net_direct70Compiling 2 files (.ex)71Generated vintage_net_direct app72==> vintage_net_ethernet73Compiling 4 files (.ex)74Generated vintage_net_ethernet app75==> vintage_net_wifi76Package libnl-genl-3.0 was not found in the pkg-config search path.77Perhaps you should add the directory containing `libnl-genl-3.0.pc'78to the PKG_CONFIG_PATH environment variable79Package 'libnl-genl-3.0', required by 'virtual:world', not found80 CC force_ap_scan.o81Package libnl-genl-3.0 was not found in the pkg-config search path.82Perhaps you should add the directory containing `libnl-genl-3.0.pc'83to the PKG_CONFIG_PATH environment variable84Package 'libnl-genl-3.0', required by 'virtual:world', not found85 CC mesh_mode.o86Package libnl-genl-3.0 was not found in the pkg-config search path.87Perhaps you should add the directory containing `libnl-genl-3.0.pc'88to the PKG_CONFIG_PATH environment variable89Package 'libnl-genl-3.0', required by 'virtual:world', not found90c_src/force_ap_scan.c:24:10: fatal error: netlink/genl/genl.h: No such file or directory91 24 | #include <netlink/genl/genl.h>92 | ^~~~~~~~~~~~~~~~~~~~~93compilation terminated.94make: *** [Makefile:92: /work/proj/_build/host/lib/vintage_net_wifi/obj/force_ap_scan.o] Error 195make: *** Waiting for unfinished jobs....96c_src/mesh_mode.c:24:10: fatal error: netlink/genl/genl.h: No such file or directory97 24 | #include <netlink/genl/genl.h>98 | ^~~~~~~~~~~~~~~~~~~~~99compilation terminated.100make: *** [Makefile:92: /work/proj/_build/host/lib/vintage_net_wifi/obj/mesh_mode.o] Error 1101could not compile dependency :vintage_net_wifi, "mix compile" failed. Errors may have been logged above. You can recompile this dependency with "mix deps.compile vintage_net_wifi --force", update it with "mix deps.update vintage_net_wifi" or clean it with "mix deps.clean vintage_net_wifi"102==> nerves_compatibility_test103** (Mix) Could not compile with "make" (exit status: 2).104