Build log
host
neutron 0.2.1 · fail · run neutron-0.2.1-1791017240988
69 of 69 lines
1Resolving Hex dependencies...2Resolution completed in 0.114s3Unchanged:4 circular_buffer 1.1.05 elixir_make 0.10.06 interactive_cmd 0.1.47 nerves 2.0.0-pre.28 nerves_discovery 0.1.59 nerves_logging 0.2.410 nerves_runtime 0.13.1311 nerves_system_bbb 2.30.212 nerves_system_br 1.34.413 nerves_system_mangopi_mq_pro 0.17.214 nerves_system_qemu_aarch64 0.4.215 nerves_system_rpi0 2.1.216 nerves_system_rpi4 2.1.217 nerves_system_rpi5 2.1.218 nerves_system_trellis 0.5.019 nerves_system_x86_64 1.34.220 nerves_toolchain_aarch64_nerves_linux_gnu 15.3.121 nerves_toolchain_armv6_nerves_linux_gnueabihf 15.3.122 nerves_toolchain_armv7_nerves_linux_gnueabihf 15.3.123 nerves_toolchain_riscv64_nerves_linux_gnu 15.3.124 nerves_toolchain_x86_64_nerves_linux_musl 15.3.125 nerves_uevent 0.1.726 neutron 0.2.127 property_table 0.3.428 ring_logger 0.11.729 tablet 0.3.330 toolshed 0.5.031 uboot_env 1.0.232All dependencies have been fetched33==> neutron34mkdir -p /work/proj/_build/host/lib/neutron/priv/35cc c_src/neutron_nif.c \36 -shared \37 -pedantic \38 -fPIC \39 -O3 \40 -finline-functions \41 -o /work/proj/_build/host/lib/neutron/priv/neutron_nif.so \42 /usr/lib/libpulsar.so \43 -I/usr/local/ssl/include \44 -I/usr/local/lib/erlang/usr/include \45 -I/usr/local/lib/erlang/erts-17.1/include \46 -L/usr/local/lib/erlang/usr/lib47apt-get found48sudo: PERM_SUDOERS: setresuid(-1, 1, -1): Operation not permitted49sudo: unable to open /etc/sudoers: Operation not permitted50sudo: error initializing audit plugin sudoers_audit51c_src/neutron_nif.c:3:10: fatal error: pulsar/c/client.h: No such file or directory52 3 | #include "pulsar/c/client.h"53 | ^~~~~~~~~~~~~~~~~~~54compilation terminated.55make: *** [Makefile:42: priv/neutron_nif.so] Error 156make: *** Waiting for unfinished jobs....57sudo: PERM_SUDOERS: setresuid(-1, 1, -1): Operation not permitted58sudo: unable to open /etc/sudoers: Operation not permitted59sudo: error initializing audit plugin sudoers_audit60make: *** [Makefile:36: get_deps] Error 161could not compile dependency :neutron, "mix compile" failed. Errors may have been logged above. You can recompile this dependency with "mix deps.compile neutron --force", update it with "mix deps.update neutron" or clean it with "mix deps.clean neutron"62==> nerves_compatibility_test63** (Mix) Could not compile with "make" (exit status: 2).64You need to have gcc and make installed. If you are using65Ubuntu or any other Debian-based system, install the packages66"build-essential". Also install "erlang-dev" package if not67included in your Erlang/OTP version. If you're on Fedora, run68"dnf group install 'Development Tools'".69