resamplex

Build log

nerves_system_mangopi_mq_pro

resamplex 0.1.0 · fail · run resamplex-0.1.0-1791086767694
644 of 644 lines
1Resolving Hex dependencies...2Resolution completed in 0.116s3Unchanged:4  circular_buffer 1.1.05  elixir_make 0.10.06  erlexec 1.21.0 RETIRED!7    (deprecated) Deprecated8  exexec 0.2.09  interactive_cmd 0.1.410  nerves 2.0.0-pre.211  nerves_discovery 0.1.512  nerves_logging 0.2.413  nerves_runtime 0.13.1314  nerves_system_bbb 2.30.215  nerves_system_br 1.34.416  nerves_system_mangopi_mq_pro 0.17.217  nerves_system_qemu_aarch64 0.4.218  nerves_system_rpi0 2.1.219  nerves_system_rpi4 2.1.220  nerves_system_rpi5 2.1.221  nerves_system_trellis 0.5.022  nerves_system_x86_64 1.34.223  nerves_toolchain_aarch64_nerves_linux_gnu 15.3.124  nerves_toolchain_armv6_nerves_linux_gnueabihf 15.3.125  nerves_toolchain_armv7_nerves_linux_gnueabihf 15.3.126  nerves_toolchain_riscv64_nerves_linux_gnu 15.3.127  nerves_toolchain_x86_64_nerves_linux_musl 15.3.128  nerves_uevent 0.1.729  poolboy 1.5.230  property_table 0.3.431  resamplex 0.1.032  ring_logger 0.11.733  tablet 0.3.334  toolshed 0.5.035  uboot_env 1.0.236* Getting resamplex (Hex package)37* Getting nerves (Hex package)38* Getting ring_logger (Hex package)39* Getting toolshed (Hex package)40* Getting nerves_runtime (Hex package)41* Getting nerves_system_bbb (Hex package)42* Getting nerves_system_mangopi_mq_pro (Hex package)43* Getting nerves_system_qemu_aarch64 (Hex package)44* Getting nerves_system_rpi0 (Hex package)45* Getting nerves_system_rpi4 (Hex package)46* Getting nerves_system_rpi5 (Hex package)47* Getting nerves_system_trellis (Hex package)48* Getting nerves_system_x86_64 (Hex package)49* Getting nerves_system_br (Hex package)50* Getting nerves_toolchain_x86_64_nerves_linux_musl (Hex package)51* Getting nerves_toolchain_armv7_nerves_linux_gnueabihf (Hex package)52* Getting nerves_toolchain_aarch64_nerves_linux_gnu (Hex package)53* Getting nerves_toolchain_armv6_nerves_linux_gnueabihf (Hex package)54* Getting nerves_toolchain_riscv64_nerves_linux_gnu (Hex package)55* Getting nerves_logging (Hex package)56* Getting nerves_uevent (Hex package)57* Getting uboot_env (Hex package)58* Getting elixir_make (Hex package)59* Getting property_table (Hex package)60* Getting circular_buffer (Hex package)61* Getting interactive_cmd (Hex package)62* Getting nerves_discovery (Hex package)63* Getting tablet (Hex package)64* Getting exexec (Hex package)65* Getting poolboy (Hex package)66* Getting erlexec (Hex package)67Found retired packages, see above for details68==> nerves_system_br69Generated nerves_system_br app70==> circular_buffer71Compiling 1 file (.ex)72Generated circular_buffer app73==> tablet74Compiling 2 files (.ex)75Generated tablet app76==> nerves_compatibility_test77===> Fetching pc v1.15.078===> Analyzing applications...79===> Compiling pc80===> Compiling c_src/ei++.cpp81===> Compiling c_src/exec.cpp82===> Compiling c_src/exec_impl.cpp83===> Linking /work/proj/_build/mangopi_mq_pro/lib/erlexec/priv/riscv64-nerves-linux-gnu/exec-port84===> Analyzing applications...85===> Compiling erlexec86==> exexec87Compiling 2 files (.ex)88Generated exexec app89==> elixir_make90Compiling 8 files (.ex)91Generated elixir_make app92==> nerves_logging93 CC kmsg_tailer.o94 LD kmsg_tailer95Compiling 5 files (.ex)96Generated nerves_logging app97==> nerves_discovery98Compiling 5 files (.ex)99Generated nerves_discovery app100==> ring_logger101Compiling 7 files (.ex)102Generated ring_logger app103==> nerves_compatibility_test104===> Analyzing applications...105===> Compiling poolboy106==> resamplex107gcc -std=c99 -g -Wall `pkg-config --cflags vips` -D_LARGEFILE_SOURCE -D_LARGEFILE64_SOURCE -D_FILE_OFFSET_BITS=64 --sysroot /home/nerves/.nerves/artifacts/nerves_system_mangopi_mq_pro-0.17.2/staging riscv64 -c -o c_src/convert.o c_src/convert.c108mkdir -p priv_dir109Package vips was not found in the pkg-config search path.110Perhaps you should add the directory containing `vips.pc'111to the PKG_CONFIG_PATH environment variable112Package 'vips', required by 'virtual:world', not found113In file included from /home/nerves/.nerves/artifacts/nerves_system_mangopi_mq_pro-0.17.2/staging/usr/include/bits/libc-header-start.h:33,114                 from /home/nerves/.nerves/artifacts/nerves_system_mangopi_mq_pro-0.17.2/staging/usr/include/math.h:27,115                 from c_src/convert.c:7:116/home/nerves/.nerves/artifacts/nerves_system_mangopi_mq_pro-0.17.2/staging/usr/include/features.h:205:3: warning: #warning "_BSD_SOURCE and _SVID_SOURCE are deprecated, use _DEFAULT_SOURCE" [-Wcpp]117  205 | # warning "_BSD_SOURCE and _SVID_SOURCE are deprecated, use _DEFAULT_SOURCE"118      |   ^~~~~~~119In file included from /home/nerves/.nerves/artifacts/nerves_system_mangopi_mq_pro-0.17.2/staging/usr/include/features-time64.h:20,120                 from /home/nerves/.nerves/artifacts/nerves_system_mangopi_mq_pro-0.17.2/staging/usr/include/features.h:431:121/home/nerves/.nerves/artifacts/nerves_system_mangopi_mq_pro-0.17.2/staging/usr/include/bits/wordsize.h:22:3: error: #error unsupported ABI122   22 | # error unsupported ABI123      |   ^~~~~124In file included from /home/nerves/.nerves/artifacts/nerves_system_mangopi_mq_pro-0.17.2/staging/usr/include/sys/cdefs.h:730,125                 from /home/nerves/.nerves/artifacts/nerves_system_mangopi_mq_pro-0.17.2/staging/usr/include/features.h:540:126/home/nerves/.nerves/artifacts/nerves_system_mangopi_mq_pro-0.17.2/staging/usr/include/bits/wordsize.h:22:3: error: #error unsupported ABI127   22 | # error unsupported ABI128      |   ^~~~~129In file included from /home/nerves/.nerves/artifacts/nerves_system_mangopi_mq_pro-0.17.2/staging/usr/include/gnu/stubs.h:5,130                 from /home/nerves/.nerves/artifacts/nerves_system_mangopi_mq_pro-0.17.2/staging/usr/include/features.h:564:131/home/nerves/.nerves/artifacts/nerves_system_mangopi_mq_pro-0.17.2/staging/usr/include/bits/wordsize.h:22:3: error: #error unsupported ABI132   22 | # error unsupported ABI133      |   ^~~~~134In file included from /home/nerves/.nerves/artifacts/nerves_system_mangopi_mq_pro-0.17.2/staging/usr/include/bits/types.h:27,135                 from /home/nerves/.nerves/artifacts/nerves_system_mangopi_mq_pro-0.17.2/staging/usr/include/sys/types.h:29,136                 from /home/nerves/.nerves/artifacts/nerves_system_mangopi_mq_pro-0.17.2/staging/usr/include/stdlib.h:518,137                 from c_src/convert.c:8:138/home/nerves/.nerves/artifacts/nerves_system_mangopi_mq_pro-0.17.2/staging/usr/include/bits/wordsize.h:22:3: error: #error unsupported ABI139   22 | # error unsupported ABI140      |   ^~~~~141/home/nerves/.nerves/artifacts/nerves_system_mangopi_mq_pro-0.17.2/staging/usr/include/bits/types.h:139:3: error: #error 142  139 | # error143      |   ^~~~~144/home/nerves/.nerves/artifacts/nerves_system_mangopi_mq_pro-0.17.2/staging/usr/include/bits/types.h:145:1: error: unknown type name ‘__STD_TYPE’145  145 | __STD_TYPE __DEV_T_TYPE __dev_t;        /* Type of device numbers.  */146      | ^~~~~~~~~~147/home/nerves/.nerves/artifacts/nerves_system_mangopi_mq_pro-0.17.2/staging/usr/include/bits/types.h:145:25: error: expected ‘=’, ‘,’, ‘;’, ‘asm’ or ‘__attribute__’ before ‘__dev_t’148  145 | __STD_TYPE __DEV_T_TYPE __dev_t;        /* Type of device numbers.  */149      |                         ^~~~~~~150/home/nerves/.nerves/artifacts/nerves_system_mangopi_mq_pro-0.17.2/staging/usr/include/bits/types.h:146:11: error: expected ‘;’ before ‘unsigned’151  146 | __STD_TYPE __UID_T_TYPE __uid_t;        /* Type of user identifications.  */152      |           ^153      |           ;154/home/nerves/.nerves/artifacts/nerves_system_mangopi_mq_pro-0.17.2/staging/usr/include/bits/types.h:147:11: error: expected ‘;’ before ‘unsigned’155  147 | __STD_TYPE __GID_T_TYPE __gid_t;        /* Type of group identifications.  */156      |           ^157      |           ;158/home/nerves/.nerves/artifacts/nerves_system_mangopi_mq_pro-0.17.2/staging/usr/include/bits/types.h:148:11: error: expected ‘;’ before ‘unsigned’159  148 | __STD_TYPE __INO_T_TYPE __ino_t;        /* Type of file serial numbers.  */160      |           ^161      |           ;162/home/nerves/.nerves/artifacts/nerves_system_mangopi_mq_pro-0.17.2/staging/usr/include/bits/types.h:149:1: error: unknown type name ‘__STD_TYPE’163  149 | __STD_TYPE __INO64_T_TYPE __ino64_t;    /* Type of file serial numbers (LFS).*/164      | ^~~~~~~~~~165/home/nerves/.nerves/artifacts/nerves_system_mangopi_mq_pro-0.17.2/staging/usr/include/bits/types.h:149:27: error: expected ‘=’, ‘,’, ‘;’, ‘asm’ or ‘__attribute__’ before ‘__ino64_t’166  149 | __STD_TYPE __INO64_T_TYPE __ino64_t;    /* Type of file serial numbers (LFS).*/167      |                           ^~~~~~~~~168/home/nerves/.nerves/artifacts/nerves_system_mangopi_mq_pro-0.17.2/staging/usr/include/bits/types.h:150:11: error: expected ‘;’ before ‘unsigned’169  150 | __STD_TYPE __MODE_T_TYPE __mode_t;      /* Type of file attribute bitmasks.  */170      |           ^171      |           ;172/home/nerves/.nerves/artifacts/nerves_system_mangopi_mq_pro-0.17.2/staging/usr/include/bits/types.h:151:11: error: expected ‘;’ before ‘unsigned’173  151 | __STD_TYPE __NLINK_T_TYPE __nlink_t;    /* Type of file link counts.  */174      |           ^175      |           ;176/home/nerves/.nerves/artifacts/nerves_system_mangopi_mq_pro-0.17.2/staging/usr/include/bits/types.h:152:11: error: expected ‘;’ before ‘long’177  152 | __STD_TYPE __OFF_T_TYPE __off_t;        /* Type of file sizes and offsets.  */178      |           ^179      |           ;180/home/nerves/.nerves/artifacts/nerves_system_mangopi_mq_pro-0.17.2/staging/usr/include/bits/types.h:153:1: error: unknown type name ‘__STD_TYPE’181  153 | __STD_TYPE __OFF64_T_TYPE __off64_t;    /* Type of file sizes and offsets (LFS).  */182      | ^~~~~~~~~~183/home/nerves/.nerves/artifacts/nerves_system_mangopi_mq_pro-0.17.2/staging/usr/include/bits/types.h:153:27: error: expected ‘=’, ‘,’, ‘;’, ‘asm’ or ‘__attribute__’ before ‘__off64_t’184  153 | __STD_TYPE __OFF64_T_TYPE __off64_t;    /* Type of file sizes and offsets (LFS).  */185      |                           ^~~~~~~~~186/home/nerves/.nerves/artifacts/nerves_system_mangopi_mq_pro-0.17.2/staging/usr/include/bits/types.h:154:11: error: expected ‘;’ before ‘int’187  154 | __STD_TYPE __PID_T_TYPE __pid_t;        /* Type of process identifications.  */188      |           ^189      |           ;190/home/nerves/.nerves/artifacts/nerves_system_mangopi_mq_pro-0.17.2/staging/usr/include/bits/types.h:155:11: error: expected ‘;’ before ‘struct’191  155 | __STD_TYPE __FSID_T_TYPE __fsid_t;      /* Type of file system IDs.  */192      |           ^193      |           ;194/home/nerves/.nerves/artifacts/nerves_system_mangopi_mq_pro-0.17.2/staging/usr/include/bits/types.h:156:11: error: expected ‘;’ before ‘long’195  156 | __STD_TYPE __CLOCK_T_TYPE __clock_t;    /* Type of CPU usage counts.  */196      |           ^197      |           ;198/home/nerves/.nerves/artifacts/nerves_system_mangopi_mq_pro-0.17.2/staging/usr/include/bits/types.h:157:11: error: expected ‘;’ before ‘unsigned’199  157 | __STD_TYPE __RLIM_T_TYPE __rlim_t;      /* Type for resource measurement.  */200      |           ^201      |           ;202/home/nerves/.nerves/artifacts/nerves_system_mangopi_mq_pro-0.17.2/staging/usr/include/bits/types.h:158:1: error: unknown type name ‘__STD_TYPE’203  158 | __STD_TYPE __RLIM64_T_TYPE __rlim64_t;  /* Type for resource measurement (LFS).  */204      | ^~~~~~~~~~205/home/nerves/.nerves/artifacts/nerves_system_mangopi_mq_pro-0.17.2/staging/usr/include/bits/types.h:158:28: error: expected ‘=’, ‘,’, ‘;’, ‘asm’ or ‘__attribute__’ before ‘__rlim64_t’206  158 | __STD_TYPE __RLIM64_T_TYPE __rlim64_t;  /* Type for resource measurement (LFS).  */207      |                            ^~~~~~~~~~208/home/nerves/.nerves/artifacts/nerves_system_mangopi_mq_pro-0.17.2/staging/usr/include/bits/types.h:159:11: error: expected ‘;’ before ‘unsigned’209  159 | __STD_TYPE __ID_T_TYPE __id_t;          /* General type for IDs.  */210      |           ^211      |           ;212/home/nerves/.nerves/artifacts/nerves_system_mangopi_mq_pro-0.17.2/staging/usr/include/bits/types.h:160:11: error: expected ‘;’ before ‘long’213  160 | __STD_TYPE __TIME_T_TYPE __time_t;      /* Seconds since the Epoch.  */214      |           ^215      |           ;216/home/nerves/.nerves/artifacts/nerves_system_mangopi_mq_pro-0.17.2/staging/usr/include/bits/types.h:161:11: error: expected ‘;’ before ‘unsigned’217  161 | __STD_TYPE __USECONDS_T_TYPE __useconds_t; /* Count of microseconds.  */218      |           ^219      |           ;220/home/nerves/.nerves/artifacts/nerves_system_mangopi_mq_pro-0.17.2/staging/usr/include/bits/types.h:162:11: error: expected ‘;’ before ‘long’221  162 | __STD_TYPE __SUSECONDS_T_TYPE __suseconds_t; /* Signed count of microseconds.  */222      |           ^223      |           ;224/home/nerves/.nerves/artifacts/nerves_system_mangopi_mq_pro-0.17.2/staging/usr/include/bits/types.h:163:1: error: unknown type name ‘__STD_TYPE’225  163 | __STD_TYPE __SUSECONDS64_T_TYPE __suseconds64_t;226      | ^~~~~~~~~~227/home/nerves/.nerves/artifacts/nerves_system_mangopi_mq_pro-0.17.2/staging/usr/include/bits/types.h:163:33: error: expected ‘=’, ‘,’, ‘;’, ‘asm’ or ‘__attribute__’ before ‘__suseconds64_t’228  163 | __STD_TYPE __SUSECONDS64_T_TYPE __suseconds64_t;229      |                                 ^~~~~~~~~~~~~~~230/home/nerves/.nerves/artifacts/nerves_system_mangopi_mq_pro-0.17.2/staging/usr/include/bits/types.h:165:11: error: expected ‘;’ before ‘int’231  165 | __STD_TYPE __DADDR_T_TYPE __daddr_t;    /* The type of a disk address.  */232      |           ^233      |           ;234/home/nerves/.nerves/artifacts/nerves_system_mangopi_mq_pro-0.17.2/staging/usr/include/bits/types.h:166:11: error: expected ‘;’ before ‘int’235  166 | __STD_TYPE __KEY_T_TYPE __key_t;        /* Type of an IPC key.  */236      |           ^237      |           ;238/home/nerves/.nerves/artifacts/nerves_system_mangopi_mq_pro-0.17.2/staging/usr/include/bits/types.h:169:11: error: expected ‘;’ before ‘int’239  169 | __STD_TYPE __CLOCKID_T_TYPE __clockid_t;240      |           ^241      |           ;242/home/nerves/.nerves/artifacts/nerves_system_mangopi_mq_pro-0.17.2/staging/usr/include/bits/types.h:172:11: error: expected ‘;’ before ‘void’243  172 | __STD_TYPE __TIMER_T_TYPE __timer_t;244      |           ^245      |           ;246/home/nerves/.nerves/artifacts/nerves_system_mangopi_mq_pro-0.17.2/staging/usr/include/bits/types.h:175:11: error: expected ‘;’ before ‘int’247  175 | __STD_TYPE __BLKSIZE_T_TYPE __blksize_t;248      |           ^249      |           ;250/home/nerves/.nerves/artifacts/nerves_system_mangopi_mq_pro-0.17.2/staging/usr/include/bits/types.h:180:11: error: expected ‘;’ before ‘long’251  180 | __STD_TYPE __BLKCNT_T_TYPE __blkcnt_t;252      |           ^253      |           ;254/home/nerves/.nerves/artifacts/nerves_system_mangopi_mq_pro-0.17.2/staging/usr/include/bits/types.h:181:1: error: unknown type name ‘__STD_TYPE’255  181 | __STD_TYPE __BLKCNT64_T_TYPE __blkcnt64_t;256      | ^~~~~~~~~~257/home/nerves/.nerves/artifacts/nerves_system_mangopi_mq_pro-0.17.2/staging/usr/include/bits/types.h:181:30: error: expected ‘=’, ‘,’, ‘;’, ‘asm’ or ‘__attribute__’ before ‘__blkcnt64_t’258  181 | __STD_TYPE __BLKCNT64_T_TYPE __blkcnt64_t;259      |                              ^~~~~~~~~~~~260/home/nerves/.nerves/artifacts/nerves_system_mangopi_mq_pro-0.17.2/staging/usr/include/bits/types.h:184:11: error: expected ‘;’ before ‘unsigned’261  184 | __STD_TYPE __FSBLKCNT_T_TYPE __fsblkcnt_t;262      |           ^263      |           ;264/home/nerves/.nerves/artifacts/nerves_system_mangopi_mq_pro-0.17.2/staging/usr/include/bits/types.h:185:1: error: unknown type name ‘__STD_TYPE’265  185 | __STD_TYPE __FSBLKCNT64_T_TYPE __fsblkcnt64_t;266      | ^~~~~~~~~~267/home/nerves/.nerves/artifacts/nerves_system_mangopi_mq_pro-0.17.2/staging/usr/include/bits/types.h:185:32: error: expected ‘=’, ‘,’, ‘;’, ‘asm’ or ‘__attribute__’ before ‘__fsblkcnt64_t’268  185 | __STD_TYPE __FSBLKCNT64_T_TYPE __fsblkcnt64_t;269      |                                ^~~~~~~~~~~~~~270/home/nerves/.nerves/artifacts/nerves_system_mangopi_mq_pro-0.17.2/staging/usr/include/bits/types.h:188:11: error: expected ‘;’ before ‘unsigned’271  188 | __STD_TYPE __FSFILCNT_T_TYPE __fsfilcnt_t;272      |           ^273      |           ;274/home/nerves/.nerves/artifacts/nerves_system_mangopi_mq_pro-0.17.2/staging/usr/include/bits/types.h:189:1: error: unknown type name ‘__STD_TYPE’275  189 | __STD_TYPE __FSFILCNT64_T_TYPE __fsfilcnt64_t;276      | ^~~~~~~~~~277/home/nerves/.nerves/artifacts/nerves_system_mangopi_mq_pro-0.17.2/staging/usr/include/bits/types.h:189:32: error: expected ‘=’, ‘,’, ‘;’, ‘asm’ or ‘__attribute__’ before ‘__fsfilcnt64_t’278  189 | __STD_TYPE __FSFILCNT64_T_TYPE __fsfilcnt64_t;279      |                                ^~~~~~~~~~~~~~280/home/nerves/.nerves/artifacts/nerves_system_mangopi_mq_pro-0.17.2/staging/usr/include/bits/types.h:192:1: error: unknown type name ‘__STD_TYPE’281  192 | __STD_TYPE __FSWORD_T_TYPE __fsword_t;282      | ^~~~~~~~~~283/home/nerves/.nerves/artifacts/nerves_system_mangopi_mq_pro-0.17.2/staging/usr/include/bits/types.h:192:28: error: expected ‘=’, ‘,’, ‘;’, ‘asm’ or ‘__attribute__’ before ‘__fsword_t’284  192 | __STD_TYPE __FSWORD_T_TYPE __fsword_t;285      |                            ^~~~~~~~~~286/home/nerves/.nerves/artifacts/nerves_system_mangopi_mq_pro-0.17.2/staging/usr/include/bits/types.h:194:1: error: unknown type name ‘__STD_TYPE’287  194 | __STD_TYPE __SSIZE_T_TYPE __ssize_t; /* Type of a byte count, or error.  */288      | ^~~~~~~~~~289/home/nerves/.nerves/artifacts/nerves_system_mangopi_mq_pro-0.17.2/staging/usr/include/bits/types.h:194:27: error: expected ‘=’, ‘,’, ‘;’, ‘asm’ or ‘__attribute__’ before ‘__ssize_t’290  194 | __STD_TYPE __SSIZE_T_TYPE __ssize_t; /* Type of a byte count, or error.  */291      |                           ^~~~~~~~~292/home/nerves/.nerves/artifacts/nerves_system_mangopi_mq_pro-0.17.2/staging/usr/include/bits/types.h:197:11: error: expected ‘;’ before ‘long’293  197 | __STD_TYPE __SYSCALL_SLONG_TYPE __syscall_slong_t;294      |           ^295      |           ;296/home/nerves/.nerves/artifacts/nerves_system_mangopi_mq_pro-0.17.2/staging/usr/include/bits/types.h:199:11: error: expected ‘;’ before ‘unsigned’297  199 | __STD_TYPE __SYSCALL_ULONG_TYPE __syscall_ulong_t;298      |           ^299      |           ;300/home/nerves/.nerves/artifacts/nerves_system_mangopi_mq_pro-0.17.2/staging/usr/include/bits/types.h:203:9: error: unknown type name ‘__off64_t’301  203 | typedef __off64_t __loff_t;     /* Type of file sizes and offsets (LFS).  */302      |         ^~~~~~~~~303/home/nerves/.nerves/artifacts/nerves_system_mangopi_mq_pro-0.17.2/staging/usr/include/bits/types.h:207:1: error: unknown type name ‘__STD_TYPE’304  207 | __STD_TYPE __SWORD_TYPE __intptr_t;305      | ^~~~~~~~~~306/home/nerves/.nerves/artifacts/nerves_system_mangopi_mq_pro-0.17.2/staging/usr/include/bits/types.h:207:25: error: expected ‘=’, ‘,’, ‘;’, ‘asm’ or ‘__attribute__’ before ‘__intptr_t’307  207 | __STD_TYPE __SWORD_TYPE __intptr_t;308      |                         ^~~~~~~~~~309/home/nerves/.nerves/artifacts/nerves_system_mangopi_mq_pro-0.17.2/staging/usr/include/bits/types.h:210:11: error: expected ‘;’ before ‘unsigned’310  210 | __STD_TYPE __U32_TYPE __socklen_t;311      |           ^312      |           ;313/home/nerves/.nerves/artifacts/nerves_system_mangopi_mq_pro-0.17.2/staging/usr/include/sys/types.h:39:18: error: expected ‘=’, ‘,’, ‘;’, ‘asm’ or ‘__attribute__’ before ‘fsid_t’314   39 | typedef __fsid_t fsid_t;315      |                  ^~~~~~316/home/nerves/.nerves/artifacts/nerves_system_mangopi_mq_pro-0.17.2/staging/usr/include/sys/types.h:49:9: error: unknown type name ‘__ino64_t’317   49 | typedef __ino64_t ino_t;318      |         ^~~~~~~~~319/home/nerves/.nerves/artifacts/nerves_system_mangopi_mq_pro-0.17.2/staging/usr/include/sys/types.h:54:9: error: unknown type name ‘__ino64_t’320   54 | typedef __ino64_t ino64_t;321      |         ^~~~~~~~~322/home/nerves/.nerves/artifacts/nerves_system_mangopi_mq_pro-0.17.2/staging/usr/include/sys/types.h:59:9: error: unknown type name ‘__dev_t’323   59 | typedef __dev_t dev_t;324      |         ^~~~~~~325/home/nerves/.nerves/artifacts/nerves_system_mangopi_mq_pro-0.17.2/staging/usr/include/sys/types.h:64:17: error: expected ‘=’, ‘,’, ‘;’, ‘asm’ or ‘__attribute__’ before ‘gid_t’326   64 | typedef __gid_t gid_t;327      |                 ^~~~~328/home/nerves/.nerves/artifacts/nerves_system_mangopi_mq_pro-0.17.2/staging/usr/include/sys/types.h:69:18: error: expected ‘=’, ‘,’, ‘;’, ‘asm’ or ‘__attribute__’ before ‘mode_t’329   69 | typedef __mode_t mode_t;330      |                  ^~~~~~331/home/nerves/.nerves/artifacts/nerves_system_mangopi_mq_pro-0.17.2/staging/usr/include/sys/types.h:74:19: error: expected ‘=’, ‘,’, ‘;’, ‘asm’ or ‘__attribute__’ before ‘nlink_t’332   74 | typedef __nlink_t nlink_t;333      |                   ^~~~~~~334/home/nerves/.nerves/artifacts/nerves_system_mangopi_mq_pro-0.17.2/staging/usr/include/sys/types.h:79:17: error: expected ‘=’, ‘,’, ‘;’, ‘asm’ or ‘__attribute__’ before ‘uid_t’335   79 | typedef __uid_t uid_t;336      |                 ^~~~~337/home/nerves/.nerves/artifacts/nerves_system_mangopi_mq_pro-0.17.2/staging/usr/include/sys/types.h:87:9: error: unknown type name ‘__off64_t’338   87 | typedef __off64_t off_t;339      |         ^~~~~~~~~340/home/nerves/.nerves/artifacts/nerves_system_mangopi_mq_pro-0.17.2/staging/usr/include/sys/types.h:92:9: error: unknown type name ‘__off64_t’341   92 | typedef __off64_t off64_t;342      |         ^~~~~~~~~343/home/nerves/.nerves/artifacts/nerves_system_mangopi_mq_pro-0.17.2/staging/usr/include/sys/types.h:97:17: error: expected ‘=’, ‘,’, ‘;’, ‘asm’ or ‘__attribute__’ before ‘pid_t’344   97 | typedef __pid_t pid_t;345      |                 ^~~~~346/home/nerves/.nerves/artifacts/nerves_system_mangopi_mq_pro-0.17.2/staging/usr/include/sys/types.h:103:16: error: expected ‘=’, ‘,’, ‘;’, ‘asm’ or ‘__attribute__’ before ‘id_t’347  103 | typedef __id_t id_t;348      |                ^~~~349/home/nerves/.nerves/artifacts/nerves_system_mangopi_mq_pro-0.17.2/staging/usr/include/sys/types.h:108:9: error: unknown type name ‘__ssize_t’350  108 | typedef __ssize_t ssize_t;351      |         ^~~~~~~~~352/home/nerves/.nerves/artifacts/nerves_system_mangopi_mq_pro-0.17.2/staging/usr/include/sys/types.h:114:19: error: expected ‘=’, ‘,’, ‘;’, ‘asm’ or ‘__attribute__’ before ‘daddr_t’353  114 | typedef __daddr_t daddr_t;354      |                   ^~~~~~~355/home/nerves/.nerves/artifacts/nerves_system_mangopi_mq_pro-0.17.2/staging/usr/include/sys/types.h:121:17: error: expected ‘=’, ‘,’, ‘;’, ‘asm’ or ‘__attribute__’ before ‘key_t’356  121 | typedef __key_t key_t;357      |                 ^~~~~358In file included from /home/nerves/.nerves/artifacts/nerves_system_mangopi_mq_pro-0.17.2/staging/usr/include/sys/types.h:126:359/home/nerves/.nerves/artifacts/nerves_system_mangopi_mq_pro-0.17.2/staging/usr/include/bits/types/clock_t.h:7:19: error: expected ‘=’, ‘,’, ‘;’, ‘asm’ or ‘__attribute__’ before ‘clock_t’360    7 | typedef __clock_t clock_t;361      |                   ^~~~~~~362In file included from /home/nerves/.nerves/artifacts/nerves_system_mangopi_mq_pro-0.17.2/staging/usr/include/sys/types.h:128:363/home/nerves/.nerves/artifacts/nerves_system_mangopi_mq_pro-0.17.2/staging/usr/include/bits/types/clockid_t.h:7:21: error: expected ‘=’, ‘,’, ‘;’, ‘asm’ or ‘__attribute__’ before ‘clockid_t’364    7 | typedef __clockid_t clockid_t;365      |                     ^~~~~~~~~366In file included from /home/nerves/.nerves/artifacts/nerves_system_mangopi_mq_pro-0.17.2/staging/usr/include/sys/types.h:129:367/home/nerves/.nerves/artifacts/nerves_system_mangopi_mq_pro-0.17.2/staging/usr/include/bits/types/time_t.h:10:18: error: expected ‘=’, ‘,’, ‘;’, ‘asm’ or ‘__attribute__’ before ‘time_t’368   10 | typedef __time_t time_t;369      |                  ^~~~~~370In file included from /home/nerves/.nerves/artifacts/nerves_system_mangopi_mq_pro-0.17.2/staging/usr/include/sys/types.h:130:371/home/nerves/.nerves/artifacts/nerves_system_mangopi_mq_pro-0.17.2/staging/usr/include/bits/types/timer_t.h:7:19: error: expected ‘=’, ‘,’, ‘;’, ‘asm’ or ‘__attribute__’ before ‘timer_t’372    7 | typedef __timer_t timer_t;373      |                   ^~~~~~~374In file included from /home/nerves/.nerves/artifacts/nerves_system_mangopi_mq_pro-0.17.2/staging/usr/include/sys/select.h:37,375                 from /home/nerves/.nerves/artifacts/nerves_system_mangopi_mq_pro-0.17.2/staging/usr/include/sys/types.h:179:376/home/nerves/.nerves/artifacts/nerves_system_mangopi_mq_pro-0.17.2/staging/usr/include/bits/types/struct_timeval.h:14:3: error: expected specifier-qualifier-list before ‘__time_t’377   14 |   __time_t tv_sec;              /* Seconds.  */378      |   ^~~~~~~~379In file included from /home/nerves/.nerves/artifacts/nerves_system_mangopi_mq_pro-0.17.2/staging/usr/include/sys/select.h:39:380/home/nerves/.nerves/artifacts/nerves_system_mangopi_mq_pro-0.17.2/staging/usr/include/bits/types/struct_timespec.h:16:3: error: expected specifier-qualifier-list before ‘__time_t’381   16 |   __time_t tv_sec;              /* Seconds.  */382      |   ^~~~~~~~383/home/nerves/.nerves/artifacts/nerves_system_mangopi_mq_pro-0.17.2/staging/usr/include/sys/select.h:43:23: error: expected ‘=’, ‘,’, ‘;’, ‘asm’ or ‘__attribute__’ before ‘suseconds_t’384   43 | typedef __suseconds_t suseconds_t;385      |                       ^~~~~~~~~~~386/home/nerves/.nerves/artifacts/nerves_system_mangopi_mq_pro-0.17.2/staging/usr/include/sys/types.h:185:21: error: expected ‘=’, ‘,’, ‘;’, ‘asm’ or ‘__attribute__’ before ‘blksize_t’387  185 | typedef __blksize_t blksize_t;388      |                     ^~~~~~~~~389/home/nerves/.nerves/artifacts/nerves_system_mangopi_mq_pro-0.17.2/staging/usr/include/sys/types.h:205:9: error: unknown type name ‘__blkcnt64_t’390  205 | typedef __blkcnt64_t blkcnt_t;     /* Type to count number of disk blocks.  */391      |         ^~~~~~~~~~~~392/home/nerves/.nerves/artifacts/nerves_system_mangopi_mq_pro-0.17.2/staging/usr/include/sys/types.h:209:9: error: unknown type name ‘__fsblkcnt64_t’393  209 | typedef __fsblkcnt64_t fsblkcnt_t; /* Type to count file system blocks.  */394      |         ^~~~~~~~~~~~~~395/home/nerves/.nerves/artifacts/nerves_system_mangopi_mq_pro-0.17.2/staging/usr/include/sys/types.h:213:9: error: unknown type name ‘__fsfilcnt64_t’396  213 | typedef __fsfilcnt64_t fsfilcnt_t; /* Type to count file system inodes.  */397      |         ^~~~~~~~~~~~~~398/home/nerves/.nerves/artifacts/nerves_system_mangopi_mq_pro-0.17.2/staging/usr/include/sys/types.h:219:9: error: unknown type name ‘__blkcnt64_t’399  219 | typedef __blkcnt64_t blkcnt64_t;     /* Type to count number of disk blocks. */400      |         ^~~~~~~~~~~~401/home/nerves/.nerves/artifacts/nerves_system_mangopi_mq_pro-0.17.2/staging/usr/include/sys/types.h:220:9: error: unknown type name ‘__fsblkcnt64_t’402  220 | typedef __fsblkcnt64_t fsblkcnt64_t; /* Type to count file system blocks.  */403      |         ^~~~~~~~~~~~~~404/home/nerves/.nerves/artifacts/nerves_system_mangopi_mq_pro-0.17.2/staging/usr/include/sys/types.h:221:9: error: unknown type name ‘__fsfilcnt64_t’405  221 | typedef __fsfilcnt64_t fsfilcnt64_t; /* Type to count file system inodes.  */406      |         ^~~~~~~~~~~~~~407In file included from /home/nerves/.nerves/artifacts/nerves_system_mangopi_mq_pro-0.17.2/staging/usr/include/stdio.h:44,408                 from c_src/convert.c:9:409/home/nerves/.nerves/artifacts/nerves_system_mangopi_mq_pro-0.17.2/staging/usr/include/bits/types/__fpos_t.h:12:3: error: expected specifier-qualifier-list before ‘__off_t’410   12 |   __off_t __pos;411      |   ^~~~~~~412In file included from /home/nerves/.nerves/artifacts/nerves_system_mangopi_mq_pro-0.17.2/staging/usr/include/stdio.h:45:413/home/nerves/.nerves/artifacts/nerves_system_mangopi_mq_pro-0.17.2/staging/usr/include/bits/types/__fpos64_t.h:12:3: error: unknown type name ‘__off64_t’414   12 |   __off64_t __pos;415      |   ^~~~~~~~~416In file included from /home/nerves/.nerves/artifacts/nerves_system_mangopi_mq_pro-0.17.2/staging/usr/include/bits/types/struct_FILE.h:35,417                 from /home/nerves/.nerves/artifacts/nerves_system_mangopi_mq_pro-0.17.2/staging/usr/include/stdio.h:48:418/home/nerves/.nerves/artifacts/nerves_system_mangopi_mq_pro-0.17.2/staging/usr/include/bits/wordsize.h:22:3: error: #error unsupported ABI419   22 | # error unsupported ABI420      |   ^~~~~421/home/nerves/.nerves/artifacts/nerves_system_mangopi_mq_pro-0.17.2/staging/usr/include/bits/types/struct_FILE.h:78:3: error: expected specifier-qualifier-list before ‘__off_t’422   78 |   __off_t _old_offset; /* This used to be _offset but it's too small.  */423      |   ^~~~~~~424In file included from /home/nerves/.nerves/artifacts/nerves_system_mangopi_mq_pro-0.17.2/staging/usr/include/stdio.h:51:425/home/nerves/.nerves/artifacts/nerves_system_mangopi_mq_pro-0.17.2/staging/usr/include/bits/types/cookie_io_functions_t.h:27:9: error: unknown type name ‘__ssize_t’426   27 | typedef __ssize_t cookie_read_function_t (void *__cookie, char *__buf,427      |         ^~~~~~~~~428/home/nerves/.nerves/artifacts/nerves_system_mangopi_mq_pro-0.17.2/staging/usr/include/bits/types/cookie_io_functions_t.h:36:9: error: unknown type name ‘__ssize_t’429   36 | typedef __ssize_t cookie_write_function_t (void *__cookie, const char *__buf,430      |         ^~~~~~~~~431/home/nerves/.nerves/artifacts/nerves_system_mangopi_mq_pro-0.17.2/staging/usr/include/bits/types/cookie_io_functions_t.h:45:53: error: unknown type name ‘__off64_t’; did you mean ‘off64_t’?432   45 | typedef int cookie_seek_function_t (void *__cookie, __off64_t *__pos, int __w);433      |                                                     ^~~~~~~~~434      |                                                     off64_t435/home/nerves/.nerves/artifacts/nerves_system_mangopi_mq_pro-0.17.2/staging/usr/include/bits/types/cookie_io_functions_t.h:59:3: error: unknown type name ‘cookie_seek_function_t’436   59 |   cookie_seek_function_t *seek;         /* Seek/tell file position.  */437      |   ^~~~~~~~~~~~~~~~~~~~~~438/home/nerves/.nerves/artifacts/nerves_system_mangopi_mq_pro-0.17.2/staging/usr/include/stdio.h:693:8: error: unknown type name ‘__ssize_t’439  693 | extern __ssize_t __getdelim (char **__restrict __lineptr,440      |        ^~~~~~~~~441/home/nerves/.nerves/artifacts/nerves_system_mangopi_mq_pro-0.17.2/staging/usr/include/stdio.h:696:8: error: unknown type name ‘__ssize_t’442  696 | extern __ssize_t getdelim (char **__restrict __lineptr,443      |        ^~~~~~~~~444/home/nerves/.nerves/artifacts/nerves_system_mangopi_mq_pro-0.17.2/staging/usr/include/stdio.h:701:8: error: unknown type name ‘__ssize_t’445  701 | extern __ssize_t getline (char **__restrict __lineptr,446      |        ^~~~~~~~~447/home/nerves/.nerves/artifacts/nerves_system_mangopi_mq_pro-0.17.2/staging/usr/include/stdio.h:806:12: error: unknown type name ‘__off64_t’; did you mean ‘off64_t’?448  806 | extern int __REDIRECT (fseeko,449      |            ^~~~~~~~~~450/home/nerves/.nerves/artifacts/nerves_system_mangopi_mq_pro-0.17.2/staging/usr/include/stdio.h:809:8: error: unknown type name ‘__off64_t’451  809 | extern __off64_t __REDIRECT (ftello, (FILE *__stream), ftello64)452      |        ^~~~~~~~~453/home/nerves/.nerves/artifacts/nerves_system_mangopi_mq_pro-0.17.2/staging/usr/include/stdio.h:845:38: error: unknown type name ‘__off64_t’; did you mean ‘off64_t’?454  845 | extern int fseeko64 (FILE *__stream, __off64_t __off, int __whence)455      |                                      ^~~~~~~~~456      |                                      off64_t457/home/nerves/.nerves/artifacts/nerves_system_mangopi_mq_pro-0.17.2/staging/usr/include/stdio.h:847:8: error: unknown type name ‘__off64_t’458  847 | extern __off64_t ftello64 (FILE *__stream) __wur __nonnull ((1));459      |        ^~~~~~~~~460In file included from /home/nerves/.nerves/artifacts/nerves_system_mangopi_mq_pro-0.17.2/staging/usr/include/bits/environments.h:22,461                 from /home/nerves/.nerves/artifacts/nerves_system_mangopi_mq_pro-0.17.2/staging/usr/include/unistd.h:206,462                 from c_src/convert.c:12:463/home/nerves/.nerves/artifacts/nerves_system_mangopi_mq_pro-0.17.2/staging/usr/include/bits/wordsize.h:22:3: error: #error unsupported ABI464   22 | # error unsupported ABI465      |   ^~~~~466/home/nerves/.nerves/artifacts/nerves_system_mangopi_mq_pro-0.17.2/staging/usr/include/unistd.h:255:22: error: expected ‘=’, ‘,’, ‘;’, ‘asm’ or ‘__attribute__’ before ‘useconds_t’467  255 | typedef __useconds_t useconds_t;468      |                      ^~~~~~~~~~469/home/nerves/.nerves/artifacts/nerves_system_mangopi_mq_pro-0.17.2/staging/usr/include/unistd.h:267:9: error: unknown type name ‘__intptr_t’470  267 | typedef __intptr_t intptr_t;471      |         ^~~~~~~~~~472/home/nerves/.nerves/artifacts/nerves_system_mangopi_mq_pro-0.17.2/staging/usr/include/unistd.h:274:21: error: expected ‘=’, ‘,’, ‘;’, ‘asm’ or ‘__attribute__’ before ‘socklen_t’473  274 | typedef __socklen_t socklen_t;474      |                     ^~~~~~~~~475/home/nerves/.nerves/artifacts/nerves_system_mangopi_mq_pro-0.17.2/staging/usr/include/unistd.h:342:8: error: unknown type name ‘__off64_t’476  342 | extern __off64_t __REDIRECT_NTH (lseek,477      |        ^~~~~~~~~478/home/nerves/.nerves/artifacts/nerves_system_mangopi_mq_pro-0.17.2/staging/usr/include/unistd.h:342:18: error: unknown type name ‘__off64_t’; did you mean ‘off64_t’?479  342 | extern __off64_t __REDIRECT_NTH (lseek,480      |                  ^~~~~~~~~~~~~~481/home/nerves/.nerves/artifacts/nerves_system_mangopi_mq_pro-0.17.2/staging/usr/include/unistd.h:350:8: error: unknown type name ‘__off64_t’482  350 | extern __off64_t lseek64 (int __fd, __off64_t __offset, int __whence)483      |        ^~~~~~~~~484/home/nerves/.nerves/artifacts/nerves_system_mangopi_mq_pro-0.17.2/staging/usr/include/unistd.h:350:37: error: unknown type name ‘__off64_t’; did you mean ‘off64_t’?485  350 | extern __off64_t lseek64 (int __fd, __off64_t __offset, int __whence)486      |                                     ^~~~~~~~~487      |                                     off64_t488/home/nerves/.nerves/artifacts/nerves_system_mangopi_mq_pro-0.17.2/staging/usr/include/unistd.h:404:16: error: unknown type name ‘__off64_t’; did you mean ‘off64_t’?489  404 | extern ssize_t __REDIRECT (pread, (int __fd, void *__buf, size_t __nbytes,490      |                ^~~~~~~~~~491/home/nerves/.nerves/artifacts/nerves_system_mangopi_mq_pro-0.17.2/staging/usr/include/unistd.h:408:16: error: unknown type name ‘__off64_t’; did you mean ‘off64_t’?492  408 | extern ssize_t __REDIRECT (pwrite, (int __fd, const void *__buf,493      |                ^~~~~~~~~~494/home/nerves/.nerves/artifacts/nerves_system_mangopi_mq_pro-0.17.2/staging/usr/include/unistd.h:423:25: error: unknown type name ‘__off64_t’; did you mean ‘off64_t’?495  423 |                         __off64_t __offset) __wur496      |                         ^~~~~~~~~497      |                         off64_t498/home/nerves/.nerves/artifacts/nerves_system_mangopi_mq_pro-0.17.2/staging/usr/include/unistd.h:428:26: error: unknown type name ‘__off64_t’; did you mean ‘off64_t’?499  428 |                          __off64_t __offset) __wur500      |                          ^~~~~~~~~501      |                          off64_t502/home/nerves/.nerves/artifacts/nerves_system_mangopi_mq_pro-0.17.2/staging/usr/include/unistd.h:472:21: error: expected ‘=’, ‘,’, ‘;’, ‘asm’ or ‘__attribute__’ before ‘ualarm’503  472 | extern __useconds_t ualarm (__useconds_t __value, __useconds_t __interval)504      |                     ^~~~~~505/home/nerves/.nerves/artifacts/nerves_system_mangopi_mq_pro-0.17.2/staging/usr/include/unistd.h:480:20: error: expected declaration specifiers or ‘...’ before ‘__useconds_t’506  480 | extern int usleep (__useconds_t __useconds);507      |                    ^~~~~~~~~~~~508/home/nerves/.nerves/artifacts/nerves_system_mangopi_mq_pro-0.17.2/staging/usr/include/unistd.h:493:39: error: expected declaration specifiers or ‘...’ before ‘__uid_t’509  493 | extern int chown (const char *__file, __uid_t __owner, __gid_t __group)510      |                                       ^~~~~~~511/home/nerves/.nerves/artifacts/nerves_system_mangopi_mq_pro-0.17.2/staging/usr/include/unistd.h:493:56: error: expected declaration specifiers or ‘...’ before ‘__gid_t’512  493 | extern int chown (const char *__file, __uid_t __owner, __gid_t __group)513      |                                                        ^~~~~~~514/home/nerves/.nerves/artifacts/nerves_system_mangopi_mq_pro-0.17.2/staging/usr/include/unistd.h:498:30: error: expected declaration specifiers or ‘...’ before ‘__uid_t’515  498 | extern int fchown (int __fd, __uid_t __owner, __gid_t __group) __THROW __wur;516      |                              ^~~~~~~517/home/nerves/.nerves/artifacts/nerves_system_mangopi_mq_pro-0.17.2/staging/usr/include/unistd.h:498:47: error: expected declaration specifiers or ‘...’ before ‘__gid_t’518  498 | extern int fchown (int __fd, __uid_t __owner, __gid_t __group) __THROW __wur;519      |                                               ^~~~~~~520/home/nerves/.nerves/artifacts/nerves_system_mangopi_mq_pro-0.17.2/staging/usr/include/unistd.h:503:40: error: expected declaration specifiers or ‘...’ before ‘__uid_t’521  503 | extern int lchown (const char *__file, __uid_t __owner, __gid_t __group)522      |                                        ^~~~~~~523/home/nerves/.nerves/artifacts/nerves_system_mangopi_mq_pro-0.17.2/staging/usr/include/unistd.h:503:57: error: expected declaration specifiers or ‘...’ before ‘__gid_t’524  503 | extern int lchown (const char *__file, __uid_t __owner, __gid_t __group)525      |                                                         ^~~~~~~526/home/nerves/.nerves/artifacts/nerves_system_mangopi_mq_pro-0.17.2/staging/usr/include/unistd.h:511:52: error: expected declaration specifiers or ‘...’ before ‘__uid_t’527  511 | extern int fchownat (int __fd, const char *__file, __uid_t __owner,528      |                                                    ^~~~~~~529/home/nerves/.nerves/artifacts/nerves_system_mangopi_mq_pro-0.17.2/staging/usr/include/unistd.h:512:22: error: expected declaration specifiers or ‘...’ before ‘__gid_t’530  512 |                      __gid_t __group, int __flag)531      |                      ^~~~~~~532/home/nerves/.nerves/artifacts/nerves_system_mangopi_mq_pro-0.17.2/staging/usr/include/unistd.h:650:16: error: expected ‘=’, ‘,’, ‘;’, ‘asm’ or ‘__attribute__’ before ‘getpid’533  650 | extern __pid_t getpid (void) __THROW;534      |                ^~~~~~535/home/nerves/.nerves/artifacts/nerves_system_mangopi_mq_pro-0.17.2/staging/usr/include/unistd.h:653:16: error: expected ‘=’, ‘,’, ‘;’, ‘asm’ or ‘__attribute__’ before ‘getppid’536  653 | extern __pid_t getppid (void) __THROW;537      |                ^~~~~~~538/home/nerves/.nerves/artifacts/nerves_system_mangopi_mq_pro-0.17.2/staging/usr/include/unistd.h:656:16: error: expected ‘=’, ‘,’, ‘;’, ‘asm’ or ‘__attribute__’ before ‘getpgrp’539  656 | extern __pid_t getpgrp (void) __THROW;540      |                ^~~~~~~541/home/nerves/.nerves/artifacts/nerves_system_mangopi_mq_pro-0.17.2/staging/usr/include/unistd.h:659:16: error: expected ‘=’, ‘,’, ‘;’, ‘asm’ or ‘__attribute__’ before ‘__getpgid’542  659 | extern __pid_t __getpgid (__pid_t __pid) __THROW;543      |                ^~~~~~~~~544/home/nerves/.nerves/artifacts/nerves_system_mangopi_mq_pro-0.17.2/staging/usr/include/unistd.h:661:16: error: expected ‘=’, ‘,’, ‘;’, ‘asm’ or ‘__attribute__’ before ‘getpgid’545  661 | extern __pid_t getpgid (__pid_t __pid) __THROW;546      |                ^~~~~~~547/home/nerves/.nerves/artifacts/nerves_system_mangopi_mq_pro-0.17.2/staging/usr/include/unistd.h:668:21: error: expected declaration specifiers or ‘...’ before ‘__pid_t’548  668 | extern int setpgid (__pid_t __pid, __pid_t __pgid) __THROW;549      |                     ^~~~~~~550/home/nerves/.nerves/artifacts/nerves_system_mangopi_mq_pro-0.17.2/staging/usr/include/unistd.h:668:36: error: expected declaration specifiers or ‘...’ before ‘__pid_t’551  668 | extern int setpgid (__pid_t __pid, __pid_t __pgid) __THROW;552      |                                    ^~~~~~~553/home/nerves/.nerves/artifacts/nerves_system_mangopi_mq_pro-0.17.2/staging/usr/include/unistd.h:689:16: error: expected ‘=’, ‘,’, ‘;’, ‘asm’ or ‘__attribute__’ before ‘setsid’554  689 | extern __pid_t setsid (void) __THROW;555      |                ^~~~~~556/home/nerves/.nerves/artifacts/nerves_system_mangopi_mq_pro-0.17.2/staging/usr/include/unistd.h:693:16: error: expected ‘=’, ‘,’, ‘;’, ‘asm’ or ‘__attribute__’ before ‘getsid’557  693 | extern __pid_t getsid (__pid_t __pid) __THROW;558      |                ^~~~~~559/home/nerves/.nerves/artifacts/nerves_system_mangopi_mq_pro-0.17.2/staging/usr/include/unistd.h:697:16: error: expected ‘=’, ‘,’, ‘;’, ‘asm’ or ‘__attribute__’ before ‘getuid’560  697 | extern __uid_t getuid (void) __THROW;561      |                ^~~~~~562/home/nerves/.nerves/artifacts/nerves_system_mangopi_mq_pro-0.17.2/staging/usr/include/unistd.h:700:16: error: expected ‘=’, ‘,’, ‘;’, ‘asm’ or ‘__attribute__’ before ‘geteuid’563  700 | extern __uid_t geteuid (void) __THROW;564      |                ^~~~~~~565/home/nerves/.nerves/artifacts/nerves_system_mangopi_mq_pro-0.17.2/staging/usr/include/unistd.h:703:16: error: expected ‘=’, ‘,’, ‘;’, ‘asm’ or ‘__attribute__’ before ‘getgid’566  703 | extern __gid_t getgid (void) __THROW;567      |                ^~~~~~568/home/nerves/.nerves/artifacts/nerves_system_mangopi_mq_pro-0.17.2/staging/usr/include/unistd.h:706:16: error: expected ‘=’, ‘,’, ‘;’, ‘asm’ or ‘__attribute__’ before ‘getegid’569  706 | extern __gid_t getegid (void) __THROW;570      |                ^~~~~~~571/home/nerves/.nerves/artifacts/nerves_system_mangopi_mq_pro-0.17.2/staging/usr/include/unistd.h:711:35: error: expected declaration specifiers or ‘...’ before ‘__gid_t’572  711 | extern int getgroups (int __size, __gid_t __list[]) __THROW __wur573      |                                   ^~~~~~~574/home/nerves/.nerves/artifacts/nerves_system_mangopi_mq_pro-0.17.2/staging/usr/include/unistd.h:722:20: error: expected declaration specifiers or ‘...’ before ‘__uid_t’575  722 | extern int setuid (__uid_t __uid) __THROW __wur;576      |                    ^~~~~~~577/home/nerves/.nerves/artifacts/nerves_system_mangopi_mq_pro-0.17.2/staging/usr/include/unistd.h:727:22: error: expected declaration specifiers or ‘...’ before ‘__uid_t’578  727 | extern int setreuid (__uid_t __ruid, __uid_t __euid) __THROW __wur;579      |                      ^~~~~~~580/home/nerves/.nerves/artifacts/nerves_system_mangopi_mq_pro-0.17.2/staging/usr/include/unistd.h:727:38: error: expected declaration specifiers or ‘...’ before ‘__uid_t’581  727 | extern int setreuid (__uid_t __ruid, __uid_t __euid) __THROW __wur;582      |                                      ^~~~~~~583/home/nerves/.nerves/artifacts/nerves_system_mangopi_mq_pro-0.17.2/staging/usr/include/unistd.h:732:21: error: expected declaration specifiers or ‘...’ before ‘__uid_t’584  732 | extern int seteuid (__uid_t __uid) __THROW __wur;585      |                     ^~~~~~~586/home/nerves/.nerves/artifacts/nerves_system_mangopi_mq_pro-0.17.2/staging/usr/include/unistd.h:739:20: error: expected declaration specifiers or ‘...’ before ‘__gid_t’587  739 | extern int setgid (__gid_t __gid) __THROW __wur;588      |                    ^~~~~~~589/home/nerves/.nerves/artifacts/nerves_system_mangopi_mq_pro-0.17.2/staging/usr/include/unistd.h:744:22: error: expected declaration specifiers or ‘...’ before ‘__gid_t’590  744 | extern int setregid (__gid_t __rgid, __gid_t __egid) __THROW __wur;591      |                      ^~~~~~~592/home/nerves/.nerves/artifacts/nerves_system_mangopi_mq_pro-0.17.2/staging/usr/include/unistd.h:744:38: error: expected declaration specifiers or ‘...’ before ‘__gid_t’593  744 | extern int setregid (__gid_t __rgid, __gid_t __egid) __THROW __wur;594      |                                      ^~~~~~~595/home/nerves/.nerves/artifacts/nerves_system_mangopi_mq_pro-0.17.2/staging/usr/include/unistd.h:749:21: error: expected declaration specifiers or ‘...’ before ‘__gid_t’596  749 | extern int setegid (__gid_t __gid) __THROW __wur;597      |                     ^~~~~~~598/home/nerves/.nerves/artifacts/nerves_system_mangopi_mq_pro-0.17.2/staging/usr/include/unistd.h:778:16: error: expected ‘=’, ‘,’, ‘;’, ‘asm’ or ‘__attribute__’ before ‘fork’599  778 | extern __pid_t fork (void) __THROWNL;600      |                ^~~~601/home/nerves/.nerves/artifacts/nerves_system_mangopi_mq_pro-0.17.2/staging/usr/include/unistd.h:786:16: error: expected ‘=’, ‘,’, ‘;’, ‘asm’ or ‘__attribute__’ before ‘vfork’602  786 | extern __pid_t vfork (void) __THROW;603      |                ^~~~~604/home/nerves/.nerves/artifacts/nerves_system_mangopi_mq_pro-0.17.2/staging/usr/include/unistd.h:871:16: error: expected ‘=’, ‘,’, ‘;’, ‘asm’ or ‘__attribute__’ before ‘tcgetpgrp’605  871 | extern __pid_t tcgetpgrp (int __fd) __THROW;606      |                ^~~~~~~~~607/home/nerves/.nerves/artifacts/nerves_system_mangopi_mq_pro-0.17.2/staging/usr/include/unistd.h:874:33: error: expected declaration specifiers or ‘...’ before ‘__pid_t’608  874 | extern int tcsetpgrp (int __fd, __pid_t __pgrp_id) __THROW;609      |                                 ^~~~~~~610/home/nerves/.nerves/artifacts/nerves_system_mangopi_mq_pro-0.17.2/staging/usr/include/unistd.h:1030:12: error: unknown type name ‘__off64_t’; did you mean ‘off64_t’?611 1030 | extern int __REDIRECT_NTH (truncate,612      |            ^~~~~~~~~~~~~~613/home/nerves/.nerves/artifacts/nerves_system_mangopi_mq_pro-0.17.2/staging/usr/include/unistd.h:1038:44: error: unknown type name ‘__off64_t’; did you mean ‘off64_t’?614 1038 | extern int truncate64 (const char *__file, __off64_t __length)615      |                                            ^~~~~~~~~616      |                                            off64_t617/home/nerves/.nerves/artifacts/nerves_system_mangopi_mq_pro-0.17.2/staging/usr/include/unistd.h:1052:12: error: unknown type name ‘__off64_t’; did you mean ‘off64_t’?618 1052 | extern int __REDIRECT_NTH (ftruncate, (int __fd, __off64_t __length),619      |            ^~~~~~~~~~~~~~620/home/nerves/.nerves/artifacts/nerves_system_mangopi_mq_pro-0.17.2/staging/usr/include/unistd.h:1059:35: error: unknown type name ‘__off64_t’; did you mean ‘off64_t’?621 1059 | extern int ftruncate64 (int __fd, __off64_t __length) __THROW __wur;622      |                                   ^~~~~~~~~623      |                                   off64_t624/home/nerves/.nerves/artifacts/nerves_system_mangopi_mq_pro-0.17.2/staging/usr/include/unistd.h:1117:12: error: unknown type name ‘__off64_t’; did you mean ‘off64_t’?625 1117 | extern int __REDIRECT (lockf, (int __fd, int __cmd, __off64_t __len),626      |            ^~~~~~~~~~627/home/nerves/.nerves/artifacts/nerves_system_mangopi_mq_pro-0.17.2/staging/usr/include/unistd.h:1124:42: error: unknown type name ‘__off64_t’; did you mean ‘off64_t’?628 1124 | extern int lockf64 (int __fd, int __cmd, __off64_t __len) __wur;629      |                                          ^~~~~~~~~630      |                                          off64_t631c_src/convert.c:13:10: fatal error: vips/vips.h: No such file or directory632   13 | #include <vips/vips.h>633      |          ^~~~~~~~~~~~~634compilation terminated.635make: *** [<builtin>: c_src/convert.o] Error 1636could not compile dependency :resamplex, "mix compile" failed. Errors may have been logged above. You can recompile this dependency with "mix deps.compile resamplex --force", update it with "mix deps.update resamplex" or clean it with "mix deps.clean resamplex"637==> nerves_compatibility_test638** (Mix) Could not compile with "make" (exit status: 2).639You need to have gcc and make installed. If you are using640Ubuntu or any other Debian-based system, install the packages641"build-essential". Also install "erlang-dev" package if not642included in your Erlang/OTP version. If you're on Fedora, run643"dnf group install 'Development Tools'".644