sass_compiler

Build log

nerves_system_qemu_aarch64

sass_compiler 0.1.18 · fail · run sass_compiler-0.1.18-1791094297797
103 of 103 lines
1Resolving Hex dependencies...2Resolution completed in 0.091s3Unchanged:4  circular_buffer 1.1.05  elixir_make 0.10.06  interactive_cmd 0.1.47  nerves 2.0.0-pre.28  nerves_discovery 0.1.59  nerves_logging 0.2.410  nerves_runtime 0.13.1311  nerves_system_bbb 2.30.212  nerves_system_br 1.34.413  nerves_system_mangopi_mq_pro 0.17.214  nerves_system_qemu_aarch64 0.4.215  nerves_system_rpi0 2.1.216  nerves_system_rpi4 2.1.217  nerves_system_rpi5 2.1.218  nerves_system_trellis 0.5.019  nerves_system_x86_64 1.34.220  nerves_toolchain_aarch64_nerves_linux_gnu 15.3.121  nerves_toolchain_armv6_nerves_linux_gnueabihf 15.3.122  nerves_toolchain_armv7_nerves_linux_gnueabihf 15.3.123  nerves_toolchain_riscv64_nerves_linux_gnu 15.3.124  nerves_toolchain_x86_64_nerves_linux_musl 15.3.125  nerves_uevent 0.1.726  property_table 0.3.427  ring_logger 0.11.728  sass_compiler 0.1.1829  tablet 0.3.330  toolshed 0.5.031  uboot_env 1.0.232* Getting sass_compiler (Hex package)33* Getting nerves (Hex package)34* Getting ring_logger (Hex package)35* Getting toolshed (Hex package)36* Getting nerves_runtime (Hex package)37* Getting nerves_system_bbb (Hex package)38* Getting nerves_system_mangopi_mq_pro (Hex package)39* Getting nerves_system_qemu_aarch64 (Hex package)40* Getting nerves_system_rpi0 (Hex package)41* Getting nerves_system_rpi4 (Hex package)42* Getting nerves_system_rpi5 (Hex package)43* Getting nerves_system_trellis (Hex package)44* Getting nerves_system_x86_64 (Hex package)45* Getting nerves_system_br (Hex package)46* Getting nerves_toolchain_x86_64_nerves_linux_musl (Hex package)47* Getting nerves_toolchain_armv7_nerves_linux_gnueabihf (Hex package)48* Getting nerves_toolchain_aarch64_nerves_linux_gnu (Hex package)49* Getting nerves_toolchain_armv6_nerves_linux_gnueabihf (Hex package)50* Getting nerves_toolchain_riscv64_nerves_linux_gnu (Hex package)51* Getting nerves_logging (Hex package)52* Getting nerves_uevent (Hex package)53* Getting uboot_env (Hex package)54* Getting elixir_make (Hex package)55* Getting property_table (Hex package)56* Getting circular_buffer (Hex package)57* Getting interactive_cmd (Hex package)58* Getting nerves_discovery (Hex package)59* Getting tablet (Hex package)60==> nerves_system_br61Generated nerves_system_br app62==> circular_buffer63Compiling 1 file (.ex)64Generated circular_buffer app65==> tablet66Compiling 2 files (.ex)67Generated tablet app68==> elixir_make69Compiling 8 files (.ex)70Generated elixir_make app71==> nerves_logging72 CC kmsg_tailer.o73 LD kmsg_tailer74Compiling 5 files (.ex)75Generated nerves_logging app76==> nerves_discovery77Compiling 5 files (.ex)78Generated nerves_discovery app79==> ring_logger80Compiling 7 files (.ex)81Generated ring_logger app82==> sass_compiler83/usr/bin/make -C libsass -j684make[1]: warning: -j6 forced in submake: resetting jobserver mode.85make[1]: Entering directory '/work/proj/deps_qemu_aarch64/sass_compiler/libsass'86g++ -mabi=lp64 -fstack-protector-strong -mcpu=cortex-a53 -fPIE -pie -D_LARGEFILE_SOURCE -D_LARGEFILE64_SOURCE -D_FILE_OFFSET_BITS=64  -pipe -O2 --sysroot /home/nerves/.nerves/artifacts/nerves_system_qemu_aarch64-0.4.2/staging -fPIC -O3 -Wall -Wextra -O2 -I /work/proj/deps_qemu_aarch64/sass_compiler/libsass/include  -fPIC -c -o src/cencode.o src/cencode.c87/home/nerves/.nerves/artifacts/nerves_toolchain_aarch64_nerves_linux_gnu-15.3.1/bin/aarch64-nerves-linux-gnu-g++ -mabi=lp64 -fstack-protector-strong -mcpu=cortex-a53 -fPIE -pie -D_LARGEFILE_SOURCE -D_LARGEFILE64_SOURCE -D_FILE_OFFSET_BITS=64  -pipe -O2 --sysroot /home/nerves/.nerves/artifacts/nerves_system_qemu_aarch64-0.4.2/staging -O2 -std=c++11 -I /work/proj/deps_qemu_aarch64/sass_compiler/libsass/include  -fPIC -c -o src/ast.o src/ast.cpp88g++: error: unrecognized argument in option ‘-mabi=lp64’89g++: note: valid arguments to ‘-mabi=’ are: ms sysv90g++: warning: ‘-mcpu=’ is deprecated; use ‘-mtune=’ or ‘-march=’ instead91make[1]: *** [Makefile:223: src/cencode.o] Error 192make[1]: *** Waiting for unfinished jobs....93make[1]: Leaving directory '/work/proj/deps_qemu_aarch64/sass_compiler/libsass'94make: *** [Makefile:46: all] Error 295could not compile dependency :sass_compiler, "mix compile" failed. Errors may have been logged above. You can recompile this dependency with "mix deps.compile sass_compiler --force", update it with "mix deps.update sass_compiler" or clean it with "mix deps.clean sass_compiler"96==> nerves_compatibility_test97** (Mix) Could not compile with "make" (exit status: 2).98You need to have gcc and make installed. If you are using99Ubuntu or any other Debian-based system, install the packages100"build-essential". Also install "erlang-dev" package if not101included in your Erlang/OTP version. If you're on Fedora, run102"dnf group install 'Development Tools'".103