Build log
nerves_system_mangopi_mq_pro
scenic_driver_glfw 0.10.1 · fail · run scenic_driver_glfw-0.10.1-1791095323856
717 of 717 lines
1Resolving Hex dependencies...2Resolution completed in 0.124s3Unchanged:4 circular_buffer 1.1.05 elixir_make 0.7.86 ex_image_info 0.2.77 font_metrics 0.5.28 interactive_cmd 0.1.49 nerves 2.0.0-pre.210 nerves_discovery 0.1.511 nerves_logging 0.2.412 nerves_runtime 0.13.1313 nerves_system_bbb 2.30.214 nerves_system_br 1.34.415 nerves_system_mangopi_mq_pro 0.17.216 nerves_system_qemu_aarch64 0.4.217 nerves_system_rpi0 2.1.218 nerves_system_rpi4 2.1.219 nerves_system_rpi5 2.1.220 nerves_system_trellis 0.5.021 nerves_system_x86_64 1.34.222 nerves_toolchain_aarch64_nerves_linux_gnu 15.3.123 nerves_toolchain_armv6_nerves_linux_gnueabihf 15.3.124 nerves_toolchain_armv7_nerves_linux_gnueabihf 15.3.125 nerves_toolchain_riscv64_nerves_linux_gnu 15.3.126 nerves_toolchain_x86_64_nerves_linux_musl 15.3.127 nerves_uevent 0.1.728 nimble_options 1.1.129 property_table 0.3.430 ring_logger 0.11.731 scenic 0.11.232 scenic_driver_glfw 0.10.133 tablet 0.3.334 toolshed 0.5.035 truetype_metrics 0.6.136 uboot_env 1.0.237* Getting scenic_driver_glfw (Hex package)38* Getting nerves (Hex package)39* Getting ring_logger (Hex package)40* Getting toolshed (Hex package)41* Getting nerves_runtime (Hex package)42* Getting nerves_system_bbb (Hex package)43* Getting nerves_system_mangopi_mq_pro (Hex package)44* Getting nerves_system_qemu_aarch64 (Hex package)45* Getting nerves_system_rpi0 (Hex package)46* Getting nerves_system_rpi4 (Hex package)47* Getting nerves_system_rpi5 (Hex package)48* Getting nerves_system_trellis (Hex package)49* Getting nerves_system_x86_64 (Hex package)50* Getting nerves_system_br (Hex package)51* Getting nerves_toolchain_x86_64_nerves_linux_musl (Hex package)52* Getting nerves_toolchain_armv7_nerves_linux_gnueabihf (Hex package)53* Getting nerves_toolchain_aarch64_nerves_linux_gnu (Hex package)54* Getting nerves_toolchain_armv6_nerves_linux_gnueabihf (Hex package)55* Getting nerves_toolchain_riscv64_nerves_linux_gnu (Hex package)56* Getting nerves_logging (Hex package)57* Getting nerves_uevent (Hex package)58* Getting uboot_env (Hex package)59* Getting elixir_make (Hex package)60* Getting property_table (Hex package)61* Getting circular_buffer (Hex package)62* Getting interactive_cmd (Hex package)63* Getting nerves_discovery (Hex package)64* Getting tablet (Hex package)65* Getting scenic (Hex package)66* Getting ex_image_info (Hex package)67* Getting font_metrics (Hex package)68* Getting nimble_options (Hex package)69* Getting truetype_metrics (Hex package)70==> nerves_system_br71Generated nerves_system_br app72==> circular_buffer73Compiling 1 file (.ex)74Generated circular_buffer app75==> nimble_options76Compiling 3 files (.ex)77Generated nimble_options app78==> tablet79Compiling 2 files (.ex)80Generated tablet app81warning: "xref: [exclude: ...]" in your mix.exs file is deprecated, instead use: "elixirc_options: [no_warn_undefined: ...]"82 (mix 1.20.3) lib/mix/tasks/compile.elixir.ex:243: Mix.Tasks.Compile.Elixir.xref_exclude_opts/283 (mix 1.20.3) lib/mix/tasks/compile.elixir.ex:142: Mix.Tasks.Compile.Elixir.run/184 (mix 1.20.3) lib/mix/task.ex:502: anonymous fn/3 in Mix.Task.run_task/585 (mix 1.20.3) lib/mix/task.compiler.ex:299: Mix.Task.Compiler.run_compiler/286 (mix 1.20.3) lib/mix/task.compiler.ex:287: Mix.Task.Compiler.run/487 (mix 1.20.3) lib/mix/tasks/compile.all.ex:75: Mix.Tasks.Compile.All.do_run/28889==> elixir_make90Compiling 6 files (.ex)91 warning: unused require Logger92 │93 6 │ require Logger94 │ ~95 │96 └─ lib/elixir_make/precompiler.ex:6:39798 warning: unused require Logger99 │100 4 │ require Logger101 │ ~102 │103 └─ lib/elixir_make/artefact.ex:4:3104105 warning: unused require Logger106 │107 16 │ require Logger108 │ ~109 │110 └─ lib/mix/tasks/elixir_make.precompile.ex:16:3111112Generated elixir_make app113==> nerves_logging114 CC kmsg_tailer.o115 LD kmsg_tailer116Compiling 5 files (.ex)117Generated nerves_logging app118==> nerves_discovery119Compiling 5 files (.ex)120Generated nerves_discovery app121==> ring_logger122Compiling 7 files (.ex)123Generated ring_logger app124==> interactive_cmd125Compiling 1 file (.ex)126Generated interactive_cmd app127==> nerves128Compiling 65 files (.ex)129 warning: redefining module Mix.Tasks.Nerves.Init (current version loaded from /work/proj/_build/mangopi_mq_pro/lib/nerves/ebin/Elixir.Mix.Tasks.Nerves.Init.beam)130 │131 6 │ defmodule Mix.Tasks.Nerves.Init do132 │ ~~~~~~~~~~~~~~~~~~~~~~~~~~~~~~~~~~133 │134 └─ lib/mix/tasks/nerves.init.ex:6: Mix.Tasks.Nerves.Init (module)135136 warning: redefining module Nerves (current version loaded from /work/proj/_build/mangopi_mq_pro/lib/nerves/ebin/Elixir.Nerves.beam)137 │138 6 │ defmodule Nerves do139 │ ~~~~~~~~~~~~~~~~~~~140 │141 └─ lib/nerves.ex:6: Nerves (module)142143 warning: redefining module Nerves.ArtifactResolver (current version loaded from /work/proj/_build/mangopi_mq_pro/lib/nerves/ebin/Elixir.Nerves.ArtifactResolver.beam)144 │145 5 │ defmodule Nerves.ArtifactResolver do146 │ ~~~~~~~~~~~~~~~~~~~~~~~~~~~~~~~~~~~~147 │148 └─ lib/nerves/artifact_resolver.ex:5: Nerves.ArtifactResolver (module)149150 warning: redefining module Nerves.BuildAction.AppModes (current version loaded from /work/proj/_build/mangopi_mq_pro/lib/nerves/ebin/Elixir.Nerves.BuildAction.AppModes.beam)151 │152 6 │ defmodule Nerves.BuildAction.AppModes do153 │ ~~~~~~~~~~~~~~~~~~~~~~~~~~~~~~~~~~~~~~~~154 │155 └─ lib/nerves/build_action/app_modes.ex:6: Nerves.BuildAction.AppModes (module)156157 warning: redefining module Nerves.BuildAction.CheckExecutables (current version loaded from /work/proj/_build/mangopi_mq_pro/lib/nerves/ebin/Elixir.Nerves.BuildAction.CheckExecutables.beam)158 │159 5 │ defmodule Nerves.BuildAction.CheckExecutables do160 │ ~~~~~~~~~~~~~~~~~~~~~~~~~~~~~~~~~~~~~~~~~~~~~~~~161 │162 └─ lib/nerves/build_action/check_executables.ex:5: Nerves.BuildAction.CheckExecutables (module)163164 warning: redefining module Nerves.BuildAction.Erlinit (current version loaded from /work/proj/_build/mangopi_mq_pro/lib/nerves/ebin/Elixir.Nerves.BuildAction.Erlinit.beam)165 │166 8 │ defmodule Nerves.BuildAction.Erlinit do167 │ ~~~~~~~~~~~~~~~~~~~~~~~~~~~~~~~~~~~~~~~168 │169 └─ lib/nerves/build_action/erlinit.ex:8: Nerves.BuildAction.Erlinit (module)170171 warning: redefining module Nerves.BuildAction.Firmware (current version loaded from /work/proj/_build/mangopi_mq_pro/lib/nerves/ebin/Elixir.Nerves.BuildAction.Firmware.beam)172 │173 5 │ defmodule Nerves.BuildAction.Firmware do174 │ ~~~~~~~~~~~~~~~~~~~~~~~~~~~~~~~~~~~~~~~~175 │176 └─ lib/nerves/build_action/firmware.ex:5: Nerves.BuildAction.Firmware (module)177178 warning: redefining module Nerves.BuildAction.IExStartupCheck (current version loaded from /work/proj/_build/mangopi_mq_pro/lib/nerves/ebin/Elixir.Nerves.BuildAction.IExStartupCheck.beam)179 │180 7 │ defmodule Nerves.BuildAction.IExStartupCheck do181 │ ~~~~~~~~~~~~~~~~~~~~~~~~~~~~~~~~~~~~~~~~~~~~~~~182 │183 └─ lib/nerves/build_action/iex_startup_check.ex:7: Nerves.BuildAction.IExStartupCheck (module)184185 warning: redefining module Nerves.BuildAction.NervesV1System (current version loaded from /work/proj/_build/mangopi_mq_pro/lib/nerves/ebin/Elixir.Nerves.BuildAction.NervesV1System.beam)186 │187 5 │ defmodule Nerves.BuildAction.NervesV1System do188 │ ~~~~~~~~~~~~~~~~~~~~~~~~~~~~~~~~~~~~~~~~~~~~~~189 │190 └─ lib/nerves/build_action/nerves_v1_system.ex:5: Nerves.BuildAction.NervesV1System (module)191192 warning: redefining module Nerves.BuildAction.NervesV1Toolchain (current version loaded from /work/proj/_build/mangopi_mq_pro/lib/nerves/ebin/Elixir.Nerves.BuildAction.NervesV1Toolchain.beam)193 │194 5 │ defmodule Nerves.BuildAction.NervesV1Toolchain do195 │ ~~~~~~~~~~~~~~~~~~~~~~~~~~~~~~~~~~~~~~~~~~~~~~~~~196 │197 └─ lib/nerves/build_action/nerves_v1_toolchain.ex:5: Nerves.BuildAction.NervesV1Toolchain (module)198199 warning: redefining module Nerves.BuildAction.Rootfs (current version loaded from /work/proj/_build/mangopi_mq_pro/lib/nerves/ebin/Elixir.Nerves.BuildAction.Rootfs.beam)200 │201 5 │ defmodule Nerves.BuildAction.Rootfs do202 │ ~~~~~~~~~~~~~~~~~~~~~~~~~~~~~~~~~~~~~~203 │204 └─ lib/nerves/build_action/rootfs.ex:5: Nerves.BuildAction.Rootfs (module)205206 warning: redefining module Nerves.BuildAction.SortApps (current version loaded from /work/proj/_build/mangopi_mq_pro/lib/nerves/ebin/Elixir.Nerves.BuildAction.SortApps.beam)207 │208 6 │ defmodule Nerves.BuildAction.SortApps do209 │ ~~~~~~~~~~~~~~~~~~~~~~~~~~~~~~~~~~~~~~~~210 │211 └─ lib/nerves/build_action/sort_apps.ex:6: Nerves.BuildAction.SortApps (module)212213 warning: redefining module Nerves.BuildAction.StripAll (current version loaded from /work/proj/_build/mangopi_mq_pro/lib/nerves/ebin/Elixir.Nerves.BuildAction.StripAll.beam)214 │215 5 │ defmodule Nerves.BuildAction.StripAll do216 │ ~~~~~~~~~~~~~~~~~~~~~~~~~~~~~~~~~~~~~~~~217 │218 └─ lib/nerves/build_action/strip_all.ex:5: Nerves.BuildAction.StripAll (module)219220 warning: redefining module Nerves.BuildPlan (current version loaded from /work/proj/_build/mangopi_mq_pro/lib/nerves/ebin/Elixir.Nerves.BuildPlan.beam)221 │222 5 │ defmodule Nerves.BuildPlan do223 │ ~~~~~~~~~~~~~~~~~~~~~~~~~~~~~224 │225 └─ lib/nerves/build_plan.ex:5: Nerves.BuildPlan (module)226227 warning: redefining module Nerves.BuildAction.Trimmer (current version loaded from /work/proj/_build/mangopi_mq_pro/lib/nerves/ebin/Elixir.Nerves.BuildAction.Trimmer.beam)228 │229 5 │ defmodule Nerves.BuildAction.Trimmer do230 │ ~~~~~~~~~~~~~~~~~~~~~~~~~~~~~~~~~~~~~~~231 │232 └─ lib/nerves/build_action/trimmer.ex:5: Nerves.BuildAction.Trimmer (module)233234 warning: redefining module Nerves.BuildPlan.Checks (current version loaded from /work/proj/_build/mangopi_mq_pro/lib/nerves/ebin/Elixir.Nerves.BuildPlan.Checks.beam)235 │236 5 │ defmodule Nerves.BuildPlan.Checks do237 │ ~~~~~~~~~~~~~~~~~~~~~~~~~~~~~~~~~~~~238 │239 └─ lib/nerves/build_plan/checks.ex:5: Nerves.BuildPlan.Checks (module)240241 warning: redefining module Nerves.Container (current version loaded from /work/proj/_build/mangopi_mq_pro/lib/nerves/ebin/Elixir.Nerves.Container.beam)242 │243 6 │ defmodule Nerves.Container do244 │ ~~~~~~~~~~~~~~~~~~~~~~~~~~~~~245 │246 └─ lib/nerves/container.ex:6: Nerves.Container (module)247248 warning: redefining module Nerves.Fingerprint (current version loaded from /work/proj/_build/mangopi_mq_pro/lib/nerves/ebin/Elixir.Nerves.Fingerprint.beam)249 │250 5 │ defmodule Nerves.Fingerprint do251 │ ~~~~~~~~~~~~~~~~~~~~~~~~~~~~~~~252 │253 └─ lib/nerves/fingerprint.ex:5: Nerves.Fingerprint (module)254255 warning: redefining module Nerves.MixPackage (current version loaded from /work/proj/_build/mangopi_mq_pro/lib/nerves/ebin/Elixir.Nerves.MixPackage.beam)256 │257 5 │ defmodule Nerves.MixPackage do258 │ ~~~~~~~~~~~~~~~~~~~~~~~~~~~~~~259 │260 └─ lib/nerves/mix_package.ex:5: Nerves.MixPackage (module)261262 warning: redefining module Nerves.Paths (current version loaded from /work/proj/_build/mangopi_mq_pro/lib/nerves/ebin/Elixir.Nerves.Paths.beam)263 │264 5 │ defmodule Nerves.Paths do265 │ ~~~~~~~~~~~~~~~~~~~~~~~~~266 │267 └─ lib/nerves/paths.ex:5: Nerves.Paths (module)268269 warning: redefining module Nerves.TargetTuple (current version loaded from /work/proj/_build/mangopi_mq_pro/lib/nerves/ebin/Elixir.Nerves.TargetTuple.beam)270 │271 5 │ defmodule Nerves.TargetTuple do272 │ ~~~~~~~~~~~~~~~~~~~~~~~~~~~~~~~273 │274 └─ lib/nerves/target_tuple.ex:5: Nerves.TargetTuple (module)275276Generated nerves app277==> nerves_toolchain_riscv64_nerves_linux_gnu278Compiling 1 file (.ex)279Generated nerves_toolchain_riscv64_nerves_linux_gnu app280==> nerves_system_mangopi_mq_pro281Generated nerves_system_mangopi_mq_pro app282==> font_metrics283Compiling 2 files (.ex)284Generated font_metrics app285==> truetype_metrics286Compiling 1 file (.ex)287 warning: the variable "offset" is accessed inside size(...) of a bitstring but it was defined outside of the match. You must precede it with the pin operator288 │289 334 │ <<_::binary-size(offset), cmap::binary>> = cmap_data290 │ ~291 │292 └─ lib/truetype_metrics.ex:334:26: TruetypeMetrics.do_parse_cmap_glyphs_ids/1293294 warning: the variable "skip" is accessed inside size(...) of a bitstring but it was defined outside of the match. You must precede it with the pin operator295 │296 446 │ <<_::binary-size(skip), id::unsigned-size(16)-big, _::binary>> = sub_table297 │ ~298 │299 └─ lib/truetype_metrics.ex:446:22: TruetypeMetrics.lookup_cmap_type_4/2300301 warning: the variable "offset" is accessed inside size(...) of a bitstring but it was defined outside of the match. You must precede it with the pin operator302 │303 678 │ _::binary-size(offset),304 │ ~305 │306 └─ lib/truetype_metrics.ex:678:26: TruetypeMetrics.get_table_data/3307308 warning: the variable "table_size" is accessed inside size(...) of a bitstring but it was defined outside of the match. You must precede it with the pin operator309 │310 679 │ table_data::binary-size(table_size),311 │ ~312 │313 └─ lib/truetype_metrics.ex:679:35: TruetypeMetrics.get_table_data/3314315 warning: the variable "offset" is accessed inside size(...) of a bitstring but it was defined outside of the match. You must precede it with the pin operator316 │317 700 │ _::binary-size(offset),318 │ ~319 │320 └─ lib/truetype_metrics.ex:700:22: TruetypeMetrics.do_get_table_data/2321322 warning: the variable "table_size" is accessed inside size(...) of a bitstring but it was defined outside of the match. You must precede it with the pin operator323 │324 701 │ table_data::binary-size(table_size),325 │ ~326 │327 └─ lib/truetype_metrics.ex:701:31: TruetypeMetrics.do_get_table_data/2328329Generated truetype_metrics app330==> uboot_env331Compiling 5 files (.ex)332Generated uboot_env app333==> ex_image_info334Compiling 12 files (.ex)335 warning: the variable "block_len" is accessed inside size(...) of a bitstring but it was defined outside of the match. You must precede it with the pin operator336 │337 41 │ <<_::bytes-size(block_len), 0xFF, sof::size(8), next::binary>> ->338 │ ~339 │340 └─ lib/ex_image_info/types/jpeg.ex:41:23: ExImageInfo.Types.JPEG.parse_jpeg_block/2341342 warning: the variable "idf_off_pos" is accessed inside size(...) of a bitstring but it was defined outside of the match. You must precede it with the pin operator343 │344 56 │ <<_skip1::bytes-size(idf_off_pos), _skip2::bytes-size(2),345 │ ~346 │347 └─ lib/ex_image_info/types/tiff.ex:56:28: ExImageInfo.Types.TIFF.parse_tiff_block/4348349 warning: the variable "buff_size" is accessed inside size(...) of a bitstring but it was defined outside of the match. You must precede it with the pin operator350 │351 57 │ buff_idf::bytes-size(buff_size), _::binary>> ->352 │ ~353 │354 └─ lib/ex_image_info/types/tiff.ex:57:30: ExImageInfo.Types.TIFF.parse_tiff_block/4355356 warning: unused require Bitwise357 │358 6 │ require Bitwise359 │ ~360 │361 └─ lib/ex_image_info/types/webp.ex:6:3362363 warning: unused require Bitwise364 │365 7 │ require Bitwise366 │ ~367 │368 └─ lib/ex_image_info/types/tiff.ex:7:3369370 warning: this clause of defp parse_jpeg_block/2 is never used (or it will always fail/warn when invoked)371 │372 49 │ defp parse_jpeg_block(_, _), do: nil373 │ ~374 │375 └─ lib/ex_image_info/types/jpeg.ex:49:8: ExImageInfo.Types.JPEG.parse_jpeg_block/2376377Generated ex_image_info app378==> scenic379mkdir -p /work/proj/_build/mangopi_mq_pro/lib/scenic/ebin/../priv380mkdir -p /work/proj/_build/mangopi_mq_pro/lib/scenic/ebin/../obj381/home/nerves/.nerves/artifacts/nerves_toolchain_riscv64_nerves_linux_gnu-15.3.1/bin/riscv64-nerves-linux-gnu-gcc -c -I/home/nerves/.nerves/artifacts/nerves_system_mangopi_mq_pro-0.17.2/staging/usr/lib/erlang/erts-17.0.6/include -I/home/nerves/.nerves/artifacts/nerves_system_mangopi_mq_pro-0.17.2/staging/usr/lib/erlang/lib/erl_interface-5.8.2/include -mabi=lp64d -fstack-protector-strong -march=rv64imafdc_zicsr_zifencei -fPIE -pie -Wl,-z,now -Wl,-z,relro -D_LARGEFILE_SOURCE -D_LARGEFILE64_SOURCE -D_FILE_OFFSET_BITS=64 -pipe -O2 --sysroot /home/nerves/.nerves/artifacts/nerves_system_mangopi_mq_pro-0.17.2/staging -fPIC -o /work/proj/_build/mangopi_mq_pro/lib/scenic/ebin/../obj/line.o c_src/line.c382/home/nerves/.nerves/artifacts/nerves_toolchain_riscv64_nerves_linux_gnu-15.3.1/bin/riscv64-nerves-linux-gnu-gcc -c -I/home/nerves/.nerves/artifacts/nerves_system_mangopi_mq_pro-0.17.2/staging/usr/lib/erlang/erts-17.0.6/include -I/home/nerves/.nerves/artifacts/nerves_system_mangopi_mq_pro-0.17.2/staging/usr/lib/erlang/lib/erl_interface-5.8.2/include -mabi=lp64d -fstack-protector-strong -march=rv64imafdc_zicsr_zifencei -fPIE -pie -Wl,-z,now -Wl,-z,relro -D_LARGEFILE_SOURCE -D_LARGEFILE64_SOURCE -D_FILE_OFFSET_BITS=64 -pipe -O2 --sysroot /home/nerves/.nerves/artifacts/nerves_system_mangopi_mq_pro-0.17.2/staging -fPIC -o /work/proj/_build/mangopi_mq_pro/lib/scenic/ebin/../obj/matrix.o c_src/matrix.c383/home/nerves/.nerves/artifacts/nerves_toolchain_riscv64_nerves_linux_gnu-15.3.1/bin/riscv64-nerves-linux-gnu-gcc -c -I/home/nerves/.nerves/artifacts/nerves_system_mangopi_mq_pro-0.17.2/staging/usr/lib/erlang/erts-17.0.6/include -I/home/nerves/.nerves/artifacts/nerves_system_mangopi_mq_pro-0.17.2/staging/usr/lib/erlang/lib/erl_interface-5.8.2/include -mabi=lp64d -fstack-protector-strong -march=rv64imafdc_zicsr_zifencei -fPIE -pie -Wl,-z,now -Wl,-z,relro -D_LARGEFILE_SOURCE -D_LARGEFILE64_SOURCE -D_FILE_OFFSET_BITS=64 -pipe -O2 --sysroot /home/nerves/.nerves/artifacts/nerves_system_mangopi_mq_pro-0.17.2/staging -fPIC -o /work/proj/_build/mangopi_mq_pro/lib/scenic/ebin/../obj/bitmap.o c_src/bitmap.c384/home/nerves/.nerves/artifacts/nerves_toolchain_riscv64_nerves_linux_gnu-15.3.1/bin/riscv64-nerves-linux-gnu-gcc /work/proj/_build/mangopi_mq_pro/lib/scenic/ebin/../obj/line.o -L/home/nerves/.nerves/artifacts/nerves_system_mangopi_mq_pro-0.17.2/staging/usr/lib/erlang/lib/erl_interface-5.8.2/lib -lei --sysroot=/home/nerves/.nerves/artifacts/nerves_system_mangopi_mq_pro-0.17.2/staging -shared -dynamiclib -o /work/proj/_build/mangopi_mq_pro/lib/scenic/ebin/../priv/line.so385/home/nerves/.nerves/artifacts/nerves_toolchain_riscv64_nerves_linux_gnu-15.3.1/bin/riscv64-nerves-linux-gnu-gcc /work/proj/_build/mangopi_mq_pro/lib/scenic/ebin/../obj/matrix.o -L/home/nerves/.nerves/artifacts/nerves_system_mangopi_mq_pro-0.17.2/staging/usr/lib/erlang/lib/erl_interface-5.8.2/lib -lei --sysroot=/home/nerves/.nerves/artifacts/nerves_system_mangopi_mq_pro-0.17.2/staging -shared -dynamiclib -o /work/proj/_build/mangopi_mq_pro/lib/scenic/ebin/../priv/matrix.so386/home/nerves/.nerves/artifacts/nerves_toolchain_riscv64_nerves_linux_gnu-15.3.1/bin/riscv64-nerves-linux-gnu-gcc /work/proj/_build/mangopi_mq_pro/lib/scenic/ebin/../obj/bitmap.o -L/home/nerves/.nerves/artifacts/nerves_system_mangopi_mq_pro-0.17.2/staging/usr/lib/erlang/lib/erl_interface-5.8.2/lib -lei --sysroot=/home/nerves/.nerves/artifacts/nerves_system_mangopi_mq_pro-0.17.2/staging -shared -dynamiclib -o /work/proj/_build/mangopi_mq_pro/lib/scenic/ebin/../priv/bitmap.so387Compiling 84 files (.ex)388 warning: using single-quoted strings to represent charlists is deprecated.389 Use ~c"" if you indeed want a charlist or use "" instead.390 You may run "mix format --migrate" to change all single-quoted391 strings to use the ~c sigil and fix this warning.392 │393 81 │ |> :filename.join('bitmap')394 │ ~395 │396 └─ lib/scenic/assets/stream/bitmap.ex:81:25397398 warning: the variable "skip" is accessed inside size(...) of a bitstring but it was defined outside of the match. You must precede it with the pin operator399 │400 190 │ <<_::binary-size(skip), g::8, _::binary>> = p401 │ ~402 │403 └─ lib/scenic/assets/stream/bitmap.ex:190:22: Scenic.Assets.Stream.Bitmap.do_get/4404405 warning: the variable "skip" is accessed inside size(...) of a bitstring but it was defined outside of the match. You must precede it with the pin operator406 │407 198 │ <<_::binary-size(skip), g::8, a::8, _::binary>> = p408 │ ~409 │410 └─ lib/scenic/assets/stream/bitmap.ex:198:22: Scenic.Assets.Stream.Bitmap.do_get/4411412 warning: the variable "skip" is accessed inside size(...) of a bitstring but it was defined outside of the match. You must precede it with the pin operator413 │414 206 │ <<_::binary-size(skip), r::8, g::8, b::8, _::binary>> = p415 │ ~416 │417 └─ lib/scenic/assets/stream/bitmap.ex:206:22: Scenic.Assets.Stream.Bitmap.do_get/4418419 warning: the variable "skip" is accessed inside size(...) of a bitstring but it was defined outside of the match. You must precede it with the pin operator420 │421 214 │ <<_::binary-size(skip), r::8, g::8, b::8, a::8, _::binary>> = p422 │ ~423 │424 └─ lib/scenic/assets/stream/bitmap.ex:214:22: Scenic.Assets.Stream.Bitmap.do_get/4425426 warning: using single-quoted strings to represent charlists is deprecated.427 Use ~c"" if you indeed want a charlist or use "" instead.428 You may run "mix format --migrate" to change all single-quoted429 strings to use the ~c sigil and fix this warning.430 │431 105 │ space_width = FontMetrics.width(' ', @default_font_size, fm)432 │ ~433 │434 └─ lib/scenic/component/input/checkbox.ex:105:37435436 warning: using single-quoted strings to represent charlists is deprecated.437 Use ~c"" if you indeed want a charlist or use "" instead.438 You may run "mix format --migrate" to change all single-quoted439 strings to use the ~c sigil and fix this warning.440 │441 177 │ space_width = FontMetrics.width(' ', @default_font_size, fm)442 │ ~443 │444 └─ lib/scenic/component/input/checkbox.ex:177:37445446 warning: using single-quoted strings to represent charlists is deprecated.447 Use ~c"" if you indeed want a charlist or use "" instead.448 You may run "mix format --migrate" to change all single-quoted449 strings to use the ~c sigil and fix this warning.450 │451 80 │ space_width = FontMetrics.width(' ', @default_font_size, fm)452 │ ~453 │454 └─ lib/scenic/component/input/radio_button.ex:80:37455456 warning: using single-quoted strings to represent charlists is deprecated.457 Use ~c"" if you indeed want a charlist or use "" instead.458 You may run "mix format --migrate" to change all single-quoted459 strings to use the ~c sigil and fix this warning.460 │461 143 │ space_width = FontMetrics.width(' ', @default_font_size, fm)462 │ ~463 │464 └─ lib/scenic/component/input/radio_button.ex:143:37465466 warning: using single-quoted strings to represent charlists is deprecated.467 Use ~c"" if you indeed want a charlist or use "" instead.468 You may run "mix format --migrate" to change all single-quoted469 strings to use the ~c sigil and fix this warning.470 │471 227 │ space_width = FontMetrics.width(' ', @default_font_size, fm)472 │ ~473 │474 └─ lib/scenic/component/input/radio_group.ex:227:37475476 warning: using single-quoted strings to represent charlists is deprecated.477 Use ~c"" if you indeed want a charlist or use "" instead.478 You may run "mix format --migrate" to change all single-quoted479 strings to use the ~c sigil and fix this warning.480 │481 113 │ @password_char '*'482 │ ~483 │484 └─ lib/scenic/component/input/text_field.ex:113:18485486warning: pattern matching on 0.0 is equivalent to matching only on +0.0. Instead you must match on +0.0 or -0.0487└─ lib/scenic/graph/bounds.ex: Scenic.Graph.Bounds.pts_arc_to/6488489warning: pattern matching on 0.0 is equivalent to matching only on +0.0. Instead you must match on +0.0 or -0.0490└─ lib/scenic/graph/bounds.ex: Scenic.Graph.Bounds.pts_arc_to/6491492 warning: using single-quoted strings to represent charlists is deprecated.493 Use ~c"" if you indeed want a charlist or use "" instead.494 You may run "mix format --migrate" to change all single-quoted495 strings to use the ~c sigil and fix this warning.496 │497 31 │ |> :filename.join('line')498 │ ~499 │500 └─ lib/scenic/math/line.ex:31:25501502 warning: using single-quoted strings to represent charlists is deprecated.503 Use ~c"" if you indeed want a charlist or use "" instead.504 You may run "mix format --migrate" to change all single-quoted505 strings to use the ~c sigil and fix this warning.506 │507 37 │ |> :filename.join('matrix')508 │ ~509 │510 └─ lib/scenic/math/matrix.ex:37:25511512 warning: the variable "skip_size" is accessed inside size(...) of a bitstring but it was defined outside of the match. You must precede it with the pin operator513 │514 490 │ _::binary-size(skip_size),515 │ ~516 │517 └─ lib/scenic/math/matrix.ex:490:22: Scenic.Math.Matrix.get/3518519 warning: the variable "skip_size" is accessed inside size(...) of a bitstring but it was defined outside of the match. You must precede it with the pin operator520 │521 521 │ pre::binary-size(skip_size),522 │ ~523 │524 └─ lib/scenic/math/matrix.ex:521:24: Scenic.Math.Matrix.put/4525526warning: pattern matching on 0.0 is equivalent to matching only on +0.0. Instead you must match on +0.0 or -0.0527└─ lib/scenic/math/matrix.ex: Scenic.Math.Matrix.invert/1528529warning: pattern matching on 0.0 is equivalent to matching only on +0.0. Instead you must match on +0.0 or -0.0530└─ lib/scenic/math/vector_2.ex: Scenic.Math.Vector2.normalize/1531532 warning: the variable "bytes" is accessed inside size(...) of a bitstring but it was defined outside of the match. You must precede it with the pin operator533 │534 2730 │ str::binary-size(bytes),535 │ ~536 │537 └─ lib/scenic/script.ex:2730:24: Scenic.Script.extract_string/2538539 warning: the variable "buff_size" is accessed inside size(...) of a bitstring but it was defined outside of the match. You must precede it with the pin operator540 │541 2731 │ _buff::binary-size(buff_size),542 │ ~543 │544 └─ lib/scenic/script.ex:2731:26: Scenic.Script.extract_string/2545546 warning: this clause of defp do_special_theme_outline/3 is never used (or it will always fail/warn when invoked)547 │548 281 │ defp do_special_theme_outline(graph, :dark, border) do549 │ ~550 │551 └─ lib/scenic/component/button.ex:281:8: Scenic.Component.Button.do_special_theme_outline/3552553 warning: this clause of defp do_special_theme_outline/3 is never used (or it will always fail/warn when invoked)554 │555 285 │ defp do_special_theme_outline(graph, :light, border) do556 │ ~557 │558 └─ lib/scenic/component/button.ex:285:8: Scenic.Component.Button.do_special_theme_outline/3559560 warning: the following clause cannot match because the previous clauses already matched all possible values:561562 err ->563564 it attempts to match on the result of:565566 child(scene, id)567568 which has the already matched type:569570 dynamic({:ok, term()})571572 where "err" was given the type:573574 # type: dynamic({:ok, term()})575 # from: lib/scenic/scene.ex:495:7576 err577578 type warning found at:579 │580 495 │ err -> err581 │ ~582 │583 └─ lib/scenic/scene.ex:495:11: Scenic.Scene.get_child/2584585 warning: the following clause cannot match because the previous clauses already matched all possible values:586587 err ->588589 it attempts to match on the result of:590591 child(scene, id)592593 which has the already matched type:594595 dynamic({:ok, term()})596597 where "err" was given the type:598599 # type: dynamic({:ok, term()})600 # from: lib/scenic/scene.ex:523:7601 err602603 type warning found at:604 │605 523 │ err ->606 │ ~607 │608 └─ lib/scenic/scene.ex:523:11: Scenic.Scene.put_child/3609610 warning: the following clause cannot match because the previous clauses already matched all possible values:611612 err ->613614 it attempts to match on the result of:615616 child(scene, id)617618 which has the already matched type:619620 dynamic({:ok, term()})621622 where "err" was given the type:623624 # type: dynamic({:ok, term()})625 # from: lib/scenic/scene.ex:559:7626 err627628 type warning found at:629 │630 559 │ err ->631 │ ~632 │633 └─ lib/scenic/scene.ex:559:11: Scenic.Scene.fetch_child/2634635 warning: the following clause will never match:636637 _ ->638639 it is expected to match on type:640641 none()642643 type warning found at:644 │645 1249 │ _ -> state646 │ ~647 │648 └─ lib/scenic/view_port.ex:1249:9: Scenic.ViewPort.internal_put_graph/3649650 warning: the following clause will never match:651652 err ->653654 it is expected to match on type:655656 none()657658 type warning found at:659 │660 392 │ err -> err661 │ ~662 │663 └─ lib/scenic/view_port.ex:392:7: Scenic.ViewPort.put_graph/4664665Generated scenic app666==> scenic_driver_glfw667mkdir -p /work/proj/_build/mangopi_mq_pro/lib/scenic_driver_glfw/priv/prod668/home/nerves/.nerves/artifacts/nerves_toolchain_riscv64_nerves_linux_gnu-15.3.1/bin/riscv64-nerves-linux-gnu-gcc -O3 -std=c99 `pkg-config --static --cflags glfw3 glew` -fPIC -o /work/proj/_build/mangopi_mq_pro/lib/scenic_driver_glfw/priv/prod/scenic_driver_glfw c_src/main.c c_src/comms.c c_src/nanovg/nanovg.c c_src/utils.c c_src/render_script.c c_src/tx.c --sysroot=/home/nerves/.nerves/artifacts/nerves_system_mangopi_mq_pro-0.17.2/staging `pkg-config --static --libs glfw3 glew` -lGL -lm -lrt669Package glfw3 was not found in the pkg-config search path.670Perhaps you should add the directory containing `glfw3.pc'671to the PKG_CONFIG_PATH environment variable672Package 'glfw3', required by 'virtual:world', not found673Package 'glew', required by 'virtual:world', not found674Package glfw3 was not found in the pkg-config search path.675Perhaps you should add the directory containing `glfw3.pc'676to the PKG_CONFIG_PATH environment variable677Package 'glfw3', required by 'virtual:world', not found678Package 'glew', required by 'virtual:world', not found679c_src/main.c:13:10: fatal error: GL/glew.h: No such file or directory680 13 | #include <GL/glew.h>681 | ^~~~~~~~~~~682compilation terminated.683c_src/comms.c:10:10: fatal error: GLFW/glfw3.h: No such file or directory684 10 | #include <GLFW/glfw3.h>685 | ^~~~~~~~~~~~~~686compilation terminated.687In file included from c_src/nanovg/nanovg.c:28:688c_src/nanovg/stb_image.h: In function 'stbi__parse_png_file':689c_src/nanovg/stb_image.h:4399:25: warning: writing 1 byte into a region of size 0 [-Wstringop-overflow=]690 4399 | tc[k] = (stbi_uc) (stbi__get16be(s) & 255) * stbi__depth_scale_table[depth]; // non 8-bit images will be larger691 | ~~~~~~^~~~~~~~~~~~~~~~~~~~~~~~~~~~~~~~~~~~~~~~~~~~~~~~~~~~~~~~~~~~~~~~~~~~~692c_src/nanovg/stb_image.h:4322:25: note: at offset 3 into destination object 'tc' of size 3693 4322 | stbi_uc has_trans=0, tc[3];694 | ^~695c_src/utils.c:9:10: fatal error: GL/glew.h: No such file or directory696 9 | #include <GL/glew.h>697 | ^~~~~~~~~~~698compilation terminated.699c_src/render_script.c:11:10: fatal error: GLFW/glfw3.h: No such file or directory700 11 | #include <GLFW/glfw3.h>701 | ^~~~~~~~~~~~~~702compilation terminated.703In file included from c_src/tx.c:13:704c_src/comms.h:14:10: fatal error: GLFW/glfw3.h: No such file or directory705 14 | #include <GLFW/glfw3.h>706 | ^~~~~~~~~~~~~~707compilation terminated.708make: *** [Makefile:46: /work/proj/_build/mangopi_mq_pro/lib/scenic_driver_glfw/priv/prod/scenic_driver_glfw] Error 1709could not compile dependency :scenic_driver_glfw, "mix compile" failed. Errors may have been logged above. You can recompile this dependency with "mix deps.compile scenic_driver_glfw --force", update it with "mix deps.update scenic_driver_glfw" or clean it with "mix deps.clean scenic_driver_glfw"710==> nerves_compatibility_test711** (Mix) Could not compile with "make" (exit status: 2).712You need to have gcc and make installed. If you are using713Ubuntu or any other Debian-based system, install the packages714"build-essential". Also install "erlang-dev" package if not715included in your Erlang/OTP version. If you're on Fedora, run716"dnf group install 'Development Tools'".717