scenic_driver_nerves_rpi

Build log

nerves_system_bbb

scenic_driver_nerves_rpi 0.10.1 · fail · run scenic_driver_nerves_rpi-0.10.1-1791095742937
697 of 697 lines
1Resolving Hex dependencies...2Resolution completed in 0.153s3Unchanged:4  circular_buffer 1.1.05  elixir_make 0.7.86  ex_image_info 0.2.77  font_metrics 0.5.28  interactive_cmd 0.1.49  nerves 2.0.0-pre.210  nerves_discovery 0.1.511  nerves_logging 0.2.412  nerves_runtime 0.13.1313  nerves_system_bbb 2.30.214  nerves_system_br 1.34.415  nerves_system_mangopi_mq_pro 0.17.216  nerves_system_qemu_aarch64 0.4.217  nerves_system_rpi0 2.1.218  nerves_system_rpi4 2.1.219  nerves_system_rpi5 2.1.220  nerves_system_trellis 0.5.021  nerves_system_x86_64 1.34.222  nerves_toolchain_aarch64_nerves_linux_gnu 15.3.123  nerves_toolchain_armv6_nerves_linux_gnueabihf 15.3.124  nerves_toolchain_armv7_nerves_linux_gnueabihf 15.3.125  nerves_toolchain_riscv64_nerves_linux_gnu 15.3.126  nerves_toolchain_x86_64_nerves_linux_musl 15.3.127  nerves_uevent 0.1.728  nimble_options 1.1.129  property_table 0.3.430  ring_logger 0.11.731  scenic 0.11.232  scenic_driver_nerves_rpi 0.10.133  tablet 0.3.334  toolshed 0.5.035  truetype_metrics 0.6.136  uboot_env 1.0.237* Getting scenic_driver_nerves_rpi (Hex package)38* Getting nerves (Hex package)39* Getting ring_logger (Hex package)40* Getting toolshed (Hex package)41* Getting nerves_runtime (Hex package)42* Getting nerves_system_bbb (Hex package)43* Getting nerves_system_mangopi_mq_pro (Hex package)44* Getting nerves_system_qemu_aarch64 (Hex package)45* Getting nerves_system_rpi0 (Hex package)46* Getting nerves_system_rpi4 (Hex package)47* Getting nerves_system_rpi5 (Hex package)48* Getting nerves_system_trellis (Hex package)49* Getting nerves_system_x86_64 (Hex package)50* Getting nerves_system_br (Hex package)51* Getting nerves_toolchain_x86_64_nerves_linux_musl (Hex package)52* Getting nerves_toolchain_armv7_nerves_linux_gnueabihf (Hex package)53* Getting nerves_toolchain_aarch64_nerves_linux_gnu (Hex package)54* Getting nerves_toolchain_armv6_nerves_linux_gnueabihf (Hex package)55* Getting nerves_toolchain_riscv64_nerves_linux_gnu (Hex package)56* Getting nerves_logging (Hex package)57* Getting nerves_uevent (Hex package)58* Getting uboot_env (Hex package)59* Getting elixir_make (Hex package)60* Getting property_table (Hex package)61* Getting circular_buffer (Hex package)62* Getting interactive_cmd (Hex package)63* Getting nerves_discovery (Hex package)64* Getting tablet (Hex package)65* Getting scenic (Hex package)66* Getting ex_image_info (Hex package)67* Getting font_metrics (Hex package)68* Getting nimble_options (Hex package)69* Getting truetype_metrics (Hex package)70==> nerves_system_br71Generated nerves_system_br app72==> circular_buffer73Compiling 1 file (.ex)74Generated circular_buffer app75==> nimble_options76Compiling 3 files (.ex)77Generated nimble_options app78==> tablet79Compiling 2 files (.ex)80Generated tablet app81warning: "xref: [exclude: ...]" in your mix.exs file is deprecated, instead use: "elixirc_options: [no_warn_undefined: ...]"82  (mix 1.20.3) lib/mix/tasks/compile.elixir.ex:243: Mix.Tasks.Compile.Elixir.xref_exclude_opts/283  (mix 1.20.3) lib/mix/tasks/compile.elixir.ex:142: Mix.Tasks.Compile.Elixir.run/184  (mix 1.20.3) lib/mix/task.ex:502: anonymous fn/3 in Mix.Task.run_task/585  (mix 1.20.3) lib/mix/task.compiler.ex:299: Mix.Task.Compiler.run_compiler/286  (mix 1.20.3) lib/mix/task.compiler.ex:287: Mix.Task.Compiler.run/487  (mix 1.20.3) lib/mix/tasks/compile.all.ex:75: Mix.Tasks.Compile.All.do_run/28889==> elixir_make90Compiling 6 files (.ex)91    warning: unused require Logger92    │93  6 │   require Logger94    │   ~95    │96    └─ lib/elixir_make/precompiler.ex:6:39798    warning: unused require Logger99    │100  4 │   require Logger101    │   ~102    │103    └─ lib/elixir_make/artefact.ex:4:3104105    warning: unused require Logger106    │107 16 │   require Logger108    │   ~109    │110    └─ lib/mix/tasks/elixir_make.precompile.ex:16:3111112Generated elixir_make app113==> nerves_logging114 CC kmsg_tailer.o115 LD kmsg_tailer116Compiling 5 files (.ex)117Generated nerves_logging app118==> nerves_discovery119Compiling 5 files (.ex)120Generated nerves_discovery app121==> ring_logger122Compiling 7 files (.ex)123Generated ring_logger app124==> interactive_cmd125Compiling 1 file (.ex)126Generated interactive_cmd app127==> nerves128Compiling 65 files (.ex)129    warning: redefining module Mix.Tasks.Nerves.Init (current version loaded from /work/proj/_build/bbb/lib/nerves/ebin/Elixir.Mix.Tasks.Nerves.Init.beam)130    │131  6 │ defmodule Mix.Tasks.Nerves.Init do132    │ ~~~~~~~~~~~~~~~~~~~~~~~~~~~~~~~~~~133    │134    └─ lib/mix/tasks/nerves.init.ex:6: Mix.Tasks.Nerves.Init (module)135136    warning: redefining module Nerves (current version loaded from /work/proj/_build/bbb/lib/nerves/ebin/Elixir.Nerves.beam)137    │138  6 │ defmodule Nerves do139    │ ~~~~~~~~~~~~~~~~~~~140    │141    └─ lib/nerves.ex:6: Nerves (module)142143    warning: redefining module Nerves.ArtifactResolver (current version loaded from /work/proj/_build/bbb/lib/nerves/ebin/Elixir.Nerves.ArtifactResolver.beam)144    │145  5 │ defmodule Nerves.ArtifactResolver do146    │ ~~~~~~~~~~~~~~~~~~~~~~~~~~~~~~~~~~~~147    │148    └─ lib/nerves/artifact_resolver.ex:5: Nerves.ArtifactResolver (module)149150    warning: redefining module Nerves.BuildAction.AppModes (current version loaded from /work/proj/_build/bbb/lib/nerves/ebin/Elixir.Nerves.BuildAction.AppModes.beam)151    │152  6 │ defmodule Nerves.BuildAction.AppModes do153    │ ~~~~~~~~~~~~~~~~~~~~~~~~~~~~~~~~~~~~~~~~154    │155    └─ lib/nerves/build_action/app_modes.ex:6: Nerves.BuildAction.AppModes (module)156157    warning: redefining module Nerves.BuildAction.CheckExecutables (current version loaded from /work/proj/_build/bbb/lib/nerves/ebin/Elixir.Nerves.BuildAction.CheckExecutables.beam)158    │159  5 │ defmodule Nerves.BuildAction.CheckExecutables do160    │ ~~~~~~~~~~~~~~~~~~~~~~~~~~~~~~~~~~~~~~~~~~~~~~~~161    │162    └─ lib/nerves/build_action/check_executables.ex:5: Nerves.BuildAction.CheckExecutables (module)163164    warning: redefining module Nerves.BuildAction.Erlinit (current version loaded from /work/proj/_build/bbb/lib/nerves/ebin/Elixir.Nerves.BuildAction.Erlinit.beam)165    │166  8 │ defmodule Nerves.BuildAction.Erlinit do167    │ ~~~~~~~~~~~~~~~~~~~~~~~~~~~~~~~~~~~~~~~168    │169    └─ lib/nerves/build_action/erlinit.ex:8: Nerves.BuildAction.Erlinit (module)170171    warning: redefining module Nerves.BuildAction.Firmware (current version loaded from /work/proj/_build/bbb/lib/nerves/ebin/Elixir.Nerves.BuildAction.Firmware.beam)172    │173  5 │ defmodule Nerves.BuildAction.Firmware do174    │ ~~~~~~~~~~~~~~~~~~~~~~~~~~~~~~~~~~~~~~~~175    │176    └─ lib/nerves/build_action/firmware.ex:5: Nerves.BuildAction.Firmware (module)177178    warning: redefining module Nerves.BuildAction.IExStartupCheck (current version loaded from /work/proj/_build/bbb/lib/nerves/ebin/Elixir.Nerves.BuildAction.IExStartupCheck.beam)179    │180  7 │ defmodule Nerves.BuildAction.IExStartupCheck do181    │ ~~~~~~~~~~~~~~~~~~~~~~~~~~~~~~~~~~~~~~~~~~~~~~~182    │183    └─ lib/nerves/build_action/iex_startup_check.ex:7: Nerves.BuildAction.IExStartupCheck (module)184185    warning: redefining module Nerves.BuildAction.NervesV1System (current version loaded from /work/proj/_build/bbb/lib/nerves/ebin/Elixir.Nerves.BuildAction.NervesV1System.beam)186    │187  5 │ defmodule Nerves.BuildAction.NervesV1System do188    │ ~~~~~~~~~~~~~~~~~~~~~~~~~~~~~~~~~~~~~~~~~~~~~~189    │190    └─ lib/nerves/build_action/nerves_v1_system.ex:5: Nerves.BuildAction.NervesV1System (module)191192    warning: redefining module Nerves.BuildAction.NervesV1Toolchain (current version loaded from /work/proj/_build/bbb/lib/nerves/ebin/Elixir.Nerves.BuildAction.NervesV1Toolchain.beam)193    │194  5 │ defmodule Nerves.BuildAction.NervesV1Toolchain do195    │ ~~~~~~~~~~~~~~~~~~~~~~~~~~~~~~~~~~~~~~~~~~~~~~~~~196    │197    └─ lib/nerves/build_action/nerves_v1_toolchain.ex:5: Nerves.BuildAction.NervesV1Toolchain (module)198199    warning: redefining module Nerves.BuildAction.Rootfs (current version loaded from /work/proj/_build/bbb/lib/nerves/ebin/Elixir.Nerves.BuildAction.Rootfs.beam)200    │201  5 │ defmodule Nerves.BuildAction.Rootfs do202    │ ~~~~~~~~~~~~~~~~~~~~~~~~~~~~~~~~~~~~~~203    │204    └─ lib/nerves/build_action/rootfs.ex:5: Nerves.BuildAction.Rootfs (module)205206    warning: redefining module Nerves.BuildAction.SortApps (current version loaded from /work/proj/_build/bbb/lib/nerves/ebin/Elixir.Nerves.BuildAction.SortApps.beam)207    │208  6 │ defmodule Nerves.BuildAction.SortApps do209    │ ~~~~~~~~~~~~~~~~~~~~~~~~~~~~~~~~~~~~~~~~210    │211    └─ lib/nerves/build_action/sort_apps.ex:6: Nerves.BuildAction.SortApps (module)212213    warning: redefining module Nerves.BuildAction.StripAll (current version loaded from /work/proj/_build/bbb/lib/nerves/ebin/Elixir.Nerves.BuildAction.StripAll.beam)214    │215  5 │ defmodule Nerves.BuildAction.StripAll do216    │ ~~~~~~~~~~~~~~~~~~~~~~~~~~~~~~~~~~~~~~~~217    │218    └─ lib/nerves/build_action/strip_all.ex:5: Nerves.BuildAction.StripAll (module)219220    warning: redefining module Nerves.BuildAction.Trimmer (current version loaded from /work/proj/_build/bbb/lib/nerves/ebin/Elixir.Nerves.BuildAction.Trimmer.beam)221    │222  5 │ defmodule Nerves.BuildAction.Trimmer do223    │ ~~~~~~~~~~~~~~~~~~~~~~~~~~~~~~~~~~~~~~~224    │225    └─ lib/nerves/build_action/trimmer.ex:5: Nerves.BuildAction.Trimmer (module)226227    warning: redefining module Nerves.BuildPlan (current version loaded from /work/proj/_build/bbb/lib/nerves/ebin/Elixir.Nerves.BuildPlan.beam)228    │229  5 │ defmodule Nerves.BuildPlan do230    │ ~~~~~~~~~~~~~~~~~~~~~~~~~~~~~231    │232    └─ lib/nerves/build_plan.ex:5: Nerves.BuildPlan (module)233234    warning: redefining module Nerves.BuildPlan.Checks (current version loaded from /work/proj/_build/bbb/lib/nerves/ebin/Elixir.Nerves.BuildPlan.Checks.beam)235    │236  5 │ defmodule Nerves.BuildPlan.Checks do237    │ ~~~~~~~~~~~~~~~~~~~~~~~~~~~~~~~~~~~~238    │239    └─ lib/nerves/build_plan/checks.ex:5: Nerves.BuildPlan.Checks (module)240241    warning: redefining module Nerves.Container (current version loaded from /work/proj/_build/bbb/lib/nerves/ebin/Elixir.Nerves.Container.beam)242    │243  6 │ defmodule Nerves.Container do244    │ ~~~~~~~~~~~~~~~~~~~~~~~~~~~~~245    │246    └─ lib/nerves/container.ex:6: Nerves.Container (module)247248    warning: redefining module Nerves.Fingerprint (current version loaded from /work/proj/_build/bbb/lib/nerves/ebin/Elixir.Nerves.Fingerprint.beam)249    │250  5 │ defmodule Nerves.Fingerprint do251    │ ~~~~~~~~~~~~~~~~~~~~~~~~~~~~~~~252    │253    └─ lib/nerves/fingerprint.ex:5: Nerves.Fingerprint (module)254255    warning: redefining module Nerves.MixPackage (current version loaded from /work/proj/_build/bbb/lib/nerves/ebin/Elixir.Nerves.MixPackage.beam)256    │257  5 │ defmodule Nerves.MixPackage do258    │ ~~~~~~~~~~~~~~~~~~~~~~~~~~~~~~259    │260    └─ lib/nerves/mix_package.ex:5: Nerves.MixPackage (module)261262    warning: redefining module Nerves.Paths (current version loaded from /work/proj/_build/bbb/lib/nerves/ebin/Elixir.Nerves.Paths.beam)263    │264  5 │ defmodule Nerves.Paths do265    │ ~~~~~~~~~~~~~~~~~~~~~~~~~266    │267    └─ lib/nerves/paths.ex:5: Nerves.Paths (module)268269    warning: redefining module Nerves.TargetTuple (current version loaded from /work/proj/_build/bbb/lib/nerves/ebin/Elixir.Nerves.TargetTuple.beam)270    │271  5 │ defmodule Nerves.TargetTuple do272    │ ~~~~~~~~~~~~~~~~~~~~~~~~~~~~~~~273    │274    └─ lib/nerves/target_tuple.ex:5: Nerves.TargetTuple (module)275276Generated nerves app277==> nerves_toolchain_armv7_nerves_linux_gnueabihf278Compiling 1 file (.ex)279Generated nerves_toolchain_armv7_nerves_linux_gnueabihf app280==> font_metrics281Compiling 2 files (.ex)282Generated font_metrics app283==> truetype_metrics284Compiling 1 file (.ex)285     warning: the variable "offset" is accessed inside size(...) of a bitstring but it was defined outside of the match. You must precede it with the pin operator286     │287 334 │         <<_::binary-size(offset), cmap::binary>> = cmap_data288     │                          ~289     │290     └─ lib/truetype_metrics.ex:334:26: TruetypeMetrics.do_parse_cmap_glyphs_ids/1291292     warning: the variable "skip" is accessed inside size(...) of a bitstring but it was defined outside of the match. You must precede it with the pin operator293     │294 446 │     <<_::binary-size(skip), id::unsigned-size(16)-big, _::binary>> = sub_table295     │                      ~296     │297     └─ lib/truetype_metrics.ex:446:22: TruetypeMetrics.lookup_cmap_type_4/2298299     warning: the variable "offset" is accessed inside size(...) of a bitstring but it was defined outside of the match. You must precede it with the pin operator300     │301 678 │           _::binary-size(offset),302     │                          ~303     │304     └─ lib/truetype_metrics.ex:678:26: TruetypeMetrics.get_table_data/3305306     warning: the variable "table_size" is accessed inside size(...) of a bitstring but it was defined outside of the match. You must precede it with the pin operator307     │308 679 │           table_data::binary-size(table_size),309     │                                   ~310     │311     └─ lib/truetype_metrics.ex:679:35: TruetypeMetrics.get_table_data/3312313     warning: the variable "offset" is accessed inside size(...) of a bitstring but it was defined outside of the match. You must precede it with the pin operator314     │315 700 │       _::binary-size(offset),316     │                      ~317     │318     └─ lib/truetype_metrics.ex:700:22: TruetypeMetrics.do_get_table_data/2319320     warning: the variable "table_size" is accessed inside size(...) of a bitstring but it was defined outside of the match. You must precede it with the pin operator321     │322 701 │       table_data::binary-size(table_size),323     │                               ~324     │325     └─ lib/truetype_metrics.ex:701:31: TruetypeMetrics.do_get_table_data/2326327Generated truetype_metrics app328==> uboot_env329Compiling 5 files (.ex)330Generated uboot_env app331==> ex_image_info332Compiling 12 files (.ex)333    warning: the variable "block_len" is accessed inside size(...) of a bitstring but it was defined outside of the match. You must precede it with the pin operator334    │335 41 │       <<_::bytes-size(block_len), 0xFF, sof::size(8), next::binary>> ->336    │                       ~337    │338    └─ lib/ex_image_info/types/jpeg.ex:41:23: ExImageInfo.Types.JPEG.parse_jpeg_block/2339340    warning: the variable "idf_off_pos" is accessed inside size(...) of a bitstring but it was defined outside of the match. You must precede it with the pin operator341    │342 56 │       <<_skip1::bytes-size(idf_off_pos), _skip2::bytes-size(2),343    │                            ~344    │345    └─ lib/ex_image_info/types/tiff.ex:56:28: ExImageInfo.Types.TIFF.parse_tiff_block/4346347    warning: the variable "buff_size" is accessed inside size(...) of a bitstring but it was defined outside of the match. You must precede it with the pin operator348    │349 57 │         buff_idf::bytes-size(buff_size), _::binary>> ->350    │                              ~351    │352    └─ lib/ex_image_info/types/tiff.ex:57:30: ExImageInfo.Types.TIFF.parse_tiff_block/4353354    warning: unused require Bitwise355    │356  7 │   require Bitwise357    │   ~358    │359    └─ lib/ex_image_info/types/tiff.ex:7:3360361    warning: unused require Bitwise362    │363  6 │   require Bitwise364    │   ~365    │366    └─ lib/ex_image_info/types/webp.ex:6:3367368    warning: this clause of defp parse_jpeg_block/2 is never used (or it will always fail/warn when invoked)369    │370 49 │   defp parse_jpeg_block(_, _), do: nil371    │        ~372    │373    └─ lib/ex_image_info/types/jpeg.ex:49:8: ExImageInfo.Types.JPEG.parse_jpeg_block/2374375Generated ex_image_info app376==> scenic377mkdir -p /work/proj/_build/bbb/lib/scenic/ebin/../priv378mkdir -p /work/proj/_build/bbb/lib/scenic/ebin/../obj379/home/nerves/.nerves/artifacts/nerves_toolchain_armv7_nerves_linux_gnueabihf-15.3.1/bin/armv7-nerves-linux-gnueabihf-gcc -c -I/home/nerves/.nerves/artifacts/nerves_system_bbb-2.30.2/staging/usr/lib/erlang/erts-17.0.6/include -I/home/nerves/.nerves/artifacts/nerves_system_bbb-2.30.2/staging/usr/lib/erlang/lib/erl_interface-5.8.2/include -mabi=aapcs-linux -mfpu=vfpv3 -marm -fstack-protector-strong -mfloat-abi=hard -mcpu=cortex-a8 -fPIE -pie -Wl,-z,now -Wl,-z,relro -D_LARGEFILE_SOURCE -D_LARGEFILE64_SOURCE -D_FILE_OFFSET_BITS=64  -pipe -O2 --sysroot /home/nerves/.nerves/artifacts/nerves_system_bbb-2.30.2/staging -fPIC -o /work/proj/_build/bbb/lib/scenic/ebin/../obj/line.o c_src/line.c380/home/nerves/.nerves/artifacts/nerves_toolchain_armv7_nerves_linux_gnueabihf-15.3.1/bin/armv7-nerves-linux-gnueabihf-gcc -c -I/home/nerves/.nerves/artifacts/nerves_system_bbb-2.30.2/staging/usr/lib/erlang/erts-17.0.6/include -I/home/nerves/.nerves/artifacts/nerves_system_bbb-2.30.2/staging/usr/lib/erlang/lib/erl_interface-5.8.2/include -mabi=aapcs-linux -mfpu=vfpv3 -marm -fstack-protector-strong -mfloat-abi=hard -mcpu=cortex-a8 -fPIE -pie -Wl,-z,now -Wl,-z,relro -D_LARGEFILE_SOURCE -D_LARGEFILE64_SOURCE -D_FILE_OFFSET_BITS=64  -pipe -O2 --sysroot /home/nerves/.nerves/artifacts/nerves_system_bbb-2.30.2/staging -fPIC -o /work/proj/_build/bbb/lib/scenic/ebin/../obj/matrix.o c_src/matrix.c381/home/nerves/.nerves/artifacts/nerves_toolchain_armv7_nerves_linux_gnueabihf-15.3.1/bin/armv7-nerves-linux-gnueabihf-gcc -c -I/home/nerves/.nerves/artifacts/nerves_system_bbb-2.30.2/staging/usr/lib/erlang/erts-17.0.6/include -I/home/nerves/.nerves/artifacts/nerves_system_bbb-2.30.2/staging/usr/lib/erlang/lib/erl_interface-5.8.2/include -mabi=aapcs-linux -mfpu=vfpv3 -marm -fstack-protector-strong -mfloat-abi=hard -mcpu=cortex-a8 -fPIE -pie -Wl,-z,now -Wl,-z,relro -D_LARGEFILE_SOURCE -D_LARGEFILE64_SOURCE -D_FILE_OFFSET_BITS=64  -pipe -O2 --sysroot /home/nerves/.nerves/artifacts/nerves_system_bbb-2.30.2/staging -fPIC -o /work/proj/_build/bbb/lib/scenic/ebin/../obj/bitmap.o c_src/bitmap.c382/home/nerves/.nerves/artifacts/nerves_toolchain_armv7_nerves_linux_gnueabihf-15.3.1/bin/armv7-nerves-linux-gnueabihf-gcc /work/proj/_build/bbb/lib/scenic/ebin/../obj/line.o -L/home/nerves/.nerves/artifacts/nerves_system_bbb-2.30.2/staging/usr/lib/erlang/lib/erl_interface-5.8.2/lib -lei --sysroot=/home/nerves/.nerves/artifacts/nerves_system_bbb-2.30.2/staging -shared  -dynamiclib -o /work/proj/_build/bbb/lib/scenic/ebin/../priv/line.so383/home/nerves/.nerves/artifacts/nerves_toolchain_armv7_nerves_linux_gnueabihf-15.3.1/bin/armv7-nerves-linux-gnueabihf-gcc /work/proj/_build/bbb/lib/scenic/ebin/../obj/matrix.o -L/home/nerves/.nerves/artifacts/nerves_system_bbb-2.30.2/staging/usr/lib/erlang/lib/erl_interface-5.8.2/lib -lei --sysroot=/home/nerves/.nerves/artifacts/nerves_system_bbb-2.30.2/staging -shared  -dynamiclib -o /work/proj/_build/bbb/lib/scenic/ebin/../priv/matrix.so384/home/nerves/.nerves/artifacts/nerves_toolchain_armv7_nerves_linux_gnueabihf-15.3.1/bin/armv7-nerves-linux-gnueabihf-gcc /work/proj/_build/bbb/lib/scenic/ebin/../obj/bitmap.o -L/home/nerves/.nerves/artifacts/nerves_system_bbb-2.30.2/staging/usr/lib/erlang/lib/erl_interface-5.8.2/lib -lei --sysroot=/home/nerves/.nerves/artifacts/nerves_system_bbb-2.30.2/staging -shared  -dynamiclib -o /work/proj/_build/bbb/lib/scenic/ebin/../priv/bitmap.so385Compiling 84 files (.ex)386    warning: using single-quoted strings to represent charlists is deprecated.387    Use ~c"" if you indeed want a charlist or use "" instead.388    You may run "mix format --migrate" to change all single-quoted389    strings to use the ~c sigil and fix this warning.390    │391 81 │       |> :filename.join('bitmap')392    │                         ~393    │394    └─ lib/scenic/assets/stream/bitmap.ex:81:25395396     warning: the variable "skip" is accessed inside size(...) of a bitstring but it was defined outside of the match. You must precede it with the pin operator397     │398 190 │     <<_::binary-size(skip), g::8, _::binary>> = p399     │                      ~400     │401     └─ lib/scenic/assets/stream/bitmap.ex:190:22: Scenic.Assets.Stream.Bitmap.do_get/4402403     warning: the variable "skip" is accessed inside size(...) of a bitstring but it was defined outside of the match. You must precede it with the pin operator404     │405 198 │     <<_::binary-size(skip), g::8, a::8, _::binary>> = p406     │                      ~407     │408     └─ lib/scenic/assets/stream/bitmap.ex:198:22: Scenic.Assets.Stream.Bitmap.do_get/4409410     warning: the variable "skip" is accessed inside size(...) of a bitstring but it was defined outside of the match. You must precede it with the pin operator411     │412 206 │     <<_::binary-size(skip), r::8, g::8, b::8, _::binary>> = p413     │                      ~414     │415     └─ lib/scenic/assets/stream/bitmap.ex:206:22: Scenic.Assets.Stream.Bitmap.do_get/4416417     warning: the variable "skip" is accessed inside size(...) of a bitstring but it was defined outside of the match. You must precede it with the pin operator418     │419 214 │     <<_::binary-size(skip), r::8, g::8, b::8, a::8, _::binary>> = p420     │                      ~421     │422     └─ lib/scenic/assets/stream/bitmap.ex:214:22: Scenic.Assets.Stream.Bitmap.do_get/4423424     warning: using single-quoted strings to represent charlists is deprecated.425     Use ~c"" if you indeed want a charlist or use "" instead.426     You may run "mix format --migrate" to change all single-quoted427     strings to use the ~c sigil and fix this warning.428     │429 105 │     space_width = FontMetrics.width(' ', @default_font_size, fm)430     │                                     ~431     │432     └─ lib/scenic/component/input/checkbox.ex:105:37433434     warning: using single-quoted strings to represent charlists is deprecated.435     Use ~c"" if you indeed want a charlist or use "" instead.436     You may run "mix format --migrate" to change all single-quoted437     strings to use the ~c sigil and fix this warning.438     │439 177 │     space_width = FontMetrics.width(' ', @default_font_size, fm)440     │                                     ~441     │442     └─ lib/scenic/component/input/checkbox.ex:177:37443444    warning: using single-quoted strings to represent charlists is deprecated.445    Use ~c"" if you indeed want a charlist or use "" instead.446    You may run "mix format --migrate" to change all single-quoted447    strings to use the ~c sigil and fix this warning.448    │449 80 │     space_width = FontMetrics.width(' ', @default_font_size, fm)450    │                                     ~451    │452    └─ lib/scenic/component/input/radio_button.ex:80:37453454     warning: using single-quoted strings to represent charlists is deprecated.455     Use ~c"" if you indeed want a charlist or use "" instead.456     You may run "mix format --migrate" to change all single-quoted457     strings to use the ~c sigil and fix this warning.458     │459 143 │     space_width = FontMetrics.width(' ', @default_font_size, fm)460     │                                     ~461     │462     └─ lib/scenic/component/input/radio_button.ex:143:37463464     warning: using single-quoted strings to represent charlists is deprecated.465     Use ~c"" if you indeed want a charlist or use "" instead.466     You may run "mix format --migrate" to change all single-quoted467     strings to use the ~c sigil and fix this warning.468     │469 227 │     space_width = FontMetrics.width(' ', @default_font_size, fm)470     │                                     ~471     │472     └─ lib/scenic/component/input/radio_group.ex:227:37473474     warning: using single-quoted strings to represent charlists is deprecated.475     Use ~c"" if you indeed want a charlist or use "" instead.476     You may run "mix format --migrate" to change all single-quoted477     strings to use the ~c sigil and fix this warning.478     │479 113 │   @password_char '*'480     │                  ~481     │482     └─ lib/scenic/component/input/text_field.ex:113:18483484warning: pattern matching on 0.0 is equivalent to matching only on +0.0. Instead you must match on +0.0 or -0.0485└─ lib/scenic/graph/bounds.ex: Scenic.Graph.Bounds.pts_arc_to/6486487warning: pattern matching on 0.0 is equivalent to matching only on +0.0. Instead you must match on +0.0 or -0.0488└─ lib/scenic/graph/bounds.ex: Scenic.Graph.Bounds.pts_arc_to/6489490    warning: using single-quoted strings to represent charlists is deprecated.491    Use ~c"" if you indeed want a charlist or use "" instead.492    You may run "mix format --migrate" to change all single-quoted493    strings to use the ~c sigil and fix this warning.494    │495 31 │       |> :filename.join('line')496    │                         ~497    │498    └─ lib/scenic/math/line.ex:31:25499500    warning: using single-quoted strings to represent charlists is deprecated.501    Use ~c"" if you indeed want a charlist or use "" instead.502    You may run "mix format --migrate" to change all single-quoted503    strings to use the ~c sigil and fix this warning.504    │505 37 │       |> :filename.join('matrix')506    │                         ~507    │508    └─ lib/scenic/math/matrix.ex:37:25509510     warning: the variable "skip_size" is accessed inside size(...) of a bitstring but it was defined outside of the match. You must precede it with the pin operator511     │512 490 │       _::binary-size(skip_size),513     │                      ~514     │515     └─ lib/scenic/math/matrix.ex:490:22: Scenic.Math.Matrix.get/3516517     warning: the variable "skip_size" is accessed inside size(...) of a bitstring but it was defined outside of the match. You must precede it with the pin operator518     │519 521 │       pre::binary-size(skip_size),520     │                        ~521     │522     └─ lib/scenic/math/matrix.ex:521:24: Scenic.Math.Matrix.put/4523524warning: pattern matching on 0.0 is equivalent to matching only on +0.0. Instead you must match on +0.0 or -0.0525└─ lib/scenic/math/matrix.ex: Scenic.Math.Matrix.invert/1526527warning: pattern matching on 0.0 is equivalent to matching only on +0.0. Instead you must match on +0.0 or -0.0528└─ lib/scenic/math/vector_2.ex: Scenic.Math.Vector2.normalize/1529530      warning: the variable "bytes" is accessed inside size(...) of a bitstring but it was defined outside of the match. You must precede it with the pin operator531      │532 2730 │       str::binary-size(bytes),533      │                        ~534      │535      └─ lib/scenic/script.ex:2730:24: Scenic.Script.extract_string/2536537      warning: the variable "buff_size" is accessed inside size(...) of a bitstring but it was defined outside of the match. You must precede it with the pin operator538      │539 2731 │       _buff::binary-size(buff_size),540      │                          ~541      │542      └─ lib/scenic/script.ex:2731:26: Scenic.Script.extract_string/2543544     warning: this clause of defp do_special_theme_outline/3 is never used (or it will always fail/warn when invoked)545     │546 281 │   defp do_special_theme_outline(graph, :dark, border) do547     │        ~548     │549     └─ lib/scenic/component/button.ex:281:8: Scenic.Component.Button.do_special_theme_outline/3550551     warning: this clause of defp do_special_theme_outline/3 is never used (or it will always fail/warn when invoked)552     │553 285 │   defp do_special_theme_outline(graph, :light, border) do554     │        ~555     │556     └─ lib/scenic/component/button.ex:285:8: Scenic.Component.Button.do_special_theme_outline/3557558     warning: the following clause cannot match because the previous clauses already matched all possible values:559560         err ->561562     it attempts to match on the result of:563564         child(scene, id)565566     which has the already matched type:567568         dynamic({:ok, term()})569570     where "err" was given the type:571572         # type: dynamic({:ok, term()})573         # from: lib/scenic/scene.ex:495:7574         err575576     type warning found at:577     │578 495 │       err -> err579     │           ~580     │581     └─ lib/scenic/scene.ex:495:11: Scenic.Scene.get_child/2582583     warning: the following clause cannot match because the previous clauses already matched all possible values:584585         err ->586587     it attempts to match on the result of:588589         child(scene, id)590591     which has the already matched type:592593         dynamic({:ok, term()})594595     where "err" was given the type:596597         # type: dynamic({:ok, term()})598         # from: lib/scenic/scene.ex:523:7599         err600601     type warning found at:602     │603 523 │       err ->604     │           ~605     │606     └─ lib/scenic/scene.ex:523:11: Scenic.Scene.put_child/3607608     warning: the following clause cannot match because the previous clauses already matched all possible values:609610         err ->611612     it attempts to match on the result of:613614         child(scene, id)615616     which has the already matched type:617618         dynamic({:ok, term()})619620     where "err" was given the type:621622         # type: dynamic({:ok, term()})623         # from: lib/scenic/scene.ex:559:7624         err625626     type warning found at:627     │628 559 │       err ->629     │           ~630     │631     └─ lib/scenic/scene.ex:559:11: Scenic.Scene.fetch_child/2632633      warning: the following clause will never match:634635          _ ->636637      it is expected to match on type:638639          none()640641      type warning found at:642      │643 1249 │         _ -> state644      │         ~645      │646      └─ lib/scenic/view_port.ex:1249:9: Scenic.ViewPort.internal_put_graph/3647648     warning: the following clause will never match:649650         err ->651652     it is expected to match on type:653654         none()655656     type warning found at:657     │658 392 │       err -> err659     │       ~660     │661     └─ lib/scenic/view_port.ex:392:7: Scenic.ViewPort.put_graph/4662663Generated scenic app664==> scenic_driver_nerves_rpi665mkdir -p /work/proj/_build/bbb/lib/scenic_driver_nerves_rpi/priv666/home/nerves/.nerves/artifacts/nerves_toolchain_armv7_nerves_linux_gnueabihf-15.3.1/bin/armv7-nerves-linux-gnueabihf-gcc -mabi=aapcs-linux -mfpu=vfpv3 -marm -fstack-protector-strong -mfloat-abi=hard -mcpu=cortex-a8 -fPIE -pie -Wl,-z,now -Wl,-z,relro -D_LARGEFILE_SOURCE -D_LARGEFILE64_SOURCE -D_FILE_OFFSET_BITS=64  -pipe -O2 --sysroot /home/nerves/.nerves/artifacts/nerves_system_bbb-2.30.2/staging -std=gnu99 -o /work/proj/_build/bbb/lib/scenic_driver_nerves_rpi/priv/scenic_driver_nerves_rpi c_src/main.c c_src/comms.c c_src/nanovg/nanovg.c c_src/render_script.c c_src/tx.c c_src/utils.c --sysroot=/home/nerves/.nerves/artifacts/nerves_system_bbb-2.30.2/staging -lGLESv2 -lEGL -lm -lbcm_host -lvchostif667rsync -rupE fonts /work/proj/_build/bbb/lib/scenic_driver_nerves_rpi/priv/fonts668c_src/main.c:16:10: fatal error: bcm_host.h: No such file or directory669   16 | #include <bcm_host.h>670      |          ^~~~~~~~~~~~671compilation terminated.672c_src/comms.c:18:10: fatal error: GLES2/gl2.h: No such file or directory673   18 | #include <GLES2/gl2.h>674      |          ^~~~~~~~~~~~~675compilation terminated.676c_src/render_script.c:15:12: fatal error: GLES2/gl2.h: No such file or directory677   15 |   #include <GLES2/gl2.h>678      |            ^~~~~~~~~~~~~679compilation terminated.680c_src/tx.c:14:10: fatal error: GLES2/gl2.h: No such file or directory681   14 | #include <GLES2/gl2.h>682      |          ^~~~~~~~~~~~~683compilation terminated.684c_src/utils.c:16:10: fatal error: GLES2/gl2.h: No such file or directory685   16 | #include <GLES2/gl2.h>686      |          ^~~~~~~~~~~~~687compilation terminated.688make: *** [Makefile:55: /work/proj/_build/bbb/lib/scenic_driver_nerves_rpi/priv/scenic_driver_nerves_rpi] Error 1689could not compile dependency :scenic_driver_nerves_rpi, "mix compile" failed. Errors may have been logged above. You can recompile this dependency with "mix deps.compile scenic_driver_nerves_rpi --force", update it with "mix deps.update scenic_driver_nerves_rpi" or clean it with "mix deps.clean scenic_driver_nerves_rpi"690==> nerves_compatibility_test691** (Mix) Could not compile with "make" (exit status: 2).692You need to have gcc and make installed. If you are using693Ubuntu or any other Debian-based system, install the packages694"build-essential". Also install "erlang-dev" package if not695included in your Erlang/OTP version. If you're on Fedora, run696"dnf group install 'Development Tools'".697