scenic_scrollable

Build log

nerves_system_bbb

scenic_scrollable 0.1.0 · fail · run scenic_scrollable-0.1.0-1791097394233
727 of 727 lines
1Resolving Hex dependencies...2Resolution completed in 0.144s3Unchanged:4  circular_buffer 1.1.05  elixir_make 0.7.86  ex_image_info 0.2.77  font_metrics 0.5.28  interactive_cmd 0.1.49  nerves 2.0.0-pre.210  nerves_discovery 0.1.511  nerves_logging 0.2.412  nerves_runtime 0.13.1313  nerves_system_bbb 2.30.214  nerves_system_br 1.34.415  nerves_system_mangopi_mq_pro 0.17.216  nerves_system_qemu_aarch64 0.4.217  nerves_system_rpi0 2.1.218  nerves_system_rpi4 2.1.219  nerves_system_rpi5 2.1.220  nerves_system_trellis 0.5.021  nerves_system_x86_64 1.34.222  nerves_toolchain_aarch64_nerves_linux_gnu 15.3.123  nerves_toolchain_armv6_nerves_linux_gnueabihf 15.3.124  nerves_toolchain_armv7_nerves_linux_gnueabihf 15.3.125  nerves_toolchain_riscv64_nerves_linux_gnu 15.3.126  nerves_toolchain_x86_64_nerves_linux_musl 15.3.127  nerves_uevent 0.1.728  nimble_options 1.1.129  option_ex 0.2.030  property_table 0.3.431  result_ex 0.1.032  ring_logger 0.11.733  scenic 0.11.234  scenic_driver_glfw 0.10.135  scenic_scrollable 0.1.036  tablet 0.3.337  toolshed 0.5.038  truetype_metrics 0.6.139  uboot_env 1.0.240* Getting scenic_scrollable (Hex package)41* Getting nerves (Hex package)42* Getting ring_logger (Hex package)43* Getting toolshed (Hex package)44* Getting nerves_runtime (Hex package)45* Getting nerves_system_bbb (Hex package)46* Getting nerves_system_mangopi_mq_pro (Hex package)47* Getting nerves_system_qemu_aarch64 (Hex package)48* Getting nerves_system_rpi0 (Hex package)49* Getting nerves_system_rpi4 (Hex package)50* Getting nerves_system_rpi5 (Hex package)51* Getting nerves_system_trellis (Hex package)52* Getting nerves_system_x86_64 (Hex package)53* Getting nerves_system_br (Hex package)54* Getting nerves_toolchain_x86_64_nerves_linux_musl (Hex package)55* Getting nerves_toolchain_armv7_nerves_linux_gnueabihf (Hex package)56* Getting nerves_toolchain_aarch64_nerves_linux_gnu (Hex package)57* Getting nerves_toolchain_armv6_nerves_linux_gnueabihf (Hex package)58* Getting nerves_toolchain_riscv64_nerves_linux_gnu (Hex package)59* Getting nerves_logging (Hex package)60* Getting nerves_uevent (Hex package)61* Getting uboot_env (Hex package)62* Getting elixir_make (Hex package)63* Getting property_table (Hex package)64* Getting circular_buffer (Hex package)65* Getting interactive_cmd (Hex package)66* Getting nerves_discovery (Hex package)67* Getting tablet (Hex package)68* Getting option_ex (Hex package)69* Getting result_ex (Hex package)70* Getting scenic (Hex package)71* Getting scenic_driver_glfw (Hex package)72* Getting ex_image_info (Hex package)73* Getting font_metrics (Hex package)74* Getting nimble_options (Hex package)75* Getting truetype_metrics (Hex package)76==> nerves_system_br77Generated nerves_system_br app78==> circular_buffer79Compiling 1 file (.ex)80Generated circular_buffer app81==> nimble_options82Compiling 3 files (.ex)83Generated nimble_options app84==> tablet85Compiling 2 files (.ex)86Generated tablet app87warning: "xref: [exclude: ...]" in your mix.exs file is deprecated, instead use: "elixirc_options: [no_warn_undefined: ...]"88  (mix 1.20.3) lib/mix/tasks/compile.elixir.ex:243: Mix.Tasks.Compile.Elixir.xref_exclude_opts/289  (mix 1.20.3) lib/mix/tasks/compile.elixir.ex:142: Mix.Tasks.Compile.Elixir.run/190  (mix 1.20.3) lib/mix/task.ex:502: anonymous fn/3 in Mix.Task.run_task/591  (mix 1.20.3) lib/mix/task.compiler.ex:299: Mix.Task.Compiler.run_compiler/292  (mix 1.20.3) lib/mix/task.compiler.ex:287: Mix.Task.Compiler.run/493  (mix 1.20.3) lib/mix/tasks/compile.all.ex:75: Mix.Tasks.Compile.All.do_run/29495==> elixir_make96Compiling 6 files (.ex)97    warning: unused require Logger98    │99  6 │   require Logger100    │   ~101    │102    └─ lib/elixir_make/precompiler.ex:6:3103104    warning: unused require Logger105    │106  4 │   require Logger107    │   ~108    │109    └─ lib/elixir_make/artefact.ex:4:3110111    warning: unused require Logger112    │113 16 │   require Logger114    │   ~115    │116    └─ lib/mix/tasks/elixir_make.precompile.ex:16:3117118Generated elixir_make app119==> nerves_logging120 CC kmsg_tailer.o121 LD kmsg_tailer122Compiling 5 files (.ex)123Generated nerves_logging app124==> nerves_discovery125Compiling 5 files (.ex)126Generated nerves_discovery app127==> result_ex128Compiling 1 file (.ex)129Generated result_ex app130==> ring_logger131Compiling 7 files (.ex)132Generated ring_logger app133==> interactive_cmd134Compiling 1 file (.ex)135Generated interactive_cmd app136==> nerves137Compiling 65 files (.ex)138    warning: redefining module Mix.Tasks.Nerves.Init (current version loaded from /work/proj/_build/bbb/lib/nerves/ebin/Elixir.Mix.Tasks.Nerves.Init.beam)139    │140  6 │ defmodule Mix.Tasks.Nerves.Init do141    │ ~~~~~~~~~~~~~~~~~~~~~~~~~~~~~~~~~~142    │143    └─ lib/mix/tasks/nerves.init.ex:6: Mix.Tasks.Nerves.Init (module)144145    warning: redefining module Nerves (current version loaded from /work/proj/_build/bbb/lib/nerves/ebin/Elixir.Nerves.beam)146    │147  6 │ defmodule Nerves do148    │ ~~~~~~~~~~~~~~~~~~~149    │150    └─ lib/nerves.ex:6: Nerves (module)151152    warning: redefining module Nerves.ArtifactResolver (current version loaded from /work/proj/_build/bbb/lib/nerves/ebin/Elixir.Nerves.ArtifactResolver.beam)153    │154  5 │ defmodule Nerves.ArtifactResolver do155    │ ~~~~~~~~~~~~~~~~~~~~~~~~~~~~~~~~~~~~156    │157    └─ lib/nerves/artifact_resolver.ex:5: Nerves.ArtifactResolver (module)158159    warning: redefining module Nerves.BuildAction.AppModes (current version loaded from /work/proj/_build/bbb/lib/nerves/ebin/Elixir.Nerves.BuildAction.AppModes.beam)160    │161  6 │ defmodule Nerves.BuildAction.AppModes do162    │ ~~~~~~~~~~~~~~~~~~~~~~~~~~~~~~~~~~~~~~~~163    │164    └─ lib/nerves/build_action/app_modes.ex:6: Nerves.BuildAction.AppModes (module)165166    warning: redefining module Nerves.BuildAction.CheckExecutables (current version loaded from /work/proj/_build/bbb/lib/nerves/ebin/Elixir.Nerves.BuildAction.CheckExecutables.beam)167    │168  5 │ defmodule Nerves.BuildAction.CheckExecutables do169    │ ~~~~~~~~~~~~~~~~~~~~~~~~~~~~~~~~~~~~~~~~~~~~~~~~170    │171    └─ lib/nerves/build_action/check_executables.ex:5: Nerves.BuildAction.CheckExecutables (module)172173    warning: redefining module Nerves.BuildAction.Erlinit (current version loaded from /work/proj/_build/bbb/lib/nerves/ebin/Elixir.Nerves.BuildAction.Erlinit.beam)174    │175  8 │ defmodule Nerves.BuildAction.Erlinit do176    │ ~~~~~~~~~~~~~~~~~~~~~~~~~~~~~~~~~~~~~~~177    │178    └─ lib/nerves/build_action/erlinit.ex:8: Nerves.BuildAction.Erlinit (module)179180    warning: redefining module Nerves.BuildAction.Firmware (current version loaded from /work/proj/_build/bbb/lib/nerves/ebin/Elixir.Nerves.BuildAction.Firmware.beam)181    │182  5 │ defmodule Nerves.BuildAction.Firmware do183    │ ~~~~~~~~~~~~~~~~~~~~~~~~~~~~~~~~~~~~~~~~184    │185    └─ lib/nerves/build_action/firmware.ex:5: Nerves.BuildAction.Firmware (module)186187    warning: redefining module Nerves.BuildAction.IExStartupCheck (current version loaded from /work/proj/_build/bbb/lib/nerves/ebin/Elixir.Nerves.BuildAction.IExStartupCheck.beam)188    │189  7 │ defmodule Nerves.BuildAction.IExStartupCheck do190    │ ~~~~~~~~~~~~~~~~~~~~~~~~~~~~~~~~~~~~~~~~~~~~~~~191    │192    └─ lib/nerves/build_action/iex_startup_check.ex:7: Nerves.BuildAction.IExStartupCheck (module)193194    warning: redefining module Nerves.BuildAction.NervesV1System (current version loaded from /work/proj/_build/bbb/lib/nerves/ebin/Elixir.Nerves.BuildAction.NervesV1System.beam)195    │196  5 │ defmodule Nerves.BuildAction.NervesV1System do197    │ ~~~~~~~~~~~~~~~~~~~~~~~~~~~~~~~~~~~~~~~~~~~~~~198    │199    └─ lib/nerves/build_action/nerves_v1_system.ex:5: Nerves.BuildAction.NervesV1System (module)200201    warning: redefining module Nerves.BuildAction.NervesV1Toolchain (current version loaded from /work/proj/_build/bbb/lib/nerves/ebin/Elixir.Nerves.BuildAction.NervesV1Toolchain.beam)202    │203  5 │ defmodule Nerves.BuildAction.NervesV1Toolchain do204    │ ~~~~~~~~~~~~~~~~~~~~~~~~~~~~~~~~~~~~~~~~~~~~~~~~~205    │206    └─ lib/nerves/build_action/nerves_v1_toolchain.ex:5: Nerves.BuildAction.NervesV1Toolchain (module)207208    warning: redefining module Nerves.BuildAction.Rootfs (current version loaded from /work/proj/_build/bbb/lib/nerves/ebin/Elixir.Nerves.BuildAction.Rootfs.beam)209    │210  5 │ defmodule Nerves.BuildAction.Rootfs do211    │ ~~~~~~~~~~~~~~~~~~~~~~~~~~~~~~~~~~~~~~212    │213    └─ lib/nerves/build_action/rootfs.ex:5: Nerves.BuildAction.Rootfs (module)214215    warning: redefining module Nerves.BuildAction.SortApps (current version loaded from /work/proj/_build/bbb/lib/nerves/ebin/Elixir.Nerves.BuildAction.SortApps.beam)216    │217  6 │ defmodule Nerves.BuildAction.SortApps do218    │ ~~~~~~~~~~~~~~~~~~~~~~~~~~~~~~~~~~~~~~~~219    │220    └─ lib/nerves/build_action/sort_apps.ex:6: Nerves.BuildAction.SortApps (module)221222    warning: redefining module Nerves.BuildAction.StripAll (current version loaded from /work/proj/_build/bbb/lib/nerves/ebin/Elixir.Nerves.BuildAction.StripAll.beam)223    │224  5 │ defmodule Nerves.BuildAction.StripAll do225    │ ~~~~~~~~~~~~~~~~~~~~~~~~~~~~~~~~~~~~~~~~226    │227    └─ lib/nerves/build_action/strip_all.ex:5: Nerves.BuildAction.StripAll (module)228229    warning: redefining module Nerves.BuildAction.Trimmer (current version loaded from /work/proj/_build/bbb/lib/nerves/ebin/Elixir.Nerves.BuildAction.Trimmer.beam)230    │231  5 │ defmodule Nerves.BuildAction.Trimmer do232    │ ~~~~~~~~~~~~~~~~~~~~~~~~~~~~~~~~~~~~~~~233    │234    └─ lib/nerves/build_action/trimmer.ex:5: Nerves.BuildAction.Trimmer (module)235236    warning: redefining module Nerves.BuildPlan (current version loaded from /work/proj/_build/bbb/lib/nerves/ebin/Elixir.Nerves.BuildPlan.beam)237    │238  5 │ defmodule Nerves.BuildPlan do239    │ ~~~~~~~~~~~~~~~~~~~~~~~~~~~~~240    │241    └─ lib/nerves/build_plan.ex:5: Nerves.BuildPlan (module)242243    warning: redefining module Nerves.BuildPlan.Checks (current version loaded from /work/proj/_build/bbb/lib/nerves/ebin/Elixir.Nerves.BuildPlan.Checks.beam)244    │245  5 │ defmodule Nerves.BuildPlan.Checks do246    │ ~~~~~~~~~~~~~~~~~~~~~~~~~~~~~~~~~~~~247    │248    └─ lib/nerves/build_plan/checks.ex:5: Nerves.BuildPlan.Checks (module)249250    warning: redefining module Nerves.Container (current version loaded from /work/proj/_build/bbb/lib/nerves/ebin/Elixir.Nerves.Container.beam)251    │252  6 │ defmodule Nerves.Container do253    │ ~~~~~~~~~~~~~~~~~~~~~~~~~~~~~254    │255    └─ lib/nerves/container.ex:6: Nerves.Container (module)256257    warning: redefining module Nerves.Fingerprint (current version loaded from /work/proj/_build/bbb/lib/nerves/ebin/Elixir.Nerves.Fingerprint.beam)258    │259  5 │ defmodule Nerves.Fingerprint do260    │ ~~~~~~~~~~~~~~~~~~~~~~~~~~~~~~~261    │262    └─ lib/nerves/fingerprint.ex:5: Nerves.Fingerprint (module)263264    warning: redefining module Nerves.MixPackage (current version loaded from /work/proj/_build/bbb/lib/nerves/ebin/Elixir.Nerves.MixPackage.beam)265    │266  5 │ defmodule Nerves.MixPackage do267    │ ~~~~~~~~~~~~~~~~~~~~~~~~~~~~~~268    │269    └─ lib/nerves/mix_package.ex:5: Nerves.MixPackage (module)270271    warning: redefining module Nerves.Paths (current version loaded from /work/proj/_build/bbb/lib/nerves/ebin/Elixir.Nerves.Paths.beam)272    │273  5 │ defmodule Nerves.Paths do274    │ ~~~~~~~~~~~~~~~~~~~~~~~~~275    │276    └─ lib/nerves/paths.ex:5: Nerves.Paths (module)277278    warning: redefining module Nerves.TargetTuple (current version loaded from /work/proj/_build/bbb/lib/nerves/ebin/Elixir.Nerves.TargetTuple.beam)279    │280  5 │ defmodule Nerves.TargetTuple do281    │ ~~~~~~~~~~~~~~~~~~~~~~~~~~~~~~~282    │283    └─ lib/nerves/target_tuple.ex:5: Nerves.TargetTuple (module)284285Generated nerves app286==> nerves_toolchain_armv7_nerves_linux_gnueabihf287Compiling 1 file (.ex)288Generated nerves_toolchain_armv7_nerves_linux_gnueabihf app289==> option_ex290Compiling 1 file (.ex)291Generated option_ex app292==> font_metrics293Compiling 2 files (.ex)294Generated font_metrics app295==> truetype_metrics296Compiling 1 file (.ex)297     warning: the variable "offset" is accessed inside size(...) of a bitstring but it was defined outside of the match. You must precede it with the pin operator298     │299 334 │         <<_::binary-size(offset), cmap::binary>> = cmap_data300     │                          ~301     │302     └─ lib/truetype_metrics.ex:334:26: TruetypeMetrics.do_parse_cmap_glyphs_ids/1303304     warning: the variable "skip" is accessed inside size(...) of a bitstring but it was defined outside of the match. You must precede it with the pin operator305     │306 446 │     <<_::binary-size(skip), id::unsigned-size(16)-big, _::binary>> = sub_table307     │                      ~308     │309     └─ lib/truetype_metrics.ex:446:22: TruetypeMetrics.lookup_cmap_type_4/2310311     warning: the variable "offset" is accessed inside size(...) of a bitstring but it was defined outside of the match. You must precede it with the pin operator312     │313 678 │           _::binary-size(offset),314     │                          ~315     │316     └─ lib/truetype_metrics.ex:678:26: TruetypeMetrics.get_table_data/3317318     warning: the variable "table_size" is accessed inside size(...) of a bitstring but it was defined outside of the match. You must precede it with the pin operator319     │320 679 │           table_data::binary-size(table_size),321     │                                   ~322     │323     └─ lib/truetype_metrics.ex:679:35: TruetypeMetrics.get_table_data/3324325     warning: the variable "offset" is accessed inside size(...) of a bitstring but it was defined outside of the match. You must precede it with the pin operator326     │327 700 │       _::binary-size(offset),328     │                      ~329     │330     └─ lib/truetype_metrics.ex:700:22: TruetypeMetrics.do_get_table_data/2331332     warning: the variable "table_size" is accessed inside size(...) of a bitstring but it was defined outside of the match. You must precede it with the pin operator333     │334 701 │       table_data::binary-size(table_size),335     │                               ~336     │337     └─ lib/truetype_metrics.ex:701:31: TruetypeMetrics.do_get_table_data/2338339Generated truetype_metrics app340==> uboot_env341Compiling 5 files (.ex)342Generated uboot_env app343==> ex_image_info344Compiling 12 files (.ex)345    warning: the variable "block_len" is accessed inside size(...) of a bitstring but it was defined outside of the match. You must precede it with the pin operator346    │347 41 │       <<_::bytes-size(block_len), 0xFF, sof::size(8), next::binary>> ->348    │                       ~349    │350    └─ lib/ex_image_info/types/jpeg.ex:41:23: ExImageInfo.Types.JPEG.parse_jpeg_block/2351352    warning: the variable "idf_off_pos" is accessed inside size(...) of a bitstring but it was defined outside of the match. You must precede it with the pin operator353    │354 56 │       <<_skip1::bytes-size(idf_off_pos), _skip2::bytes-size(2),355    │                            ~356    │357    └─ lib/ex_image_info/types/tiff.ex:56:28: ExImageInfo.Types.TIFF.parse_tiff_block/4358359    warning: the variable "buff_size" is accessed inside size(...) of a bitstring but it was defined outside of the match. You must precede it with the pin operator360    │361 57 │         buff_idf::bytes-size(buff_size), _::binary>> ->362    │                              ~363    │364    └─ lib/ex_image_info/types/tiff.ex:57:30: ExImageInfo.Types.TIFF.parse_tiff_block/4365366    warning: unused require Bitwise367    │368  7 │   require Bitwise369    │   ~370    │371    └─ lib/ex_image_info/types/tiff.ex:7:3372373    warning: unused require Bitwise374    │375  6 │   require Bitwise376    │   ~377    │378    └─ lib/ex_image_info/types/webp.ex:6:3379380    warning: this clause of defp parse_jpeg_block/2 is never used (or it will always fail/warn when invoked)381    │382 49 │   defp parse_jpeg_block(_, _), do: nil383    │        ~384    │385    └─ lib/ex_image_info/types/jpeg.ex:49:8: ExImageInfo.Types.JPEG.parse_jpeg_block/2386387Generated ex_image_info app388==> scenic389mkdir -p /work/proj/_build/bbb/lib/scenic/ebin/../priv390mkdir -p /work/proj/_build/bbb/lib/scenic/ebin/../obj391/home/nerves/.nerves/artifacts/nerves_toolchain_armv7_nerves_linux_gnueabihf-15.3.1/bin/armv7-nerves-linux-gnueabihf-gcc -c -I/home/nerves/.nerves/artifacts/nerves_system_bbb-2.30.2/staging/usr/lib/erlang/erts-17.0.6/include -I/home/nerves/.nerves/artifacts/nerves_system_bbb-2.30.2/staging/usr/lib/erlang/lib/erl_interface-5.8.2/include -mabi=aapcs-linux -mfpu=vfpv3 -marm -fstack-protector-strong -mfloat-abi=hard -mcpu=cortex-a8 -fPIE -pie -Wl,-z,now -Wl,-z,relro -D_LARGEFILE_SOURCE -D_LARGEFILE64_SOURCE -D_FILE_OFFSET_BITS=64  -pipe -O2 --sysroot /home/nerves/.nerves/artifacts/nerves_system_bbb-2.30.2/staging -fPIC -o /work/proj/_build/bbb/lib/scenic/ebin/../obj/line.o c_src/line.c392/home/nerves/.nerves/artifacts/nerves_toolchain_armv7_nerves_linux_gnueabihf-15.3.1/bin/armv7-nerves-linux-gnueabihf-gcc -c -I/home/nerves/.nerves/artifacts/nerves_system_bbb-2.30.2/staging/usr/lib/erlang/erts-17.0.6/include -I/home/nerves/.nerves/artifacts/nerves_system_bbb-2.30.2/staging/usr/lib/erlang/lib/erl_interface-5.8.2/include -mabi=aapcs-linux -mfpu=vfpv3 -marm -fstack-protector-strong -mfloat-abi=hard -mcpu=cortex-a8 -fPIE -pie -Wl,-z,now -Wl,-z,relro -D_LARGEFILE_SOURCE -D_LARGEFILE64_SOURCE -D_FILE_OFFSET_BITS=64  -pipe -O2 --sysroot /home/nerves/.nerves/artifacts/nerves_system_bbb-2.30.2/staging -fPIC -o /work/proj/_build/bbb/lib/scenic/ebin/../obj/matrix.o c_src/matrix.c393/home/nerves/.nerves/artifacts/nerves_toolchain_armv7_nerves_linux_gnueabihf-15.3.1/bin/armv7-nerves-linux-gnueabihf-gcc -c -I/home/nerves/.nerves/artifacts/nerves_system_bbb-2.30.2/staging/usr/lib/erlang/erts-17.0.6/include -I/home/nerves/.nerves/artifacts/nerves_system_bbb-2.30.2/staging/usr/lib/erlang/lib/erl_interface-5.8.2/include -mabi=aapcs-linux -mfpu=vfpv3 -marm -fstack-protector-strong -mfloat-abi=hard -mcpu=cortex-a8 -fPIE -pie -Wl,-z,now -Wl,-z,relro -D_LARGEFILE_SOURCE -D_LARGEFILE64_SOURCE -D_FILE_OFFSET_BITS=64  -pipe -O2 --sysroot /home/nerves/.nerves/artifacts/nerves_system_bbb-2.30.2/staging -fPIC -o /work/proj/_build/bbb/lib/scenic/ebin/../obj/bitmap.o c_src/bitmap.c394/home/nerves/.nerves/artifacts/nerves_toolchain_armv7_nerves_linux_gnueabihf-15.3.1/bin/armv7-nerves-linux-gnueabihf-gcc /work/proj/_build/bbb/lib/scenic/ebin/../obj/line.o -L/home/nerves/.nerves/artifacts/nerves_system_bbb-2.30.2/staging/usr/lib/erlang/lib/erl_interface-5.8.2/lib -lei --sysroot=/home/nerves/.nerves/artifacts/nerves_system_bbb-2.30.2/staging -shared  -dynamiclib -o /work/proj/_build/bbb/lib/scenic/ebin/../priv/line.so395/home/nerves/.nerves/artifacts/nerves_toolchain_armv7_nerves_linux_gnueabihf-15.3.1/bin/armv7-nerves-linux-gnueabihf-gcc /work/proj/_build/bbb/lib/scenic/ebin/../obj/bitmap.o -L/home/nerves/.nerves/artifacts/nerves_system_bbb-2.30.2/staging/usr/lib/erlang/lib/erl_interface-5.8.2/lib -lei --sysroot=/home/nerves/.nerves/artifacts/nerves_system_bbb-2.30.2/staging -shared  -dynamiclib -o /work/proj/_build/bbb/lib/scenic/ebin/../priv/bitmap.so396/home/nerves/.nerves/artifacts/nerves_toolchain_armv7_nerves_linux_gnueabihf-15.3.1/bin/armv7-nerves-linux-gnueabihf-gcc /work/proj/_build/bbb/lib/scenic/ebin/../obj/matrix.o -L/home/nerves/.nerves/artifacts/nerves_system_bbb-2.30.2/staging/usr/lib/erlang/lib/erl_interface-5.8.2/lib -lei --sysroot=/home/nerves/.nerves/artifacts/nerves_system_bbb-2.30.2/staging -shared  -dynamiclib -o /work/proj/_build/bbb/lib/scenic/ebin/../priv/matrix.so397Compiling 84 files (.ex)398    warning: using single-quoted strings to represent charlists is deprecated.399    Use ~c"" if you indeed want a charlist or use "" instead.400    You may run "mix format --migrate" to change all single-quoted401    strings to use the ~c sigil and fix this warning.402    │403 81 │       |> :filename.join('bitmap')404    │                         ~405    │406    └─ lib/scenic/assets/stream/bitmap.ex:81:25407408     warning: the variable "skip" is accessed inside size(...) of a bitstring but it was defined outside of the match. You must precede it with the pin operator409     │410 190 │     <<_::binary-size(skip), g::8, _::binary>> = p411     │                      ~412     │413     └─ lib/scenic/assets/stream/bitmap.ex:190:22: Scenic.Assets.Stream.Bitmap.do_get/4414415     warning: the variable "skip" is accessed inside size(...) of a bitstring but it was defined outside of the match. You must precede it with the pin operator416     │417 198 │     <<_::binary-size(skip), g::8, a::8, _::binary>> = p418     │                      ~419     │420     └─ lib/scenic/assets/stream/bitmap.ex:198:22: Scenic.Assets.Stream.Bitmap.do_get/4421422     warning: the variable "skip" is accessed inside size(...) of a bitstring but it was defined outside of the match. You must precede it with the pin operator423     │424 206 │     <<_::binary-size(skip), r::8, g::8, b::8, _::binary>> = p425     │                      ~426     │427     └─ lib/scenic/assets/stream/bitmap.ex:206:22: Scenic.Assets.Stream.Bitmap.do_get/4428429     warning: the variable "skip" is accessed inside size(...) of a bitstring but it was defined outside of the match. You must precede it with the pin operator430     │431 214 │     <<_::binary-size(skip), r::8, g::8, b::8, a::8, _::binary>> = p432     │                      ~433     │434     └─ lib/scenic/assets/stream/bitmap.ex:214:22: Scenic.Assets.Stream.Bitmap.do_get/4435436     warning: using single-quoted strings to represent charlists is deprecated.437     Use ~c"" if you indeed want a charlist or use "" instead.438     You may run "mix format --migrate" to change all single-quoted439     strings to use the ~c sigil and fix this warning.440     │441 105 │     space_width = FontMetrics.width(' ', @default_font_size, fm)442     │                                     ~443     │444     └─ lib/scenic/component/input/checkbox.ex:105:37445446     warning: using single-quoted strings to represent charlists is deprecated.447     Use ~c"" if you indeed want a charlist or use "" instead.448     You may run "mix format --migrate" to change all single-quoted449     strings to use the ~c sigil and fix this warning.450     │451 177 │     space_width = FontMetrics.width(' ', @default_font_size, fm)452     │                                     ~453     │454     └─ lib/scenic/component/input/checkbox.ex:177:37455456    warning: using single-quoted strings to represent charlists is deprecated.457    Use ~c"" if you indeed want a charlist or use "" instead.458    You may run "mix format --migrate" to change all single-quoted459    strings to use the ~c sigil and fix this warning.460    │461 80 │     space_width = FontMetrics.width(' ', @default_font_size, fm)462    │                                     ~463    │464    └─ lib/scenic/component/input/radio_button.ex:80:37465466     warning: using single-quoted strings to represent charlists is deprecated.467     Use ~c"" if you indeed want a charlist or use "" instead.468     You may run "mix format --migrate" to change all single-quoted469     strings to use the ~c sigil and fix this warning.470     │471 143 │     space_width = FontMetrics.width(' ', @default_font_size, fm)472     │                                     ~473     │474     └─ lib/scenic/component/input/radio_button.ex:143:37475476     warning: using single-quoted strings to represent charlists is deprecated.477     Use ~c"" if you indeed want a charlist or use "" instead.478     You may run "mix format --migrate" to change all single-quoted479     strings to use the ~c sigil and fix this warning.480     │481 227 │     space_width = FontMetrics.width(' ', @default_font_size, fm)482     │                                     ~483     │484     └─ lib/scenic/component/input/radio_group.ex:227:37485486     warning: using single-quoted strings to represent charlists is deprecated.487     Use ~c"" if you indeed want a charlist or use "" instead.488     You may run "mix format --migrate" to change all single-quoted489     strings to use the ~c sigil and fix this warning.490     │491 113 │   @password_char '*'492     │                  ~493     │494     └─ lib/scenic/component/input/text_field.ex:113:18495496warning: pattern matching on 0.0 is equivalent to matching only on +0.0. Instead you must match on +0.0 or -0.0497└─ lib/scenic/graph/bounds.ex: Scenic.Graph.Bounds.pts_arc_to/6498499warning: pattern matching on 0.0 is equivalent to matching only on +0.0. Instead you must match on +0.0 or -0.0500└─ lib/scenic/graph/bounds.ex: Scenic.Graph.Bounds.pts_arc_to/6501502    warning: using single-quoted strings to represent charlists is deprecated.503    Use ~c"" if you indeed want a charlist or use "" instead.504    You may run "mix format --migrate" to change all single-quoted505    strings to use the ~c sigil and fix this warning.506    │507 31 │       |> :filename.join('line')508    │                         ~509    │510    └─ lib/scenic/math/line.ex:31:25511512    warning: using single-quoted strings to represent charlists is deprecated.513    Use ~c"" if you indeed want a charlist or use "" instead.514    You may run "mix format --migrate" to change all single-quoted515    strings to use the ~c sigil and fix this warning.516    │517 37 │       |> :filename.join('matrix')518    │                         ~519    │520    └─ lib/scenic/math/matrix.ex:37:25521522     warning: the variable "skip_size" is accessed inside size(...) of a bitstring but it was defined outside of the match. You must precede it with the pin operator523     │524 490 │       _::binary-size(skip_size),525     │                      ~526     │527     └─ lib/scenic/math/matrix.ex:490:22: Scenic.Math.Matrix.get/3528529     warning: the variable "skip_size" is accessed inside size(...) of a bitstring but it was defined outside of the match. You must precede it with the pin operator530     │531 521 │       pre::binary-size(skip_size),532     │                        ~533     │534     └─ lib/scenic/math/matrix.ex:521:24: Scenic.Math.Matrix.put/4535536warning: pattern matching on 0.0 is equivalent to matching only on +0.0. Instead you must match on +0.0 or -0.0537└─ lib/scenic/math/matrix.ex: Scenic.Math.Matrix.invert/1538539warning: pattern matching on 0.0 is equivalent to matching only on +0.0. Instead you must match on +0.0 or -0.0540└─ lib/scenic/math/vector_2.ex: Scenic.Math.Vector2.normalize/1541542      warning: the variable "bytes" is accessed inside size(...) of a bitstring but it was defined outside of the match. You must precede it with the pin operator543      │544 2730 │       str::binary-size(bytes),545      │                        ~546      │547      └─ lib/scenic/script.ex:2730:24: Scenic.Script.extract_string/2548549      warning: the variable "buff_size" is accessed inside size(...) of a bitstring but it was defined outside of the match. You must precede it with the pin operator550      │551 2731 │       _buff::binary-size(buff_size),552      │                          ~553      │554      └─ lib/scenic/script.ex:2731:26: Scenic.Script.extract_string/2555556     warning: this clause of defp do_special_theme_outline/3 is never used (or it will always fail/warn when invoked)557     │558 281 │   defp do_special_theme_outline(graph, :dark, border) do559     │        ~560     │561     └─ lib/scenic/component/button.ex:281:8: Scenic.Component.Button.do_special_theme_outline/3562563     warning: this clause of defp do_special_theme_outline/3 is never used (or it will always fail/warn when invoked)564     │565 285 │   defp do_special_theme_outline(graph, :light, border) do566     │        ~567     │568     └─ lib/scenic/component/button.ex:285:8: Scenic.Component.Button.do_special_theme_outline/3569570     warning: the following clause cannot match because the previous clauses already matched all possible values:571572         err ->573574     it attempts to match on the result of:575576         child(scene, id)577578     which has the already matched type:579580         dynamic({:ok, term()})581582     where "err" was given the type:583584         # type: dynamic({:ok, term()})585         # from: lib/scenic/scene.ex:495:7586         err587588     type warning found at:589     │590 495 │       err -> err591     │           ~592     │593     └─ lib/scenic/scene.ex:495:11: Scenic.Scene.get_child/2594595     warning: the following clause cannot match because the previous clauses already matched all possible values:596597         err ->598599     it attempts to match on the result of:600601         child(scene, id)602603     which has the already matched type:604605         dynamic({:ok, term()})606607     where "err" was given the type:608609         # type: dynamic({:ok, term()})610         # from: lib/scenic/scene.ex:523:7611         err612613     type warning found at:614     │615 523 │       err ->616     │           ~617     │618     └─ lib/scenic/scene.ex:523:11: Scenic.Scene.put_child/3619620     warning: the following clause cannot match because the previous clauses already matched all possible values:621622         err ->623624     it attempts to match on the result of:625626         child(scene, id)627628     which has the already matched type:629630         dynamic({:ok, term()})631632     where "err" was given the type:633634         # type: dynamic({:ok, term()})635         # from: lib/scenic/scene.ex:559:7636         err637638     type warning found at:639     │640 559 │       err ->641     │           ~642     │643     └─ lib/scenic/scene.ex:559:11: Scenic.Scene.fetch_child/2644645      warning: the following clause will never match:646647          _ ->648649      it is expected to match on type:650651          none()652653      type warning found at:654      │655 1249 │         _ -> state656      │         ~657      │658      └─ lib/scenic/view_port.ex:1249:9: Scenic.ViewPort.internal_put_graph/3659660     warning: the following clause will never match:661662         err ->663664     it is expected to match on type:665666         none()667668     type warning found at:669     │670 392 │       err -> err671     │       ~672     │673     └─ lib/scenic/view_port.ex:392:7: Scenic.ViewPort.put_graph/4674675Generated scenic app676==> scenic_driver_glfw677mkdir -p /work/proj/_build/bbb/lib/scenic_driver_glfw/priv/prod678/home/nerves/.nerves/artifacts/nerves_toolchain_armv7_nerves_linux_gnueabihf-15.3.1/bin/armv7-nerves-linux-gnueabihf-gcc -O3 -std=c99 `pkg-config --static --cflags glfw3 glew` -fPIC -o /work/proj/_build/bbb/lib/scenic_driver_glfw/priv/prod/scenic_driver_glfw c_src/main.c c_src/comms.c c_src/nanovg/nanovg.c c_src/utils.c c_src/render_script.c c_src/tx.c --sysroot=/home/nerves/.nerves/artifacts/nerves_system_bbb-2.30.2/staging `pkg-config --static --libs glfw3 glew` -lGL -lm -lrt679Package glfw3 was not found in the pkg-config search path.680Perhaps you should add the directory containing `glfw3.pc'681to the PKG_CONFIG_PATH environment variable682Package 'glfw3', required by 'virtual:world', not found683Package 'glew', required by 'virtual:world', not found684Package glfw3 was not found in the pkg-config search path.685Perhaps you should add the directory containing `glfw3.pc'686to the PKG_CONFIG_PATH environment variable687Package 'glfw3', required by 'virtual:world', not found688Package 'glew', required by 'virtual:world', not found689c_src/main.c:13:10: fatal error: GL/glew.h: No such file or directory690   13 | #include <GL/glew.h>691      |          ^~~~~~~~~~~692compilation terminated.693c_src/comms.c:10:10: fatal error: GLFW/glfw3.h: No such file or directory694   10 | #include <GLFW/glfw3.h>695      |          ^~~~~~~~~~~~~~696compilation terminated.697In file included from c_src/nanovg/nanovg.c:28:698c_src/nanovg/stb_image.h: In function 'stbi__parse_png_file':699c_src/nanovg/stb_image.h:4399:25: warning: writing 1 byte into a region of size 0 [-Wstringop-overflow=]700 4399 |                   tc[k] = (stbi_uc) (stbi__get16be(s) & 255) * stbi__depth_scale_table[depth]; // non 8-bit images will be larger701      |                   ~~~~~~^~~~~~~~~~~~~~~~~~~~~~~~~~~~~~~~~~~~~~~~~~~~~~~~~~~~~~~~~~~~~~~~~~~~~702c_src/nanovg/stb_image.h:4322:25: note: at offset 3 into destination object 'tc' of size 3703 4322 |    stbi_uc has_trans=0, tc[3];704      |                         ^~705c_src/utils.c:9:10: fatal error: GL/glew.h: No such file or directory706    9 | #include <GL/glew.h>707      |          ^~~~~~~~~~~708compilation terminated.709c_src/render_script.c:11:10: fatal error: GLFW/glfw3.h: No such file or directory710   11 | #include <GLFW/glfw3.h>711      |          ^~~~~~~~~~~~~~712compilation terminated.713In file included from c_src/tx.c:13:714c_src/comms.h:14:10: fatal error: GLFW/glfw3.h: No such file or directory715   14 | #include <GLFW/glfw3.h>716      |          ^~~~~~~~~~~~~~717compilation terminated.718make: *** [Makefile:46: /work/proj/_build/bbb/lib/scenic_driver_glfw/priv/prod/scenic_driver_glfw] Error 1719could not compile dependency :scenic_driver_glfw, "mix compile" failed. Errors may have been logged above. You can recompile this dependency with "mix deps.compile scenic_driver_glfw --force", update it with "mix deps.update scenic_driver_glfw" or clean it with "mix deps.clean scenic_driver_glfw"720==> nerves_compatibility_test721** (Mix) Could not compile with "make" (exit status: 2).722You need to have gcc and make installed. If you are using723Ubuntu or any other Debian-based system, install the packages724"build-essential". Also install "erlang-dev" package if not725included in your Erlang/OTP version. If you're on Fedora, run726"dnf group install 'Development Tools'".727