Build log
nerves_system_mangopi_mq_pro
scenic_scrollable 0.1.0 · fail · run scenic_scrollable-0.1.0-1791097394233
729 of 729 lines
1Resolving Hex dependencies...2Resolution completed in 0.157s3Unchanged:4 circular_buffer 1.1.05 elixir_make 0.7.86 ex_image_info 0.2.77 font_metrics 0.5.28 interactive_cmd 0.1.49 nerves 2.0.0-pre.210 nerves_discovery 0.1.511 nerves_logging 0.2.412 nerves_runtime 0.13.1313 nerves_system_bbb 2.30.214 nerves_system_br 1.34.415 nerves_system_mangopi_mq_pro 0.17.216 nerves_system_qemu_aarch64 0.4.217 nerves_system_rpi0 2.1.218 nerves_system_rpi4 2.1.219 nerves_system_rpi5 2.1.220 nerves_system_trellis 0.5.021 nerves_system_x86_64 1.34.222 nerves_toolchain_aarch64_nerves_linux_gnu 15.3.123 nerves_toolchain_armv6_nerves_linux_gnueabihf 15.3.124 nerves_toolchain_armv7_nerves_linux_gnueabihf 15.3.125 nerves_toolchain_riscv64_nerves_linux_gnu 15.3.126 nerves_toolchain_x86_64_nerves_linux_musl 15.3.127 nerves_uevent 0.1.728 nimble_options 1.1.129 option_ex 0.2.030 property_table 0.3.431 result_ex 0.1.032 ring_logger 0.11.733 scenic 0.11.234 scenic_driver_glfw 0.10.135 scenic_scrollable 0.1.036 tablet 0.3.337 toolshed 0.5.038 truetype_metrics 0.6.139 uboot_env 1.0.240* Getting scenic_scrollable (Hex package)41* Getting nerves (Hex package)42* Getting ring_logger (Hex package)43* Getting toolshed (Hex package)44* Getting nerves_runtime (Hex package)45* Getting nerves_system_bbb (Hex package)46* Getting nerves_system_mangopi_mq_pro (Hex package)47* Getting nerves_system_qemu_aarch64 (Hex package)48* Getting nerves_system_rpi0 (Hex package)49* Getting nerves_system_rpi4 (Hex package)50* Getting nerves_system_rpi5 (Hex package)51* Getting nerves_system_trellis (Hex package)52* Getting nerves_system_x86_64 (Hex package)53* Getting nerves_system_br (Hex package)54* Getting nerves_toolchain_x86_64_nerves_linux_musl (Hex package)55* Getting nerves_toolchain_armv7_nerves_linux_gnueabihf (Hex package)56* Getting nerves_toolchain_aarch64_nerves_linux_gnu (Hex package)57* Getting nerves_toolchain_armv6_nerves_linux_gnueabihf (Hex package)58* Getting nerves_toolchain_riscv64_nerves_linux_gnu (Hex package)59* Getting nerves_logging (Hex package)60* Getting nerves_uevent (Hex package)61* Getting uboot_env (Hex package)62* Getting elixir_make (Hex package)63* Getting property_table (Hex package)64* Getting circular_buffer (Hex package)65* Getting interactive_cmd (Hex package)66* Getting nerves_discovery (Hex package)67* Getting tablet (Hex package)68* Getting option_ex (Hex package)69* Getting result_ex (Hex package)70* Getting scenic (Hex package)71* Getting scenic_driver_glfw (Hex package)72* Getting ex_image_info (Hex package)73* Getting font_metrics (Hex package)74* Getting nimble_options (Hex package)75* Getting truetype_metrics (Hex package)76==> nerves_system_br77Generated nerves_system_br app78==> circular_buffer79Compiling 1 file (.ex)80Generated circular_buffer app81==> nimble_options82Compiling 3 files (.ex)83Generated nimble_options app84==> tablet85Compiling 2 files (.ex)86Generated tablet app87warning: "xref: [exclude: ...]" in your mix.exs file is deprecated, instead use: "elixirc_options: [no_warn_undefined: ...]"88 (mix 1.20.3) lib/mix/tasks/compile.elixir.ex:243: Mix.Tasks.Compile.Elixir.xref_exclude_opts/289 (mix 1.20.3) lib/mix/tasks/compile.elixir.ex:142: Mix.Tasks.Compile.Elixir.run/190 (mix 1.20.3) lib/mix/task.ex:502: anonymous fn/3 in Mix.Task.run_task/591 (mix 1.20.3) lib/mix/task.compiler.ex:299: Mix.Task.Compiler.run_compiler/292 (mix 1.20.3) lib/mix/task.compiler.ex:287: Mix.Task.Compiler.run/493 (mix 1.20.3) lib/mix/tasks/compile.all.ex:75: Mix.Tasks.Compile.All.do_run/29495==> elixir_make96Compiling 6 files (.ex)97 warning: unused require Logger98 │99 6 │ require Logger100 │ ~101 │102 └─ lib/elixir_make/precompiler.ex:6:3103104 warning: unused require Logger105 │106 4 │ require Logger107 │ ~108 │109 └─ lib/elixir_make/artefact.ex:4:3110111 warning: unused require Logger112 │113 16 │ require Logger114 │ ~115 │116 └─ lib/mix/tasks/elixir_make.precompile.ex:16:3117118Generated elixir_make app119==> nerves_logging120 CC kmsg_tailer.o121 LD kmsg_tailer122Compiling 5 files (.ex)123Generated nerves_logging app124==> nerves_discovery125Compiling 5 files (.ex)126Generated nerves_discovery app127==> result_ex128Compiling 1 file (.ex)129Generated result_ex app130==> ring_logger131Compiling 7 files (.ex)132Generated ring_logger app133==> interactive_cmd134Compiling 1 file (.ex)135Generated interactive_cmd app136==> nerves137Compiling 65 files (.ex)138 warning: redefining module Mix.Tasks.Nerves.Init (current version loaded from /work/proj/_build/mangopi_mq_pro/lib/nerves/ebin/Elixir.Mix.Tasks.Nerves.Init.beam)139 │140 6 │ defmodule Mix.Tasks.Nerves.Init do141 │ ~~~~~~~~~~~~~~~~~~~~~~~~~~~~~~~~~~142 │143 └─ lib/mix/tasks/nerves.init.ex:6: Mix.Tasks.Nerves.Init (module)144145 warning: redefining module Nerves (current version loaded from /work/proj/_build/mangopi_mq_pro/lib/nerves/ebin/Elixir.Nerves.beam)146 │147 6 │ defmodule Nerves do148 │ ~~~~~~~~~~~~~~~~~~~149 │150 └─ lib/nerves.ex:6: Nerves (module)151152 warning: redefining module Nerves.ArtifactResolver (current version loaded from /work/proj/_build/mangopi_mq_pro/lib/nerves/ebin/Elixir.Nerves.ArtifactResolver.beam)153 │154 5 │ defmodule Nerves.ArtifactResolver do155 │ ~~~~~~~~~~~~~~~~~~~~~~~~~~~~~~~~~~~~156 │157 └─ lib/nerves/artifact_resolver.ex:5: Nerves.ArtifactResolver (module)158159 warning: redefining module Nerves.BuildAction.AppModes (current version loaded from /work/proj/_build/mangopi_mq_pro/lib/nerves/ebin/Elixir.Nerves.BuildAction.AppModes.beam)160 │161 6 │ defmodule Nerves.BuildAction.AppModes do162 │ ~~~~~~~~~~~~~~~~~~~~~~~~~~~~~~~~~~~~~~~~163 │164 └─ lib/nerves/build_action/app_modes.ex:6: Nerves.BuildAction.AppModes (module)165166 warning: redefining module Nerves.BuildAction.CheckExecutables (current version loaded from /work/proj/_build/mangopi_mq_pro/lib/nerves/ebin/Elixir.Nerves.BuildAction.CheckExecutables.beam)167 │168 5 │ defmodule Nerves.BuildAction.CheckExecutables do169 │ ~~~~~~~~~~~~~~~~~~~~~~~~~~~~~~~~~~~~~~~~~~~~~~~~170 │171 └─ lib/nerves/build_action/check_executables.ex:5: Nerves.BuildAction.CheckExecutables (module)172173 warning: redefining module Nerves.BuildAction.Erlinit (current version loaded from /work/proj/_build/mangopi_mq_pro/lib/nerves/ebin/Elixir.Nerves.BuildAction.Erlinit.beam)174 │175 8 │ defmodule Nerves.BuildAction.Erlinit do176 │ ~~~~~~~~~~~~~~~~~~~~~~~~~~~~~~~~~~~~~~~177 │178 └─ lib/nerves/build_action/erlinit.ex:8: Nerves.BuildAction.Erlinit (module)179180 warning: redefining module Nerves.BuildAction.Firmware (current version loaded from /work/proj/_build/mangopi_mq_pro/lib/nerves/ebin/Elixir.Nerves.BuildAction.Firmware.beam)181 │182 5 │ defmodule Nerves.BuildAction.Firmware do183 │ ~~~~~~~~~~~~~~~~~~~~~~~~~~~~~~~~~~~~~~~~184 │185 └─ lib/nerves/build_action/firmware.ex:5: Nerves.BuildAction.Firmware (module)186187 warning: redefining module Nerves.BuildAction.IExStartupCheck (current version loaded from /work/proj/_build/mangopi_mq_pro/lib/nerves/ebin/Elixir.Nerves.BuildAction.IExStartupCheck.beam)188 │189 7 │ defmodule Nerves.BuildAction.IExStartupCheck do190 │ ~~~~~~~~~~~~~~~~~~~~~~~~~~~~~~~~~~~~~~~~~~~~~~~191 │192 └─ lib/nerves/build_action/iex_startup_check.ex:7: Nerves.BuildAction.IExStartupCheck (module)193194 warning: redefining module Nerves.BuildAction.NervesV1System (current version loaded from /work/proj/_build/mangopi_mq_pro/lib/nerves/ebin/Elixir.Nerves.BuildAction.NervesV1System.beam)195 │196 5 │ defmodule Nerves.BuildAction.NervesV1System do197 │ ~~~~~~~~~~~~~~~~~~~~~~~~~~~~~~~~~~~~~~~~~~~~~~198 │199 └─ lib/nerves/build_action/nerves_v1_system.ex:5: Nerves.BuildAction.NervesV1System (module)200201 warning: redefining module Nerves.BuildAction.NervesV1Toolchain (current version loaded from /work/proj/_build/mangopi_mq_pro/lib/nerves/ebin/Elixir.Nerves.BuildAction.NervesV1Toolchain.beam)202 │203 5 │ defmodule Nerves.BuildAction.NervesV1Toolchain do204 │ ~~~~~~~~~~~~~~~~~~~~~~~~~~~~~~~~~~~~~~~~~~~~~~~~~205 │206 └─ lib/nerves/build_action/nerves_v1_toolchain.ex:5: Nerves.BuildAction.NervesV1Toolchain (module)207208 warning: redefining module Nerves.BuildAction.Rootfs (current version loaded from /work/proj/_build/mangopi_mq_pro/lib/nerves/ebin/Elixir.Nerves.BuildAction.Rootfs.beam)209 │210 5 │ defmodule Nerves.BuildAction.Rootfs do211 │ ~~~~~~~~~~~~~~~~~~~~~~~~~~~~~~~~~~~~~~212 │213 └─ lib/nerves/build_action/rootfs.ex:5: Nerves.BuildAction.Rootfs (module)214215 warning: redefining module Nerves.BuildAction.SortApps (current version loaded from /work/proj/_build/mangopi_mq_pro/lib/nerves/ebin/Elixir.Nerves.BuildAction.SortApps.beam)216 │217 6 │ defmodule Nerves.BuildAction.SortApps do218 │ ~~~~~~~~~~~~~~~~~~~~~~~~~~~~~~~~~~~~~~~~219 │220 └─ lib/nerves/build_action/sort_apps.ex:6: Nerves.BuildAction.SortApps (module)221222 warning: redefining module Nerves.BuildAction.StripAll (current version loaded from /work/proj/_build/mangopi_mq_pro/lib/nerves/ebin/Elixir.Nerves.BuildAction.StripAll.beam)223 │224 5 │ defmodule Nerves.BuildAction.StripAll do225 │ ~~~~~~~~~~~~~~~~~~~~~~~~~~~~~~~~~~~~~~~~226 │227 └─ lib/nerves/build_action/strip_all.ex:5: Nerves.BuildAction.StripAll (module)228229 warning: redefining module Nerves.BuildAction.Trimmer (current version loaded from /work/proj/_build/mangopi_mq_pro/lib/nerves/ebin/Elixir.Nerves.BuildAction.Trimmer.beam)230 │231 5 │ defmodule Nerves.BuildAction.Trimmer do232 │ ~~~~~~~~~~~~~~~~~~~~~~~~~~~~~~~~~~~~~~~233 │234 └─ lib/nerves/build_action/trimmer.ex:5: Nerves.BuildAction.Trimmer (module)235236 warning: redefining module Nerves.BuildPlan (current version loaded from /work/proj/_build/mangopi_mq_pro/lib/nerves/ebin/Elixir.Nerves.BuildPlan.beam)237 │238 5 │ defmodule Nerves.BuildPlan do239 │ ~~~~~~~~~~~~~~~~~~~~~~~~~~~~~240 │241 └─ lib/nerves/build_plan.ex:5: Nerves.BuildPlan (module)242243 warning: redefining module Nerves.BuildPlan.Checks (current version loaded from /work/proj/_build/mangopi_mq_pro/lib/nerves/ebin/Elixir.Nerves.BuildPlan.Checks.beam)244 │245 5 │ defmodule Nerves.BuildPlan.Checks do246 │ ~~~~~~~~~~~~~~~~~~~~~~~~~~~~~~~~~~~~247 │248 └─ lib/nerves/build_plan/checks.ex:5: Nerves.BuildPlan.Checks (module)249250 warning: redefining module Nerves.Container (current version loaded from /work/proj/_build/mangopi_mq_pro/lib/nerves/ebin/Elixir.Nerves.Container.beam)251 │252 6 │ defmodule Nerves.Container do253 │ ~~~~~~~~~~~~~~~~~~~~~~~~~~~~~254 │255 └─ lib/nerves/container.ex:6: Nerves.Container (module)256257 warning: redefining module Nerves.Fingerprint (current version loaded from /work/proj/_build/mangopi_mq_pro/lib/nerves/ebin/Elixir.Nerves.Fingerprint.beam)258 │259 5 │ defmodule Nerves.Fingerprint do260 │ ~~~~~~~~~~~~~~~~~~~~~~~~~~~~~~~261 │262 └─ lib/nerves/fingerprint.ex:5: Nerves.Fingerprint (module)263264 warning: redefining module Nerves.MixPackage (current version loaded from /work/proj/_build/mangopi_mq_pro/lib/nerves/ebin/Elixir.Nerves.MixPackage.beam)265 │266 5 │ defmodule Nerves.MixPackage do267 │ ~~~~~~~~~~~~~~~~~~~~~~~~~~~~~~268 │269 └─ lib/nerves/mix_package.ex:5: Nerves.MixPackage (module)270271 warning: redefining module Nerves.Paths (current version loaded from /work/proj/_build/mangopi_mq_pro/lib/nerves/ebin/Elixir.Nerves.Paths.beam)272 │273 5 │ defmodule Nerves.Paths do274 │ ~~~~~~~~~~~~~~~~~~~~~~~~~275 │276 └─ lib/nerves/paths.ex:5: Nerves.Paths (module)277278 warning: redefining module Nerves.TargetTuple (current version loaded from /work/proj/_build/mangopi_mq_pro/lib/nerves/ebin/Elixir.Nerves.TargetTuple.beam)279 │280 5 │ defmodule Nerves.TargetTuple do281 │ ~~~~~~~~~~~~~~~~~~~~~~~~~~~~~~~282 │283 └─ lib/nerves/target_tuple.ex:5: Nerves.TargetTuple (module)284285Generated nerves app286==> nerves_toolchain_riscv64_nerves_linux_gnu287Compiling 1 file (.ex)288Generated nerves_toolchain_riscv64_nerves_linux_gnu app289==> nerves_system_mangopi_mq_pro290Generated nerves_system_mangopi_mq_pro app291==> option_ex292Compiling 1 file (.ex)293Generated option_ex app294==> font_metrics295Compiling 2 files (.ex)296Generated font_metrics app297==> truetype_metrics298Compiling 1 file (.ex)299 warning: the variable "offset" is accessed inside size(...) of a bitstring but it was defined outside of the match. You must precede it with the pin operator300 │301 334 │ <<_::binary-size(offset), cmap::binary>> = cmap_data302 │ ~303 │304 └─ lib/truetype_metrics.ex:334:26: TruetypeMetrics.do_parse_cmap_glyphs_ids/1305306 warning: the variable "skip" is accessed inside size(...) of a bitstring but it was defined outside of the match. You must precede it with the pin operator307 │308 446 │ <<_::binary-size(skip), id::unsigned-size(16)-big, _::binary>> = sub_table309 │ ~310 │311 └─ lib/truetype_metrics.ex:446:22: TruetypeMetrics.lookup_cmap_type_4/2312313 warning: the variable "offset" is accessed inside size(...) of a bitstring but it was defined outside of the match. You must precede it with the pin operator314 │315 678 │ _::binary-size(offset),316 │ ~317 │318 └─ lib/truetype_metrics.ex:678:26: TruetypeMetrics.get_table_data/3319320 warning: the variable "table_size" is accessed inside size(...) of a bitstring but it was defined outside of the match. You must precede it with the pin operator321 │322 679 │ table_data::binary-size(table_size),323 │ ~324 │325 └─ lib/truetype_metrics.ex:679:35: TruetypeMetrics.get_table_data/3326327 warning: the variable "offset" is accessed inside size(...) of a bitstring but it was defined outside of the match. You must precede it with the pin operator328 │329 700 │ _::binary-size(offset),330 │ ~331 │332 └─ lib/truetype_metrics.ex:700:22: TruetypeMetrics.do_get_table_data/2333334 warning: the variable "table_size" is accessed inside size(...) of a bitstring but it was defined outside of the match. You must precede it with the pin operator335 │336 701 │ table_data::binary-size(table_size),337 │ ~338 │339 └─ lib/truetype_metrics.ex:701:31: TruetypeMetrics.do_get_table_data/2340341Generated truetype_metrics app342==> uboot_env343Compiling 5 files (.ex)344Generated uboot_env app345==> ex_image_info346Compiling 12 files (.ex)347 warning: the variable "block_len" is accessed inside size(...) of a bitstring but it was defined outside of the match. You must precede it with the pin operator348 │349 41 │ <<_::bytes-size(block_len), 0xFF, sof::size(8), next::binary>> ->350 │ ~351 │352 └─ lib/ex_image_info/types/jpeg.ex:41:23: ExImageInfo.Types.JPEG.parse_jpeg_block/2353354 warning: the variable "idf_off_pos" is accessed inside size(...) of a bitstring but it was defined outside of the match. You must precede it with the pin operator355 │356 56 │ <<_skip1::bytes-size(idf_off_pos), _skip2::bytes-size(2),357 │ ~358 │359 └─ lib/ex_image_info/types/tiff.ex:56:28: ExImageInfo.Types.TIFF.parse_tiff_block/4360361 warning: the variable "buff_size" is accessed inside size(...) of a bitstring but it was defined outside of the match. You must precede it with the pin operator362 │363 57 │ buff_idf::bytes-size(buff_size), _::binary>> ->364 │ ~365 │366 └─ lib/ex_image_info/types/tiff.ex:57:30: ExImageInfo.Types.TIFF.parse_tiff_block/4367368 warning: unused require Bitwise369 │370 7 │ require Bitwise371 │ ~372 │373 └─ lib/ex_image_info/types/tiff.ex:7:3374375 warning: unused require Bitwise376 │377 6 │ require Bitwise378 │ ~379 │380 └─ lib/ex_image_info/types/webp.ex:6:3381382 warning: this clause of defp parse_jpeg_block/2 is never used (or it will always fail/warn when invoked)383 │384 49 │ defp parse_jpeg_block(_, _), do: nil385 │ ~386 │387 └─ lib/ex_image_info/types/jpeg.ex:49:8: ExImageInfo.Types.JPEG.parse_jpeg_block/2388389Generated ex_image_info app390==> scenic391mkdir -p /work/proj/_build/mangopi_mq_pro/lib/scenic/ebin/../priv392mkdir -p /work/proj/_build/mangopi_mq_pro/lib/scenic/ebin/../obj393/home/nerves/.nerves/artifacts/nerves_toolchain_riscv64_nerves_linux_gnu-15.3.1/bin/riscv64-nerves-linux-gnu-gcc -c -I/home/nerves/.nerves/artifacts/nerves_system_mangopi_mq_pro-0.17.2/staging/usr/lib/erlang/erts-17.0.6/include -I/home/nerves/.nerves/artifacts/nerves_system_mangopi_mq_pro-0.17.2/staging/usr/lib/erlang/lib/erl_interface-5.8.2/include -mabi=lp64d -fstack-protector-strong -march=rv64imafdc_zicsr_zifencei -fPIE -pie -Wl,-z,now -Wl,-z,relro -D_LARGEFILE_SOURCE -D_LARGEFILE64_SOURCE -D_FILE_OFFSET_BITS=64 -pipe -O2 --sysroot /home/nerves/.nerves/artifacts/nerves_system_mangopi_mq_pro-0.17.2/staging -fPIC -o /work/proj/_build/mangopi_mq_pro/lib/scenic/ebin/../obj/line.o c_src/line.c394/home/nerves/.nerves/artifacts/nerves_toolchain_riscv64_nerves_linux_gnu-15.3.1/bin/riscv64-nerves-linux-gnu-gcc -c -I/home/nerves/.nerves/artifacts/nerves_system_mangopi_mq_pro-0.17.2/staging/usr/lib/erlang/erts-17.0.6/include -I/home/nerves/.nerves/artifacts/nerves_system_mangopi_mq_pro-0.17.2/staging/usr/lib/erlang/lib/erl_interface-5.8.2/include -mabi=lp64d -fstack-protector-strong -march=rv64imafdc_zicsr_zifencei -fPIE -pie -Wl,-z,now -Wl,-z,relro -D_LARGEFILE_SOURCE -D_LARGEFILE64_SOURCE -D_FILE_OFFSET_BITS=64 -pipe -O2 --sysroot /home/nerves/.nerves/artifacts/nerves_system_mangopi_mq_pro-0.17.2/staging -fPIC -o /work/proj/_build/mangopi_mq_pro/lib/scenic/ebin/../obj/matrix.o c_src/matrix.c395/home/nerves/.nerves/artifacts/nerves_toolchain_riscv64_nerves_linux_gnu-15.3.1/bin/riscv64-nerves-linux-gnu-gcc -c -I/home/nerves/.nerves/artifacts/nerves_system_mangopi_mq_pro-0.17.2/staging/usr/lib/erlang/erts-17.0.6/include -I/home/nerves/.nerves/artifacts/nerves_system_mangopi_mq_pro-0.17.2/staging/usr/lib/erlang/lib/erl_interface-5.8.2/include -mabi=lp64d -fstack-protector-strong -march=rv64imafdc_zicsr_zifencei -fPIE -pie -Wl,-z,now -Wl,-z,relro -D_LARGEFILE_SOURCE -D_LARGEFILE64_SOURCE -D_FILE_OFFSET_BITS=64 -pipe -O2 --sysroot /home/nerves/.nerves/artifacts/nerves_system_mangopi_mq_pro-0.17.2/staging -fPIC -o /work/proj/_build/mangopi_mq_pro/lib/scenic/ebin/../obj/bitmap.o c_src/bitmap.c396/home/nerves/.nerves/artifacts/nerves_toolchain_riscv64_nerves_linux_gnu-15.3.1/bin/riscv64-nerves-linux-gnu-gcc /work/proj/_build/mangopi_mq_pro/lib/scenic/ebin/../obj/line.o -L/home/nerves/.nerves/artifacts/nerves_system_mangopi_mq_pro-0.17.2/staging/usr/lib/erlang/lib/erl_interface-5.8.2/lib -lei --sysroot=/home/nerves/.nerves/artifacts/nerves_system_mangopi_mq_pro-0.17.2/staging -shared -dynamiclib -o /work/proj/_build/mangopi_mq_pro/lib/scenic/ebin/../priv/line.so397/home/nerves/.nerves/artifacts/nerves_toolchain_riscv64_nerves_linux_gnu-15.3.1/bin/riscv64-nerves-linux-gnu-gcc /work/proj/_build/mangopi_mq_pro/lib/scenic/ebin/../obj/matrix.o -L/home/nerves/.nerves/artifacts/nerves_system_mangopi_mq_pro-0.17.2/staging/usr/lib/erlang/lib/erl_interface-5.8.2/lib -lei --sysroot=/home/nerves/.nerves/artifacts/nerves_system_mangopi_mq_pro-0.17.2/staging -shared -dynamiclib -o /work/proj/_build/mangopi_mq_pro/lib/scenic/ebin/../priv/matrix.so398/home/nerves/.nerves/artifacts/nerves_toolchain_riscv64_nerves_linux_gnu-15.3.1/bin/riscv64-nerves-linux-gnu-gcc /work/proj/_build/mangopi_mq_pro/lib/scenic/ebin/../obj/bitmap.o -L/home/nerves/.nerves/artifacts/nerves_system_mangopi_mq_pro-0.17.2/staging/usr/lib/erlang/lib/erl_interface-5.8.2/lib -lei --sysroot=/home/nerves/.nerves/artifacts/nerves_system_mangopi_mq_pro-0.17.2/staging -shared -dynamiclib -o /work/proj/_build/mangopi_mq_pro/lib/scenic/ebin/../priv/bitmap.so399Compiling 84 files (.ex)400 warning: using single-quoted strings to represent charlists is deprecated.401 Use ~c"" if you indeed want a charlist or use "" instead.402 You may run "mix format --migrate" to change all single-quoted403 strings to use the ~c sigil and fix this warning.404 │405 81 │ |> :filename.join('bitmap')406 │ ~407 │408 └─ lib/scenic/assets/stream/bitmap.ex:81:25409410 warning: the variable "skip" is accessed inside size(...) of a bitstring but it was defined outside of the match. You must precede it with the pin operator411 │412 190 │ <<_::binary-size(skip), g::8, _::binary>> = p413 │ ~414 │415 └─ lib/scenic/assets/stream/bitmap.ex:190:22: Scenic.Assets.Stream.Bitmap.do_get/4416417 warning: the variable "skip" is accessed inside size(...) of a bitstring but it was defined outside of the match. You must precede it with the pin operator418 │419 198 │ <<_::binary-size(skip), g::8, a::8, _::binary>> = p420 │ ~421 │422 └─ lib/scenic/assets/stream/bitmap.ex:198:22: Scenic.Assets.Stream.Bitmap.do_get/4423424 warning: the variable "skip" is accessed inside size(...) of a bitstring but it was defined outside of the match. You must precede it with the pin operator425 │426 206 │ <<_::binary-size(skip), r::8, g::8, b::8, _::binary>> = p427 │ ~428 │429 └─ lib/scenic/assets/stream/bitmap.ex:206:22: Scenic.Assets.Stream.Bitmap.do_get/4430431 warning: the variable "skip" is accessed inside size(...) of a bitstring but it was defined outside of the match. You must precede it with the pin operator432 │433 214 │ <<_::binary-size(skip), r::8, g::8, b::8, a::8, _::binary>> = p434 │ ~435 │436 └─ lib/scenic/assets/stream/bitmap.ex:214:22: Scenic.Assets.Stream.Bitmap.do_get/4437438 warning: using single-quoted strings to represent charlists is deprecated.439 Use ~c"" if you indeed want a charlist or use "" instead.440 You may run "mix format --migrate" to change all single-quoted441 strings to use the ~c sigil and fix this warning.442 │443 105 │ space_width = FontMetrics.width(' ', @default_font_size, fm)444 │ ~445 │446 └─ lib/scenic/component/input/checkbox.ex:105:37447448 warning: using single-quoted strings to represent charlists is deprecated.449 Use ~c"" if you indeed want a charlist or use "" instead.450 You may run "mix format --migrate" to change all single-quoted451 strings to use the ~c sigil and fix this warning.452 │453 177 │ space_width = FontMetrics.width(' ', @default_font_size, fm)454 │ ~455 │456 └─ lib/scenic/component/input/checkbox.ex:177:37457458 warning: using single-quoted strings to represent charlists is deprecated.459 Use ~c"" if you indeed want a charlist or use "" instead.460 You may run "mix format --migrate" to change all single-quoted461 strings to use the ~c sigil and fix this warning.462 │463 80 │ space_width = FontMetrics.width(' ', @default_font_size, fm)464 │ ~465 │466 └─ lib/scenic/component/input/radio_button.ex:80:37467468 warning: using single-quoted strings to represent charlists is deprecated.469 Use ~c"" if you indeed want a charlist or use "" instead.470 You may run "mix format --migrate" to change all single-quoted471 strings to use the ~c sigil and fix this warning.472 │473 143 │ space_width = FontMetrics.width(' ', @default_font_size, fm)474 │ ~475 │476 └─ lib/scenic/component/input/radio_button.ex:143:37477478 warning: using single-quoted strings to represent charlists is deprecated.479 Use ~c"" if you indeed want a charlist or use "" instead.480 You may run "mix format --migrate" to change all single-quoted481 strings to use the ~c sigil and fix this warning.482 │483 227 │ space_width = FontMetrics.width(' ', @default_font_size, fm)484 │ ~485 │486 └─ lib/scenic/component/input/radio_group.ex:227:37487488 warning: using single-quoted strings to represent charlists is deprecated.489 Use ~c"" if you indeed want a charlist or use "" instead.490 You may run "mix format --migrate" to change all single-quoted491 strings to use the ~c sigil and fix this warning.492 │493 113 │ @password_char '*'494 │ ~495 │496 └─ lib/scenic/component/input/text_field.ex:113:18497498warning: pattern matching on 0.0 is equivalent to matching only on +0.0. Instead you must match on +0.0 or -0.0499└─ lib/scenic/graph/bounds.ex: Scenic.Graph.Bounds.pts_arc_to/6500501warning: pattern matching on 0.0 is equivalent to matching only on +0.0. Instead you must match on +0.0 or -0.0502└─ lib/scenic/graph/bounds.ex: Scenic.Graph.Bounds.pts_arc_to/6503504 warning: using single-quoted strings to represent charlists is deprecated.505 Use ~c"" if you indeed want a charlist or use "" instead.506 You may run "mix format --migrate" to change all single-quoted507 strings to use the ~c sigil and fix this warning.508 │509 31 │ |> :filename.join('line')510 │ ~511 │512 └─ lib/scenic/math/line.ex:31:25513514 warning: using single-quoted strings to represent charlists is deprecated.515 Use ~c"" if you indeed want a charlist or use "" instead.516 You may run "mix format --migrate" to change all single-quoted517 strings to use the ~c sigil and fix this warning.518 │519 37 │ |> :filename.join('matrix')520 │ ~521 │522 └─ lib/scenic/math/matrix.ex:37:25523524 warning: the variable "skip_size" is accessed inside size(...) of a bitstring but it was defined outside of the match. You must precede it with the pin operator525 │526 490 │ _::binary-size(skip_size),527 │ ~528 │529 └─ lib/scenic/math/matrix.ex:490:22: Scenic.Math.Matrix.get/3530531 warning: the variable "skip_size" is accessed inside size(...) of a bitstring but it was defined outside of the match. You must precede it with the pin operator532 │533 521 │ pre::binary-size(skip_size),534 │ ~535 │536 └─ lib/scenic/math/matrix.ex:521:24: Scenic.Math.Matrix.put/4537538warning: pattern matching on 0.0 is equivalent to matching only on +0.0. Instead you must match on +0.0 or -0.0539└─ lib/scenic/math/matrix.ex: Scenic.Math.Matrix.invert/1540541warning: pattern matching on 0.0 is equivalent to matching only on +0.0. Instead you must match on +0.0 or -0.0542└─ lib/scenic/math/vector_2.ex: Scenic.Math.Vector2.normalize/1543544 warning: the variable "bytes" is accessed inside size(...) of a bitstring but it was defined outside of the match. You must precede it with the pin operator545 │546 2730 │ str::binary-size(bytes),547 │ ~548 │549 └─ lib/scenic/script.ex:2730:24: Scenic.Script.extract_string/2550551 warning: the variable "buff_size" is accessed inside size(...) of a bitstring but it was defined outside of the match. You must precede it with the pin operator552 │553 2731 │ _buff::binary-size(buff_size),554 │ ~555 │556 └─ lib/scenic/script.ex:2731:26: Scenic.Script.extract_string/2557558 warning: this clause of defp do_special_theme_outline/3 is never used (or it will always fail/warn when invoked)559 │560 281 │ defp do_special_theme_outline(graph, :dark, border) do561 │ ~562 │563 └─ lib/scenic/component/button.ex:281:8: Scenic.Component.Button.do_special_theme_outline/3564565 warning: this clause of defp do_special_theme_outline/3 is never used (or it will always fail/warn when invoked)566 │567 285 │ defp do_special_theme_outline(graph, :light, border) do568 │ ~569 │570 └─ lib/scenic/component/button.ex:285:8: Scenic.Component.Button.do_special_theme_outline/3571572 warning: the following clause cannot match because the previous clauses already matched all possible values:573574 err ->575576 it attempts to match on the result of:577578 child(scene, id)579580 which has the already matched type:581582 dynamic({:ok, term()})583584 where "err" was given the type:585586 # type: dynamic({:ok, term()})587 # from: lib/scenic/scene.ex:495:7588 err589590 type warning found at:591 │592 495 │ err -> err593 │ ~594 │595 └─ lib/scenic/scene.ex:495:11: Scenic.Scene.get_child/2596597 warning: the following clause cannot match because the previous clauses already matched all possible values:598599 err ->600601 it attempts to match on the result of:602603 child(scene, id)604605 which has the already matched type:606607 dynamic({:ok, term()})608609 where "err" was given the type:610611 # type: dynamic({:ok, term()})612 # from: lib/scenic/scene.ex:523:7613 err614615 type warning found at:616 │617 523 │ err ->618 │ ~619 │620 └─ lib/scenic/scene.ex:523:11: Scenic.Scene.put_child/3621622 warning: the following clause cannot match because the previous clauses already matched all possible values:623624 err ->625626 it attempts to match on the result of:627628 child(scene, id)629630 which has the already matched type:631632 dynamic({:ok, term()})633634 where "err" was given the type:635636 # type: dynamic({:ok, term()})637 # from: lib/scenic/scene.ex:559:7638 err639640 type warning found at:641 │642 559 │ err ->643 │ ~644 │645 └─ lib/scenic/scene.ex:559:11: Scenic.Scene.fetch_child/2646647 warning: the following clause will never match:648649 _ ->650651 it is expected to match on type:652653 none()654655 type warning found at:656 │657 1249 │ _ -> state658 │ ~659 │660 └─ lib/scenic/view_port.ex:1249:9: Scenic.ViewPort.internal_put_graph/3661662 warning: the following clause will never match:663664 err ->665666 it is expected to match on type:667668 none()669670 type warning found at:671 │672 392 │ err -> err673 │ ~674 │675 └─ lib/scenic/view_port.ex:392:7: Scenic.ViewPort.put_graph/4676677Generated scenic app678==> scenic_driver_glfw679mkdir -p /work/proj/_build/mangopi_mq_pro/lib/scenic_driver_glfw/priv/prod680/home/nerves/.nerves/artifacts/nerves_toolchain_riscv64_nerves_linux_gnu-15.3.1/bin/riscv64-nerves-linux-gnu-gcc -O3 -std=c99 `pkg-config --static --cflags glfw3 glew` -fPIC -o /work/proj/_build/mangopi_mq_pro/lib/scenic_driver_glfw/priv/prod/scenic_driver_glfw c_src/main.c c_src/comms.c c_src/nanovg/nanovg.c c_src/utils.c c_src/render_script.c c_src/tx.c --sysroot=/home/nerves/.nerves/artifacts/nerves_system_mangopi_mq_pro-0.17.2/staging `pkg-config --static --libs glfw3 glew` -lGL -lm -lrt681Package glfw3 was not found in the pkg-config search path.682Perhaps you should add the directory containing `glfw3.pc'683to the PKG_CONFIG_PATH environment variable684Package 'glfw3', required by 'virtual:world', not found685Package 'glew', required by 'virtual:world', not found686Package glfw3 was not found in the pkg-config search path.687Perhaps you should add the directory containing `glfw3.pc'688to the PKG_CONFIG_PATH environment variable689Package 'glfw3', required by 'virtual:world', not found690Package 'glew', required by 'virtual:world', not found691c_src/main.c:13:10: fatal error: GL/glew.h: No such file or directory692 13 | #include <GL/glew.h>693 | ^~~~~~~~~~~694compilation terminated.695c_src/comms.c:10:10: fatal error: GLFW/glfw3.h: No such file or directory696 10 | #include <GLFW/glfw3.h>697 | ^~~~~~~~~~~~~~698compilation terminated.699In file included from c_src/nanovg/nanovg.c:28:700c_src/nanovg/stb_image.h: In function 'stbi__parse_png_file':701c_src/nanovg/stb_image.h:4399:25: warning: writing 1 byte into a region of size 0 [-Wstringop-overflow=]702 4399 | tc[k] = (stbi_uc) (stbi__get16be(s) & 255) * stbi__depth_scale_table[depth]; // non 8-bit images will be larger703 | ~~~~~~^~~~~~~~~~~~~~~~~~~~~~~~~~~~~~~~~~~~~~~~~~~~~~~~~~~~~~~~~~~~~~~~~~~~~704c_src/nanovg/stb_image.h:4322:25: note: at offset 3 into destination object 'tc' of size 3705 4322 | stbi_uc has_trans=0, tc[3];706 | ^~707c_src/utils.c:9:10: fatal error: GL/glew.h: No such file or directory708 9 | #include <GL/glew.h>709 | ^~~~~~~~~~~710compilation terminated.711c_src/render_script.c:11:10: fatal error: GLFW/glfw3.h: No such file or directory712 11 | #include <GLFW/glfw3.h>713 | ^~~~~~~~~~~~~~714compilation terminated.715In file included from c_src/tx.c:13:716c_src/comms.h:14:10: fatal error: GLFW/glfw3.h: No such file or directory717 14 | #include <GLFW/glfw3.h>718 | ^~~~~~~~~~~~~~719compilation terminated.720make: *** [Makefile:46: /work/proj/_build/mangopi_mq_pro/lib/scenic_driver_glfw/priv/prod/scenic_driver_glfw] Error 1721could not compile dependency :scenic_driver_glfw, "mix compile" failed. Errors may have been logged above. You can recompile this dependency with "mix deps.compile scenic_driver_glfw --force", update it with "mix deps.update scenic_driver_glfw" or clean it with "mix deps.clean scenic_driver_glfw"722==> nerves_compatibility_test723** (Mix) Could not compile with "make" (exit status: 2).724You need to have gcc and make installed. If you are using725Ubuntu or any other Debian-based system, install the packages726"build-essential". Also install "erlang-dev" package if not727included in your Erlang/OTP version. If you're on Fedora, run728"dnf group install 'Development Tools'".729