scenic_scrollable

Build log

nerves_system_qemu_aarch64

scenic_scrollable 0.1.0 · fail · run scenic_scrollable-0.1.0-1791097394233
730 of 730 lines
1Resolving Hex dependencies...2Resolution completed in 0.161s3Unchanged:4  circular_buffer 1.1.05  elixir_make 0.7.86  ex_image_info 0.2.77  font_metrics 0.5.28  interactive_cmd 0.1.49  nerves 2.0.0-pre.210  nerves_discovery 0.1.511  nerves_logging 0.2.412  nerves_runtime 0.13.1313  nerves_system_bbb 2.30.214  nerves_system_br 1.34.415  nerves_system_mangopi_mq_pro 0.17.216  nerves_system_qemu_aarch64 0.4.217  nerves_system_rpi0 2.1.218  nerves_system_rpi4 2.1.219  nerves_system_rpi5 2.1.220  nerves_system_trellis 0.5.021  nerves_system_x86_64 1.34.222  nerves_toolchain_aarch64_nerves_linux_gnu 15.3.123  nerves_toolchain_armv6_nerves_linux_gnueabihf 15.3.124  nerves_toolchain_armv7_nerves_linux_gnueabihf 15.3.125  nerves_toolchain_riscv64_nerves_linux_gnu 15.3.126  nerves_toolchain_x86_64_nerves_linux_musl 15.3.127  nerves_uevent 0.1.728  nimble_options 1.1.129  option_ex 0.2.030  property_table 0.3.431  result_ex 0.1.032  ring_logger 0.11.733  scenic 0.11.234  scenic_driver_glfw 0.10.135  scenic_scrollable 0.1.036  tablet 0.3.337  toolshed 0.5.038  truetype_metrics 0.6.139  uboot_env 1.0.240* Getting scenic_scrollable (Hex package)41* Getting nerves (Hex package)42* Getting ring_logger (Hex package)43* Getting toolshed (Hex package)44* Getting nerves_runtime (Hex package)45* Getting nerves_system_bbb (Hex package)46* Getting nerves_system_mangopi_mq_pro (Hex package)47* Getting nerves_system_qemu_aarch64 (Hex package)48* Getting nerves_system_rpi0 (Hex package)49* Getting nerves_system_rpi4 (Hex package)50* Getting nerves_system_rpi5 (Hex package)51* Getting nerves_system_trellis (Hex package)52* Getting nerves_system_x86_64 (Hex package)53* Getting nerves_system_br (Hex package)54* Getting nerves_toolchain_x86_64_nerves_linux_musl (Hex package)55* Getting nerves_toolchain_armv7_nerves_linux_gnueabihf (Hex package)56* Getting nerves_toolchain_aarch64_nerves_linux_gnu (Hex package)57* Getting nerves_toolchain_armv6_nerves_linux_gnueabihf (Hex package)58* Getting nerves_toolchain_riscv64_nerves_linux_gnu (Hex package)59* Getting nerves_logging (Hex package)60* Getting nerves_uevent (Hex package)61* Getting uboot_env (Hex package)62* Getting elixir_make (Hex package)63* Getting property_table (Hex package)64* Getting circular_buffer (Hex package)65* Getting interactive_cmd (Hex package)66* Getting nerves_discovery (Hex package)67* Getting tablet (Hex package)68* Getting option_ex (Hex package)69* Getting result_ex (Hex package)70* Getting scenic (Hex package)71* Getting scenic_driver_glfw (Hex package)72* Getting ex_image_info (Hex package)73* Getting font_metrics (Hex package)74* Getting nimble_options (Hex package)75* Getting truetype_metrics (Hex package)76==> nerves_system_br77Generated nerves_system_br app78==> circular_buffer79Compiling 1 file (.ex)80Generated circular_buffer app81==> nimble_options82Compiling 3 files (.ex)83Generated nimble_options app84==> tablet85Compiling 2 files (.ex)86Generated tablet app87warning: "xref: [exclude: ...]" in your mix.exs file is deprecated, instead use: "elixirc_options: [no_warn_undefined: ...]"88  (mix 1.20.3) lib/mix/tasks/compile.elixir.ex:243: Mix.Tasks.Compile.Elixir.xref_exclude_opts/289  (mix 1.20.3) lib/mix/tasks/compile.elixir.ex:142: Mix.Tasks.Compile.Elixir.run/190  (mix 1.20.3) lib/mix/task.ex:502: anonymous fn/3 in Mix.Task.run_task/591  (mix 1.20.3) lib/mix/task.compiler.ex:299: Mix.Task.Compiler.run_compiler/292  (mix 1.20.3) lib/mix/task.compiler.ex:287: Mix.Task.Compiler.run/493  (mix 1.20.3) lib/mix/tasks/compile.all.ex:75: Mix.Tasks.Compile.All.do_run/29495==> elixir_make96Compiling 6 files (.ex)97    warning: unused require Logger98    │99  6 │   require Logger100    │   ~101    │102    └─ lib/elixir_make/precompiler.ex:6:3103104    warning: unused require Logger105    │106  4 │   require Logger107    │   ~108    │109    └─ lib/elixir_make/artefact.ex:4:3110111    warning: unused require Logger112    │113 16 │   require Logger114    │   ~115    │116    └─ lib/mix/tasks/elixir_make.precompile.ex:16:3117118Generated elixir_make app119==> nerves_logging120 CC kmsg_tailer.o121 LD kmsg_tailer122Compiling 5 files (.ex)123Generated nerves_logging app124==> nerves_discovery125Compiling 5 files (.ex)126Generated nerves_discovery app127==> result_ex128Compiling 1 file (.ex)129Generated result_ex app130==> ring_logger131Compiling 7 files (.ex)132Generated ring_logger app133==> interactive_cmd134Compiling 1 file (.ex)135Generated interactive_cmd app136==> nerves137Compiling 65 files (.ex)138    warning: redefining module Mix.Tasks.Nerves.Init (current version loaded from /work/proj/_build/qemu_aarch64/lib/nerves/ebin/Elixir.Mix.Tasks.Nerves.Init.beam)139    │140  6 │ defmodule Mix.Tasks.Nerves.Init do141    │ ~~~~~~~~~~~~~~~~~~~~~~~~~~~~~~~~~~142    │143    └─ lib/mix/tasks/nerves.init.ex:6: Mix.Tasks.Nerves.Init (module)144145    warning: redefining module Nerves (current version loaded from /work/proj/_build/qemu_aarch64/lib/nerves/ebin/Elixir.Nerves.beam)146    │147  6 │ defmodule Nerves do148    │ ~~~~~~~~~~~~~~~~~~~149    │150    └─ lib/nerves.ex:6: Nerves (module)151152    warning: redefining module Nerves.ArtifactResolver (current version loaded from /work/proj/_build/qemu_aarch64/lib/nerves/ebin/Elixir.Nerves.ArtifactResolver.beam)153    │154  5 │ defmodule Nerves.ArtifactResolver do155    │ ~~~~~~~~~~~~~~~~~~~~~~~~~~~~~~~~~~~~156    │157    └─ lib/nerves/artifact_resolver.ex:5: Nerves.ArtifactResolver (module)158159    warning: redefining module Nerves.BuildAction.AppModes (current version loaded from /work/proj/_build/qemu_aarch64/lib/nerves/ebin/Elixir.Nerves.BuildAction.AppModes.beam)160    │161  6 │ defmodule Nerves.BuildAction.AppModes do162    │ ~~~~~~~~~~~~~~~~~~~~~~~~~~~~~~~~~~~~~~~~163    │164    └─ lib/nerves/build_action/app_modes.ex:6: Nerves.BuildAction.AppModes (module)165166    warning: redefining module Nerves.BuildAction.CheckExecutables (current version loaded from /work/proj/_build/qemu_aarch64/lib/nerves/ebin/Elixir.Nerves.BuildAction.CheckExecutables.beam)167    │168  5 │ defmodule Nerves.BuildAction.CheckExecutables do169    │ ~~~~~~~~~~~~~~~~~~~~~~~~~~~~~~~~~~~~~~~~~~~~~~~~170    │171    └─ lib/nerves/build_action/check_executables.ex:5: Nerves.BuildAction.CheckExecutables (module)172173    warning: redefining module Nerves.BuildAction.Erlinit (current version loaded from /work/proj/_build/qemu_aarch64/lib/nerves/ebin/Elixir.Nerves.BuildAction.Erlinit.beam)174    │175  8 │ defmodule Nerves.BuildAction.Erlinit do176    │ ~~~~~~~~~~~~~~~~~~~~~~~~~~~~~~~~~~~~~~~177    │178    └─ lib/nerves/build_action/erlinit.ex:8: Nerves.BuildAction.Erlinit (module)179180    warning: redefining module Nerves.BuildAction.Firmware (current version loaded from /work/proj/_build/qemu_aarch64/lib/nerves/ebin/Elixir.Nerves.BuildAction.Firmware.beam)181    │182  5 │ defmodule Nerves.BuildAction.Firmware do183    │ ~~~~~~~~~~~~~~~~~~~~~~~~~~~~~~~~~~~~~~~~184    │185    └─ lib/nerves/build_action/firmware.ex:5: Nerves.BuildAction.Firmware (module)186187    warning: redefining module Nerves.BuildAction.IExStartupCheck (current version loaded from /work/proj/_build/qemu_aarch64/lib/nerves/ebin/Elixir.Nerves.BuildAction.IExStartupCheck.beam)188    │189  7 │ defmodule Nerves.BuildAction.IExStartupCheck do190    │ ~~~~~~~~~~~~~~~~~~~~~~~~~~~~~~~~~~~~~~~~~~~~~~~191    │192    └─ lib/nerves/build_action/iex_startup_check.ex:7: Nerves.BuildAction.IExStartupCheck (module)193194    warning: redefining module Nerves.BuildAction.NervesV1System (current version loaded from /work/proj/_build/qemu_aarch64/lib/nerves/ebin/Elixir.Nerves.BuildAction.NervesV1System.beam)195    │196  5 │ defmodule Nerves.BuildAction.NervesV1System do197    │ ~~~~~~~~~~~~~~~~~~~~~~~~~~~~~~~~~~~~~~~~~~~~~~198    │199    └─ lib/nerves/build_action/nerves_v1_system.ex:5: Nerves.BuildAction.NervesV1System (module)200201    warning: redefining module Nerves.BuildAction.NervesV1Toolchain (current version loaded from /work/proj/_build/qemu_aarch64/lib/nerves/ebin/Elixir.Nerves.BuildAction.NervesV1Toolchain.beam)202    │203  5 │ defmodule Nerves.BuildAction.NervesV1Toolchain do204    │ ~~~~~~~~~~~~~~~~~~~~~~~~~~~~~~~~~~~~~~~~~~~~~~~~~205    │206    └─ lib/nerves/build_action/nerves_v1_toolchain.ex:5: Nerves.BuildAction.NervesV1Toolchain (module)207208    warning: redefining module Nerves.BuildAction.Rootfs (current version loaded from /work/proj/_build/qemu_aarch64/lib/nerves/ebin/Elixir.Nerves.BuildAction.Rootfs.beam)209    │210  5 │ defmodule Nerves.BuildAction.Rootfs do211    │ ~~~~~~~~~~~~~~~~~~~~~~~~~~~~~~~~~~~~~~212    │213    └─ lib/nerves/build_action/rootfs.ex:5: Nerves.BuildAction.Rootfs (module)214215    warning: redefining module Nerves.BuildAction.SortApps (current version loaded from /work/proj/_build/qemu_aarch64/lib/nerves/ebin/Elixir.Nerves.BuildAction.SortApps.beam)216    │217  6 │ defmodule Nerves.BuildAction.SortApps do218    │ ~~~~~~~~~~~~~~~~~~~~~~~~~~~~~~~~~~~~~~~~219    │220    └─ lib/nerves/build_action/sort_apps.ex:6: Nerves.BuildAction.SortApps (module)221222    warning: redefining module Nerves.BuildAction.StripAll (current version loaded from /work/proj/_build/qemu_aarch64/lib/nerves/ebin/Elixir.Nerves.BuildAction.StripAll.beam)223    │224  5 │ defmodule Nerves.BuildAction.StripAll do225    │ ~~~~~~~~~~~~~~~~~~~~~~~~~~~~~~~~~~~~~~~~226    │227    └─ lib/nerves/build_action/strip_all.ex:5: Nerves.BuildAction.StripAll (module)228229    warning: redefining module Nerves.BuildAction.Trimmer (current version loaded from /work/proj/_build/qemu_aarch64/lib/nerves/ebin/Elixir.Nerves.BuildAction.Trimmer.beam)230    │231  5 │ defmodule Nerves.BuildAction.Trimmer do232    │ ~~~~~~~~~~~~~~~~~~~~~~~~~~~~~~~~~~~~~~~233    │234    └─ lib/nerves/build_action/trimmer.ex:5: Nerves.BuildAction.Trimmer (module)235236    warning: redefining module Nerves.BuildPlan (current version loaded from /work/proj/_build/qemu_aarch64/lib/nerves/ebin/Elixir.Nerves.BuildPlan.beam)237    │238  5 │ defmodule Nerves.BuildPlan do239    │ ~~~~~~~~~~~~~~~~~~~~~~~~~~~~~240    │241    └─ lib/nerves/build_plan.ex:5: Nerves.BuildPlan (module)242243    warning: redefining module Nerves.BuildPlan.Checks (current version loaded from /work/proj/_build/qemu_aarch64/lib/nerves/ebin/Elixir.Nerves.BuildPlan.Checks.beam)244    │245  5 │ defmodule Nerves.BuildPlan.Checks do246    │ ~~~~~~~~~~~~~~~~~~~~~~~~~~~~~~~~~~~~247    │248    └─ lib/nerves/build_plan/checks.ex:5: Nerves.BuildPlan.Checks (module)249250    warning: redefining module Nerves.Container (current version loaded from /work/proj/_build/qemu_aarch64/lib/nerves/ebin/Elixir.Nerves.Container.beam)251    │252  6 │ defmodule Nerves.Container do253    │ ~~~~~~~~~~~~~~~~~~~~~~~~~~~~~254    │255    └─ lib/nerves/container.ex:6: Nerves.Container (module)256257    warning: redefining module Nerves.Fingerprint (current version loaded from /work/proj/_build/qemu_aarch64/lib/nerves/ebin/Elixir.Nerves.Fingerprint.beam)258    │259  5 │ defmodule Nerves.Fingerprint do260    │ ~~~~~~~~~~~~~~~~~~~~~~~~~~~~~~~261    │262    └─ lib/nerves/fingerprint.ex:5: Nerves.Fingerprint (module)263264    warning: redefining module Nerves.MixPackage (current version loaded from /work/proj/_build/qemu_aarch64/lib/nerves/ebin/Elixir.Nerves.MixPackage.beam)265    │266  5 │ defmodule Nerves.MixPackage do267    │ ~~~~~~~~~~~~~~~~~~~~~~~~~~~~~~268    │269    └─ lib/nerves/mix_package.ex:5: Nerves.MixPackage (module)270271    warning: redefining module Nerves.Paths (current version loaded from /work/proj/_build/qemu_aarch64/lib/nerves/ebin/Elixir.Nerves.Paths.beam)272    │273  5 │ defmodule Nerves.Paths do274    │ ~~~~~~~~~~~~~~~~~~~~~~~~~275    │276    └─ lib/nerves/paths.ex:5: Nerves.Paths (module)277278    warning: redefining module Nerves.TargetTuple (current version loaded from /work/proj/_build/qemu_aarch64/lib/nerves/ebin/Elixir.Nerves.TargetTuple.beam)279    │280  5 │ defmodule Nerves.TargetTuple do281    │ ~~~~~~~~~~~~~~~~~~~~~~~~~~~~~~~282    │283    └─ lib/nerves/target_tuple.ex:5: Nerves.TargetTuple (module)284285Generated nerves app286==> nerves_toolchain_aarch64_nerves_linux_gnu287Compiling 1 file (.ex)288Generated nerves_toolchain_aarch64_nerves_linux_gnu app289==> nerves_system_qemu_aarch64290Compiling 1 file (.ex)291Generated nerves_system_qemu_aarch64 app292==> option_ex293Compiling 1 file (.ex)294Generated option_ex app295==> font_metrics296Compiling 2 files (.ex)297Generated font_metrics app298==> truetype_metrics299Compiling 1 file (.ex)300     warning: the variable "offset" is accessed inside size(...) of a bitstring but it was defined outside of the match. You must precede it with the pin operator301     │302 334 │         <<_::binary-size(offset), cmap::binary>> = cmap_data303     │                          ~304     │305     └─ lib/truetype_metrics.ex:334:26: TruetypeMetrics.do_parse_cmap_glyphs_ids/1306307     warning: the variable "skip" is accessed inside size(...) of a bitstring but it was defined outside of the match. You must precede it with the pin operator308     │309 446 │     <<_::binary-size(skip), id::unsigned-size(16)-big, _::binary>> = sub_table310     │                      ~311     │312     └─ lib/truetype_metrics.ex:446:22: TruetypeMetrics.lookup_cmap_type_4/2313314     warning: the variable "offset" is accessed inside size(...) of a bitstring but it was defined outside of the match. You must precede it with the pin operator315     │316 678 │           _::binary-size(offset),317     │                          ~318     │319     └─ lib/truetype_metrics.ex:678:26: TruetypeMetrics.get_table_data/3320321     warning: the variable "table_size" is accessed inside size(...) of a bitstring but it was defined outside of the match. You must precede it with the pin operator322     │323 679 │           table_data::binary-size(table_size),324     │                                   ~325     │326     └─ lib/truetype_metrics.ex:679:35: TruetypeMetrics.get_table_data/3327328     warning: the variable "offset" is accessed inside size(...) of a bitstring but it was defined outside of the match. You must precede it with the pin operator329     │330 700 │       _::binary-size(offset),331     │                      ~332     │333     └─ lib/truetype_metrics.ex:700:22: TruetypeMetrics.do_get_table_data/2334335     warning: the variable "table_size" is accessed inside size(...) of a bitstring but it was defined outside of the match. You must precede it with the pin operator336     │337 701 │       table_data::binary-size(table_size),338     │                               ~339     │340     └─ lib/truetype_metrics.ex:701:31: TruetypeMetrics.do_get_table_data/2341342Generated truetype_metrics app343==> uboot_env344Compiling 5 files (.ex)345Generated uboot_env app346==> ex_image_info347Compiling 12 files (.ex)348    warning: the variable "block_len" is accessed inside size(...) of a bitstring but it was defined outside of the match. You must precede it with the pin operator349    │350 41 │       <<_::bytes-size(block_len), 0xFF, sof::size(8), next::binary>> ->351    │                       ~352    │353    └─ lib/ex_image_info/types/jpeg.ex:41:23: ExImageInfo.Types.JPEG.parse_jpeg_block/2354355    warning: the variable "idf_off_pos" is accessed inside size(...) of a bitstring but it was defined outside of the match. You must precede it with the pin operator356    │357 56 │       <<_skip1::bytes-size(idf_off_pos), _skip2::bytes-size(2),358    │                            ~359    │360    └─ lib/ex_image_info/types/tiff.ex:56:28: ExImageInfo.Types.TIFF.parse_tiff_block/4361362    warning: the variable "buff_size" is accessed inside size(...) of a bitstring but it was defined outside of the match. You must precede it with the pin operator363    │364 57 │         buff_idf::bytes-size(buff_size), _::binary>> ->365    │                              ~366    │367    └─ lib/ex_image_info/types/tiff.ex:57:30: ExImageInfo.Types.TIFF.parse_tiff_block/4368369    warning: unused require Bitwise370    │371  7 │   require Bitwise372    │   ~373    │374    └─ lib/ex_image_info/types/tiff.ex:7:3375376    warning: unused require Bitwise377    │378  6 │   require Bitwise379    │   ~380    │381    └─ lib/ex_image_info/types/webp.ex:6:3382383    warning: this clause of defp parse_jpeg_block/2 is never used (or it will always fail/warn when invoked)384    │385 49 │   defp parse_jpeg_block(_, _), do: nil386    │        ~387    │388    └─ lib/ex_image_info/types/jpeg.ex:49:8: ExImageInfo.Types.JPEG.parse_jpeg_block/2389390Generated ex_image_info app391==> scenic392mkdir -p /work/proj/_build/qemu_aarch64/lib/scenic/ebin/../priv393mkdir -p /work/proj/_build/qemu_aarch64/lib/scenic/ebin/../obj394/home/nerves/.nerves/artifacts/nerves_toolchain_aarch64_nerves_linux_gnu-15.3.1/bin/aarch64-nerves-linux-gnu-gcc -c -I/home/nerves/.nerves/artifacts/nerves_system_qemu_aarch64-0.4.2/staging/usr/lib/erlang/erts-17.0.6/include -I/home/nerves/.nerves/artifacts/nerves_system_qemu_aarch64-0.4.2/staging/usr/lib/erlang/lib/erl_interface-5.8.2/include -mabi=lp64 -fstack-protector-strong -mcpu=cortex-a53 -fPIE -pie -D_LARGEFILE_SOURCE -D_LARGEFILE64_SOURCE -D_FILE_OFFSET_BITS=64  -pipe -O2 --sysroot /home/nerves/.nerves/artifacts/nerves_system_qemu_aarch64-0.4.2/staging -fPIC -o /work/proj/_build/qemu_aarch64/lib/scenic/ebin/../obj/line.o c_src/line.c395/home/nerves/.nerves/artifacts/nerves_toolchain_aarch64_nerves_linux_gnu-15.3.1/bin/aarch64-nerves-linux-gnu-gcc -c -I/home/nerves/.nerves/artifacts/nerves_system_qemu_aarch64-0.4.2/staging/usr/lib/erlang/erts-17.0.6/include -I/home/nerves/.nerves/artifacts/nerves_system_qemu_aarch64-0.4.2/staging/usr/lib/erlang/lib/erl_interface-5.8.2/include -mabi=lp64 -fstack-protector-strong -mcpu=cortex-a53 -fPIE -pie -D_LARGEFILE_SOURCE -D_LARGEFILE64_SOURCE -D_FILE_OFFSET_BITS=64  -pipe -O2 --sysroot /home/nerves/.nerves/artifacts/nerves_system_qemu_aarch64-0.4.2/staging -fPIC -o /work/proj/_build/qemu_aarch64/lib/scenic/ebin/../obj/matrix.o c_src/matrix.c396/home/nerves/.nerves/artifacts/nerves_toolchain_aarch64_nerves_linux_gnu-15.3.1/bin/aarch64-nerves-linux-gnu-gcc -c -I/home/nerves/.nerves/artifacts/nerves_system_qemu_aarch64-0.4.2/staging/usr/lib/erlang/erts-17.0.6/include -I/home/nerves/.nerves/artifacts/nerves_system_qemu_aarch64-0.4.2/staging/usr/lib/erlang/lib/erl_interface-5.8.2/include -mabi=lp64 -fstack-protector-strong -mcpu=cortex-a53 -fPIE -pie -D_LARGEFILE_SOURCE -D_LARGEFILE64_SOURCE -D_FILE_OFFSET_BITS=64  -pipe -O2 --sysroot /home/nerves/.nerves/artifacts/nerves_system_qemu_aarch64-0.4.2/staging -fPIC -o /work/proj/_build/qemu_aarch64/lib/scenic/ebin/../obj/bitmap.o c_src/bitmap.c397/home/nerves/.nerves/artifacts/nerves_toolchain_aarch64_nerves_linux_gnu-15.3.1/bin/aarch64-nerves-linux-gnu-gcc /work/proj/_build/qemu_aarch64/lib/scenic/ebin/../obj/line.o -L/home/nerves/.nerves/artifacts/nerves_system_qemu_aarch64-0.4.2/staging/usr/lib/erlang/lib/erl_interface-5.8.2/lib -lei --sysroot=/home/nerves/.nerves/artifacts/nerves_system_qemu_aarch64-0.4.2/staging -shared  -dynamiclib -o /work/proj/_build/qemu_aarch64/lib/scenic/ebin/../priv/line.so398/home/nerves/.nerves/artifacts/nerves_toolchain_aarch64_nerves_linux_gnu-15.3.1/bin/aarch64-nerves-linux-gnu-gcc /work/proj/_build/qemu_aarch64/lib/scenic/ebin/../obj/bitmap.o -L/home/nerves/.nerves/artifacts/nerves_system_qemu_aarch64-0.4.2/staging/usr/lib/erlang/lib/erl_interface-5.8.2/lib -lei --sysroot=/home/nerves/.nerves/artifacts/nerves_system_qemu_aarch64-0.4.2/staging -shared  -dynamiclib -o /work/proj/_build/qemu_aarch64/lib/scenic/ebin/../priv/bitmap.so399/home/nerves/.nerves/artifacts/nerves_toolchain_aarch64_nerves_linux_gnu-15.3.1/bin/aarch64-nerves-linux-gnu-gcc /work/proj/_build/qemu_aarch64/lib/scenic/ebin/../obj/matrix.o -L/home/nerves/.nerves/artifacts/nerves_system_qemu_aarch64-0.4.2/staging/usr/lib/erlang/lib/erl_interface-5.8.2/lib -lei --sysroot=/home/nerves/.nerves/artifacts/nerves_system_qemu_aarch64-0.4.2/staging -shared  -dynamiclib -o /work/proj/_build/qemu_aarch64/lib/scenic/ebin/../priv/matrix.so400Compiling 84 files (.ex)401    warning: using single-quoted strings to represent charlists is deprecated.402    Use ~c"" if you indeed want a charlist or use "" instead.403    You may run "mix format --migrate" to change all single-quoted404    strings to use the ~c sigil and fix this warning.405    │406 81 │       |> :filename.join('bitmap')407    │                         ~408    │409    └─ lib/scenic/assets/stream/bitmap.ex:81:25410411     warning: the variable "skip" is accessed inside size(...) of a bitstring but it was defined outside of the match. You must precede it with the pin operator412     │413 190 │     <<_::binary-size(skip), g::8, _::binary>> = p414     │                      ~415     │416     └─ lib/scenic/assets/stream/bitmap.ex:190:22: Scenic.Assets.Stream.Bitmap.do_get/4417418     warning: the variable "skip" is accessed inside size(...) of a bitstring but it was defined outside of the match. You must precede it with the pin operator419     │420 198 │     <<_::binary-size(skip), g::8, a::8, _::binary>> = p421     │                      ~422     │423     └─ lib/scenic/assets/stream/bitmap.ex:198:22: Scenic.Assets.Stream.Bitmap.do_get/4424425     warning: the variable "skip" is accessed inside size(...) of a bitstring but it was defined outside of the match. You must precede it with the pin operator426     │427 206 │     <<_::binary-size(skip), r::8, g::8, b::8, _::binary>> = p428     │                      ~429     │430     └─ lib/scenic/assets/stream/bitmap.ex:206:22: Scenic.Assets.Stream.Bitmap.do_get/4431432     warning: the variable "skip" is accessed inside size(...) of a bitstring but it was defined outside of the match. You must precede it with the pin operator433     │434 214 │     <<_::binary-size(skip), r::8, g::8, b::8, a::8, _::binary>> = p435     │                      ~436     │437     └─ lib/scenic/assets/stream/bitmap.ex:214:22: Scenic.Assets.Stream.Bitmap.do_get/4438439     warning: using single-quoted strings to represent charlists is deprecated.440     Use ~c"" if you indeed want a charlist or use "" instead.441     You may run "mix format --migrate" to change all single-quoted442     strings to use the ~c sigil and fix this warning.443     │444 105 │     space_width = FontMetrics.width(' ', @default_font_size, fm)445     │                                     ~446     │447     └─ lib/scenic/component/input/checkbox.ex:105:37448449     warning: using single-quoted strings to represent charlists is deprecated.450     Use ~c"" if you indeed want a charlist or use "" instead.451     You may run "mix format --migrate" to change all single-quoted452     strings to use the ~c sigil and fix this warning.453     │454 177 │     space_width = FontMetrics.width(' ', @default_font_size, fm)455     │                                     ~456     │457     └─ lib/scenic/component/input/checkbox.ex:177:37458459    warning: using single-quoted strings to represent charlists is deprecated.460    Use ~c"" if you indeed want a charlist or use "" instead.461    You may run "mix format --migrate" to change all single-quoted462    strings to use the ~c sigil and fix this warning.463    │464 80 │     space_width = FontMetrics.width(' ', @default_font_size, fm)465    │                                     ~466    │467    └─ lib/scenic/component/input/radio_button.ex:80:37468469     warning: using single-quoted strings to represent charlists is deprecated.470     Use ~c"" if you indeed want a charlist or use "" instead.471     You may run "mix format --migrate" to change all single-quoted472     strings to use the ~c sigil and fix this warning.473     │474 143 │     space_width = FontMetrics.width(' ', @default_font_size, fm)475     │                                     ~476     │477     └─ lib/scenic/component/input/radio_button.ex:143:37478479     warning: using single-quoted strings to represent charlists is deprecated.480     Use ~c"" if you indeed want a charlist or use "" instead.481     You may run "mix format --migrate" to change all single-quoted482     strings to use the ~c sigil and fix this warning.483     │484 227 │     space_width = FontMetrics.width(' ', @default_font_size, fm)485     │                                     ~486     │487     └─ lib/scenic/component/input/radio_group.ex:227:37488489     warning: using single-quoted strings to represent charlists is deprecated.490     Use ~c"" if you indeed want a charlist or use "" instead.491     You may run "mix format --migrate" to change all single-quoted492     strings to use the ~c sigil and fix this warning.493     │494 113 │   @password_char '*'495     │                  ~496     │497     └─ lib/scenic/component/input/text_field.ex:113:18498499warning: pattern matching on 0.0 is equivalent to matching only on +0.0. Instead you must match on +0.0 or -0.0500└─ lib/scenic/graph/bounds.ex: Scenic.Graph.Bounds.pts_arc_to/6501502warning: pattern matching on 0.0 is equivalent to matching only on +0.0. Instead you must match on +0.0 or -0.0503└─ lib/scenic/graph/bounds.ex: Scenic.Graph.Bounds.pts_arc_to/6504505    warning: using single-quoted strings to represent charlists is deprecated.506    Use ~c"" if you indeed want a charlist or use "" instead.507    You may run "mix format --migrate" to change all single-quoted508    strings to use the ~c sigil and fix this warning.509    │510 31 │       |> :filename.join('line')511    │                         ~512    │513    └─ lib/scenic/math/line.ex:31:25514515    warning: using single-quoted strings to represent charlists is deprecated.516    Use ~c"" if you indeed want a charlist or use "" instead.517    You may run "mix format --migrate" to change all single-quoted518    strings to use the ~c sigil and fix this warning.519    │520 37 │       |> :filename.join('matrix')521    │                         ~522    │523    └─ lib/scenic/math/matrix.ex:37:25524525     warning: the variable "skip_size" is accessed inside size(...) of a bitstring but it was defined outside of the match. You must precede it with the pin operator526     │527 490 │       _::binary-size(skip_size),528     │                      ~529     │530     └─ lib/scenic/math/matrix.ex:490:22: Scenic.Math.Matrix.get/3531532     warning: the variable "skip_size" is accessed inside size(...) of a bitstring but it was defined outside of the match. You must precede it with the pin operator533     │534 521 │       pre::binary-size(skip_size),535     │                        ~536     │537     └─ lib/scenic/math/matrix.ex:521:24: Scenic.Math.Matrix.put/4538539warning: pattern matching on 0.0 is equivalent to matching only on +0.0. Instead you must match on +0.0 or -0.0540└─ lib/scenic/math/matrix.ex: Scenic.Math.Matrix.invert/1541542warning: pattern matching on 0.0 is equivalent to matching only on +0.0. Instead you must match on +0.0 or -0.0543└─ lib/scenic/math/vector_2.ex: Scenic.Math.Vector2.normalize/1544545      warning: the variable "bytes" is accessed inside size(...) of a bitstring but it was defined outside of the match. You must precede it with the pin operator546      │547 2730 │       str::binary-size(bytes),548      │                        ~549      │550      └─ lib/scenic/script.ex:2730:24: Scenic.Script.extract_string/2551552      warning: the variable "buff_size" is accessed inside size(...) of a bitstring but it was defined outside of the match. You must precede it with the pin operator553      │554 2731 │       _buff::binary-size(buff_size),555      │                          ~556      │557      └─ lib/scenic/script.ex:2731:26: Scenic.Script.extract_string/2558559     warning: this clause of defp do_special_theme_outline/3 is never used (or it will always fail/warn when invoked)560     │561 281 │   defp do_special_theme_outline(graph, :dark, border) do562     │        ~563     │564     └─ lib/scenic/component/button.ex:281:8: Scenic.Component.Button.do_special_theme_outline/3565566     warning: this clause of defp do_special_theme_outline/3 is never used (or it will always fail/warn when invoked)567     │568 285 │   defp do_special_theme_outline(graph, :light, border) do569     │        ~570     │571     └─ lib/scenic/component/button.ex:285:8: Scenic.Component.Button.do_special_theme_outline/3572573     warning: the following clause cannot match because the previous clauses already matched all possible values:574575         err ->576577     it attempts to match on the result of:578579         child(scene, id)580581     which has the already matched type:582583         dynamic({:ok, term()})584585     where "err" was given the type:586587         # type: dynamic({:ok, term()})588         # from: lib/scenic/scene.ex:495:7589         err590591     type warning found at:592     │593 495 │       err -> err594     │           ~595     │596     └─ lib/scenic/scene.ex:495:11: Scenic.Scene.get_child/2597598     warning: the following clause cannot match because the previous clauses already matched all possible values:599600         err ->601602     it attempts to match on the result of:603604         child(scene, id)605606     which has the already matched type:607608         dynamic({:ok, term()})609610     where "err" was given the type:611612         # type: dynamic({:ok, term()})613         # from: lib/scenic/scene.ex:523:7614         err615616     type warning found at:617     │618 523 │       err ->619     │           ~620     │621     └─ lib/scenic/scene.ex:523:11: Scenic.Scene.put_child/3622623     warning: the following clause cannot match because the previous clauses already matched all possible values:624625         err ->626627     it attempts to match on the result of:628629         child(scene, id)630631     which has the already matched type:632633         dynamic({:ok, term()})634635     where "err" was given the type:636637         # type: dynamic({:ok, term()})638         # from: lib/scenic/scene.ex:559:7639         err640641     type warning found at:642     │643 559 │       err ->644     │           ~645     │646     └─ lib/scenic/scene.ex:559:11: Scenic.Scene.fetch_child/2647648      warning: the following clause will never match:649650          _ ->651652      it is expected to match on type:653654          none()655656      type warning found at:657      │658 1249 │         _ -> state659      │         ~660      │661      └─ lib/scenic/view_port.ex:1249:9: Scenic.ViewPort.internal_put_graph/3662663     warning: the following clause will never match:664665         err ->666667     it is expected to match on type:668669         none()670671     type warning found at:672     │673 392 │       err -> err674     │       ~675     │676     └─ lib/scenic/view_port.ex:392:7: Scenic.ViewPort.put_graph/4677678Generated scenic app679==> scenic_driver_glfw680mkdir -p /work/proj/_build/qemu_aarch64/lib/scenic_driver_glfw/priv/prod681/home/nerves/.nerves/artifacts/nerves_toolchain_aarch64_nerves_linux_gnu-15.3.1/bin/aarch64-nerves-linux-gnu-gcc -O3 -std=c99 `pkg-config --static --cflags glfw3 glew` -fPIC -o /work/proj/_build/qemu_aarch64/lib/scenic_driver_glfw/priv/prod/scenic_driver_glfw c_src/main.c c_src/comms.c c_src/nanovg/nanovg.c c_src/utils.c c_src/render_script.c c_src/tx.c --sysroot=/home/nerves/.nerves/artifacts/nerves_system_qemu_aarch64-0.4.2/staging `pkg-config --static --libs glfw3 glew` -lGL -lm -lrt682Package glfw3 was not found in the pkg-config search path.683Perhaps you should add the directory containing `glfw3.pc'684to the PKG_CONFIG_PATH environment variable685Package 'glfw3', required by 'virtual:world', not found686Package 'glew', required by 'virtual:world', not found687Package glfw3 was not found in the pkg-config search path.688Perhaps you should add the directory containing `glfw3.pc'689to the PKG_CONFIG_PATH environment variable690Package 'glfw3', required by 'virtual:world', not found691Package 'glew', required by 'virtual:world', not found692c_src/main.c:13:10: fatal error: GL/glew.h: No such file or directory693   13 | #include <GL/glew.h>694      |          ^~~~~~~~~~~695compilation terminated.696c_src/comms.c:10:10: fatal error: GLFW/glfw3.h: No such file or directory697   10 | #include <GLFW/glfw3.h>698      |          ^~~~~~~~~~~~~~699compilation terminated.700In file included from c_src/nanovg/nanovg.c:28:701c_src/nanovg/stb_image.h: In function 'stbi__parse_png_file':702c_src/nanovg/stb_image.h:4399:25: warning: writing 1 byte into a region of size 0 [-Wstringop-overflow=]703 4399 |                   tc[k] = (stbi_uc) (stbi__get16be(s) & 255) * stbi__depth_scale_table[depth]; // non 8-bit images will be larger704      |                   ~~~~~~^~~~~~~~~~~~~~~~~~~~~~~~~~~~~~~~~~~~~~~~~~~~~~~~~~~~~~~~~~~~~~~~~~~~~705c_src/nanovg/stb_image.h:4322:25: note: at offset 3 into destination object 'tc' of size 3706 4322 |    stbi_uc has_trans=0, tc[3];707      |                         ^~708c_src/utils.c:9:10: fatal error: GL/glew.h: No such file or directory709    9 | #include <GL/glew.h>710      |          ^~~~~~~~~~~711compilation terminated.712c_src/render_script.c:11:10: fatal error: GLFW/glfw3.h: No such file or directory713   11 | #include <GLFW/glfw3.h>714      |          ^~~~~~~~~~~~~~715compilation terminated.716In file included from c_src/tx.c:13:717c_src/comms.h:14:10: fatal error: GLFW/glfw3.h: No such file or directory718   14 | #include <GLFW/glfw3.h>719      |          ^~~~~~~~~~~~~~720compilation terminated.721make: *** [Makefile:46: /work/proj/_build/qemu_aarch64/lib/scenic_driver_glfw/priv/prod/scenic_driver_glfw] Error 1722could not compile dependency :scenic_driver_glfw, "mix compile" failed. Errors may have been logged above. You can recompile this dependency with "mix deps.compile scenic_driver_glfw --force", update it with "mix deps.update scenic_driver_glfw" or clean it with "mix deps.clean scenic_driver_glfw"723==> nerves_compatibility_test724** (Mix) Could not compile with "make" (exit status: 2).725You need to have gcc and make installed. If you are using726Ubuntu or any other Debian-based system, install the packages727"build-essential". Also install "erlang-dev" package if not728included in your Erlang/OTP version. If you're on Fedora, run729"dnf group install 'Development Tools'".730