Build log
nerves_system_x86_64
scenic_scrollable 0.1.0 · fail · run scenic_scrollable-0.1.0-1791097394233
133 of 133 lines
1Resolving Hex dependencies...2Resolution completed in 0.136s3Unchanged:4 circular_buffer 1.1.05 elixir_make 0.7.86 ex_image_info 0.2.77 font_metrics 0.5.28 interactive_cmd 0.1.49 nerves 2.0.0-pre.210 nerves_discovery 0.1.511 nerves_logging 0.2.412 nerves_runtime 0.13.1313 nerves_system_bbb 2.30.214 nerves_system_br 1.34.415 nerves_system_mangopi_mq_pro 0.17.216 nerves_system_qemu_aarch64 0.4.217 nerves_system_rpi0 2.1.218 nerves_system_rpi4 2.1.219 nerves_system_rpi5 2.1.220 nerves_system_trellis 0.5.021 nerves_system_x86_64 1.34.222 nerves_toolchain_aarch64_nerves_linux_gnu 15.3.123 nerves_toolchain_armv6_nerves_linux_gnueabihf 15.3.124 nerves_toolchain_armv7_nerves_linux_gnueabihf 15.3.125 nerves_toolchain_riscv64_nerves_linux_gnu 15.3.126 nerves_toolchain_x86_64_nerves_linux_musl 15.3.127 nerves_uevent 0.1.728 nimble_options 1.1.129 option_ex 0.2.030 property_table 0.3.431 result_ex 0.1.032 ring_logger 0.11.733 scenic 0.11.234 scenic_driver_glfw 0.10.135 scenic_scrollable 0.1.036 tablet 0.3.337 toolshed 0.5.038 truetype_metrics 0.6.139 uboot_env 1.0.240* Getting scenic_scrollable (Hex package)41* Getting nerves (Hex package)42* Getting ring_logger (Hex package)43* Getting toolshed (Hex package)44* Getting nerves_runtime (Hex package)45* Getting nerves_system_bbb (Hex package)46* Getting nerves_system_mangopi_mq_pro (Hex package)47* Getting nerves_system_qemu_aarch64 (Hex package)48* Getting nerves_system_rpi0 (Hex package)49* Getting nerves_system_rpi4 (Hex package)50* Getting nerves_system_rpi5 (Hex package)51* Getting nerves_system_trellis (Hex package)52* Getting nerves_system_x86_64 (Hex package)53* Getting nerves_system_br (Hex package)54* Getting nerves_toolchain_x86_64_nerves_linux_musl (Hex package)55* Getting nerves_toolchain_armv7_nerves_linux_gnueabihf (Hex package)56* Getting nerves_toolchain_aarch64_nerves_linux_gnu (Hex package)57* Getting nerves_toolchain_armv6_nerves_linux_gnueabihf (Hex package)58* Getting nerves_toolchain_riscv64_nerves_linux_gnu (Hex package)59* Getting nerves_logging (Hex package)60* Getting nerves_uevent (Hex package)61* Getting uboot_env (Hex package)62* Getting elixir_make (Hex package)63* Getting property_table (Hex package)64* Getting circular_buffer (Hex package)65* Getting interactive_cmd (Hex package)66* Getting nerves_discovery (Hex package)67* Getting tablet (Hex package)68* Getting option_ex (Hex package)69* Getting result_ex (Hex package)70* Getting scenic (Hex package)71* Getting scenic_driver_glfw (Hex package)72* Getting ex_image_info (Hex package)73* Getting font_metrics (Hex package)74* Getting nimble_options (Hex package)75* Getting truetype_metrics (Hex package)76==> result_ex77Compiling 1 file (.ex)78Generated result_ex app79==> option_ex80Compiling 1 file (.ex)81Generated option_ex app82==> scenic_driver_glfw83mkdir -p /work/proj/_build/x86_64/lib/scenic_driver_glfw/priv/prod84/home/nerves/.nerves/artifacts/nerves_toolchain_x86_64_nerves_linux_musl-15.3.1/bin/x86_64-nerves-linux-musl-gcc -O3 -std=c99 `pkg-config --static --cflags glfw3 glew` -fPIC -o /work/proj/_build/x86_64/lib/scenic_driver_glfw/priv/prod/scenic_driver_glfw c_src/main.c c_src/comms.c c_src/nanovg/nanovg.c c_src/utils.c c_src/render_script.c c_src/tx.c --sysroot=/home/nerves/.nerves/artifacts/nerves_system_x86_64-1.34.2/staging `pkg-config --static --libs glfw3 glew` -lGL -lm -lrt85Package glfw3 was not found in the pkg-config search path.86Perhaps you should add the directory containing `glfw3.pc'87to the PKG_CONFIG_PATH environment variable88Package 'glfw3', required by 'virtual:world', not found89Package 'glew', required by 'virtual:world', not found90Package glfw3 was not found in the pkg-config search path.91Perhaps you should add the directory containing `glfw3.pc'92to the PKG_CONFIG_PATH environment variable93Package 'glfw3', required by 'virtual:world', not found94Package 'glew', required by 'virtual:world', not found95c_src/main.c:13:10: fatal error: GL/glew.h: No such file or directory96 13 | #include <GL/glew.h>97 | ^~~~~~~~~~~98compilation terminated.99c_src/comms.c:10:10: fatal error: GLFW/glfw3.h: No such file or directory100 10 | #include <GLFW/glfw3.h>101 | ^~~~~~~~~~~~~~102compilation terminated.103In file included from c_src/nanovg/nanovg.c:28:104c_src/nanovg/stb_image.h: In function 'stbi__parse_png_file':105c_src/nanovg/stb_image.h:4399:25: warning: writing 1 byte into a region of size 0 [-Wstringop-overflow=]106 4399 | tc[k] = (stbi_uc) (stbi__get16be(s) & 255) * stbi__depth_scale_table[depth]; // non 8-bit images will be larger107 | ~~~~~~^~~~~~~~~~~~~~~~~~~~~~~~~~~~~~~~~~~~~~~~~~~~~~~~~~~~~~~~~~~~~~~~~~~~~108c_src/nanovg/stb_image.h:4322:25: note: at offset 3 into destination object 'tc' of size 3109 4322 | stbi_uc has_trans=0, tc[3];110 | ^~111c_src/utils.c:9:10: fatal error: GL/glew.h: No such file or directory112 9 | #include <GL/glew.h>113 | ^~~~~~~~~~~114compilation terminated.115c_src/render_script.c:11:10: fatal error: GLFW/glfw3.h: No such file or directory116 11 | #include <GLFW/glfw3.h>117 | ^~~~~~~~~~~~~~118compilation terminated.119In file included from c_src/tx.c:13:120c_src/comms.h:14:10: fatal error: GLFW/glfw3.h: No such file or directory121 14 | #include <GLFW/glfw3.h>122 | ^~~~~~~~~~~~~~123compilation terminated.124make: *** [Makefile:46: /work/proj/_build/x86_64/lib/scenic_driver_glfw/priv/prod/scenic_driver_glfw] Error 1125could not compile dependency :scenic_driver_glfw, "mix compile" failed. Errors may have been logged above. You can recompile this dependency with "mix deps.compile scenic_driver_glfw --force", update it with "mix deps.update scenic_driver_glfw" or clean it with "mix deps.clean scenic_driver_glfw"126==> nerves_compatibility_test127** (Mix) Could not compile with "make" (exit status: 2).128You need to have gcc and make installed. If you are using129Ubuntu or any other Debian-based system, install the packages130"build-essential". Also install "erlang-dev" package if not131included in your Erlang/OTP version. If you're on Fedora, run132"dnf group install 'Development Tools'".133