talib_ex_nif

Build log

nerves_system_bbb

talib_ex_nif 0.1.0 · fail · run talib_ex_nif-0.1.0-1791124214336
1689 of 1689 lines
1Resolving Hex dependencies...2Resolution completed in 0.131s3Unchanged:4  circular_buffer 1.1.05  elixir_make 0.10.06  interactive_cmd 0.1.47  nerves 2.0.0-pre.28  nerves_discovery 0.1.59  nerves_logging 0.2.410  nerves_runtime 0.13.1311  nerves_system_bbb 2.30.212  nerves_system_br 1.34.413  nerves_system_mangopi_mq_pro 0.17.214  nerves_system_qemu_aarch64 0.4.215  nerves_system_rpi0 2.1.216  nerves_system_rpi4 2.1.217  nerves_system_rpi5 2.1.218  nerves_system_trellis 0.5.019  nerves_system_x86_64 1.34.220  nerves_toolchain_aarch64_nerves_linux_gnu 15.3.121  nerves_toolchain_armv6_nerves_linux_gnueabihf 15.3.122  nerves_toolchain_armv7_nerves_linux_gnueabihf 15.3.123  nerves_toolchain_riscv64_nerves_linux_gnu 15.3.124  nerves_toolchain_x86_64_nerves_linux_musl 15.3.125  nerves_uevent 0.1.726  property_table 0.3.427  ring_logger 0.11.728  tablet 0.3.329  talib_ex_nif 0.1.030  toolshed 0.5.031  uboot_env 1.0.232* Getting talib_ex_nif (Hex package)33* Getting nerves (Hex package)34* Getting ring_logger (Hex package)35* Getting toolshed (Hex package)36* Getting nerves_runtime (Hex package)37* Getting nerves_system_bbb (Hex package)38* Getting nerves_system_mangopi_mq_pro (Hex package)39* Getting nerves_system_qemu_aarch64 (Hex package)40* Getting nerves_system_rpi0 (Hex package)41* Getting nerves_system_rpi4 (Hex package)42* Getting nerves_system_rpi5 (Hex package)43* Getting nerves_system_trellis (Hex package)44* Getting nerves_system_x86_64 (Hex package)45* Getting nerves_system_br (Hex package)46* Getting nerves_toolchain_x86_64_nerves_linux_musl (Hex package)47* Getting nerves_toolchain_armv7_nerves_linux_gnueabihf (Hex package)48* Getting nerves_toolchain_aarch64_nerves_linux_gnu (Hex package)49* Getting nerves_toolchain_armv6_nerves_linux_gnueabihf (Hex package)50* Getting nerves_toolchain_riscv64_nerves_linux_gnu (Hex package)51* Getting nerves_logging (Hex package)52* Getting nerves_uevent (Hex package)53* Getting uboot_env (Hex package)54* Getting elixir_make (Hex package)55* Getting property_table (Hex package)56* Getting circular_buffer (Hex package)57* Getting interactive_cmd (Hex package)58* Getting nerves_discovery (Hex package)59* Getting tablet (Hex package)60==> nerves_system_br61Generated nerves_system_br app62==> circular_buffer63Compiling 1 file (.ex)64Generated circular_buffer app65==> tablet66Compiling 2 files (.ex)67Generated tablet app68==> elixir_make69Compiling 8 files (.ex)70Generated elixir_make app71==> nerves_logging72 CC kmsg_tailer.o73 LD kmsg_tailer74Compiling 5 files (.ex)75Generated nerves_logging app76==> nerves_discovery77Compiling 5 files (.ex)78Generated nerves_discovery app79==> ring_logger80Compiling 7 files (.ex)81Generated ring_logger app82==> interactive_cmd83Compiling 1 file (.ex)84Generated interactive_cmd app85==> nerves86Compiling 65 files (.ex)87    warning: redefining module Mix.Tasks.Nerves.Init (current version loaded from /work/proj/_build/bbb/lib/nerves/ebin/Elixir.Mix.Tasks.Nerves.Init.beam)88    │89  6 │ defmodule Mix.Tasks.Nerves.Init do90    │ ~~~~~~~~~~~~~~~~~~~~~~~~~~~~~~~~~~91    │92    └─ lib/mix/tasks/nerves.init.ex:6: Mix.Tasks.Nerves.Init (module)9394    warning: redefining module Nerves (current version loaded from /work/proj/_build/bbb/lib/nerves/ebin/Elixir.Nerves.beam)95    │96  6 │ defmodule Nerves do97    │ ~~~~~~~~~~~~~~~~~~~98    │99    └─ lib/nerves.ex:6: Nerves (module)100101    warning: redefining module Nerves.ArtifactResolver (current version loaded from /work/proj/_build/bbb/lib/nerves/ebin/Elixir.Nerves.ArtifactResolver.beam)102    │103  5 │ defmodule Nerves.ArtifactResolver do104    │ ~~~~~~~~~~~~~~~~~~~~~~~~~~~~~~~~~~~~105    │106    └─ lib/nerves/artifact_resolver.ex:5: Nerves.ArtifactResolver (module)107108    warning: redefining module Nerves.BuildAction.AppModes (current version loaded from /work/proj/_build/bbb/lib/nerves/ebin/Elixir.Nerves.BuildAction.AppModes.beam)109    │110  6 │ defmodule Nerves.BuildAction.AppModes do111    │ ~~~~~~~~~~~~~~~~~~~~~~~~~~~~~~~~~~~~~~~~112    │113    └─ lib/nerves/build_action/app_modes.ex:6: Nerves.BuildAction.AppModes (module)114115    warning: redefining module Nerves.BuildAction.CheckExecutables (current version loaded from /work/proj/_build/bbb/lib/nerves/ebin/Elixir.Nerves.BuildAction.CheckExecutables.beam)116    │117  5 │ defmodule Nerves.BuildAction.CheckExecutables do118    │ ~~~~~~~~~~~~~~~~~~~~~~~~~~~~~~~~~~~~~~~~~~~~~~~~119    │120    └─ lib/nerves/build_action/check_executables.ex:5: Nerves.BuildAction.CheckExecutables (module)121122    warning: redefining module Nerves.BuildAction.Erlinit (current version loaded from /work/proj/_build/bbb/lib/nerves/ebin/Elixir.Nerves.BuildAction.Erlinit.beam)123    │124  8 │ defmodule Nerves.BuildAction.Erlinit do125    │ ~~~~~~~~~~~~~~~~~~~~~~~~~~~~~~~~~~~~~~~126    │127    └─ lib/nerves/build_action/erlinit.ex:8: Nerves.BuildAction.Erlinit (module)128129    warning: redefining module Nerves.BuildAction.Firmware (current version loaded from /work/proj/_build/bbb/lib/nerves/ebin/Elixir.Nerves.BuildAction.Firmware.beam)130    │131  5 │ defmodule Nerves.BuildAction.Firmware do132    │ ~~~~~~~~~~~~~~~~~~~~~~~~~~~~~~~~~~~~~~~~133    │134    └─ lib/nerves/build_action/firmware.ex:5: Nerves.BuildAction.Firmware (module)135136    warning: redefining module Nerves.BuildAction.IExStartupCheck (current version loaded from /work/proj/_build/bbb/lib/nerves/ebin/Elixir.Nerves.BuildAction.IExStartupCheck.beam)137    │138  7 │ defmodule Nerves.BuildAction.IExStartupCheck do139    │ ~~~~~~~~~~~~~~~~~~~~~~~~~~~~~~~~~~~~~~~~~~~~~~~140    │141    └─ lib/nerves/build_action/iex_startup_check.ex:7: Nerves.BuildAction.IExStartupCheck (module)142143    warning: redefining module Nerves.BuildAction.NervesV1System (current version loaded from /work/proj/_build/bbb/lib/nerves/ebin/Elixir.Nerves.BuildAction.NervesV1System.beam)144    │145  5 │ defmodule Nerves.BuildAction.NervesV1System do146    │ ~~~~~~~~~~~~~~~~~~~~~~~~~~~~~~~~~~~~~~~~~~~~~~147    │148    └─ lib/nerves/build_action/nerves_v1_system.ex:5: Nerves.BuildAction.NervesV1System (module)149150    warning: redefining module Nerves.BuildAction.NervesV1Toolchain (current version loaded from /work/proj/_build/bbb/lib/nerves/ebin/Elixir.Nerves.BuildAction.NervesV1Toolchain.beam)151    │152  5 │ defmodule Nerves.BuildAction.NervesV1Toolchain do153    │ ~~~~~~~~~~~~~~~~~~~~~~~~~~~~~~~~~~~~~~~~~~~~~~~~~154    │155    └─ lib/nerves/build_action/nerves_v1_toolchain.ex:5: Nerves.BuildAction.NervesV1Toolchain (module)156157    warning: redefining module Nerves.BuildAction.Rootfs (current version loaded from /work/proj/_build/bbb/lib/nerves/ebin/Elixir.Nerves.BuildAction.Rootfs.beam)158    │159  5 │ defmodule Nerves.BuildAction.Rootfs do160    │ ~~~~~~~~~~~~~~~~~~~~~~~~~~~~~~~~~~~~~~161    │162    └─ lib/nerves/build_action/rootfs.ex:5: Nerves.BuildAction.Rootfs (module)163164    warning: redefining module Nerves.BuildAction.SortApps (current version loaded from /work/proj/_build/bbb/lib/nerves/ebin/Elixir.Nerves.BuildAction.SortApps.beam)165    │166  6 │ defmodule Nerves.BuildAction.SortApps do167    │ ~~~~~~~~~~~~~~~~~~~~~~~~~~~~~~~~~~~~~~~~168    │169    └─ lib/nerves/build_action/sort_apps.ex:6: Nerves.BuildAction.SortApps (module)170171    warning: redefining module Nerves.BuildAction.StripAll (current version loaded from /work/proj/_build/bbb/lib/nerves/ebin/Elixir.Nerves.BuildAction.StripAll.beam)172    │173  5 │ defmodule Nerves.BuildAction.StripAll do174    │ ~~~~~~~~~~~~~~~~~~~~~~~~~~~~~~~~~~~~~~~~175    │176    └─ lib/nerves/build_action/strip_all.ex:5: Nerves.BuildAction.StripAll (module)177178    warning: redefining module Nerves.BuildAction.Trimmer (current version loaded from /work/proj/_build/bbb/lib/nerves/ebin/Elixir.Nerves.BuildAction.Trimmer.beam)179    │180  5 │ defmodule Nerves.BuildAction.Trimmer do181    │ ~~~~~~~~~~~~~~~~~~~~~~~~~~~~~~~~~~~~~~~182    │183    └─ lib/nerves/build_action/trimmer.ex:5: Nerves.BuildAction.Trimmer (module)184185    warning: redefining module Nerves.BuildPlan (current version loaded from /work/proj/_build/bbb/lib/nerves/ebin/Elixir.Nerves.BuildPlan.beam)186    │187  5 │ defmodule Nerves.BuildPlan do188    │ ~~~~~~~~~~~~~~~~~~~~~~~~~~~~~189    │190    └─ lib/nerves/build_plan.ex:5: Nerves.BuildPlan (module)191192    warning: redefining module Nerves.BuildPlan.Checks (current version loaded from /work/proj/_build/bbb/lib/nerves/ebin/Elixir.Nerves.BuildPlan.Checks.beam)193    │194  5 │ defmodule Nerves.BuildPlan.Checks do195    │ ~~~~~~~~~~~~~~~~~~~~~~~~~~~~~~~~~~~~196    │197    └─ lib/nerves/build_plan/checks.ex:5: Nerves.BuildPlan.Checks (module)198199    warning: redefining module Nerves.Container (current version loaded from /work/proj/_build/bbb/lib/nerves/ebin/Elixir.Nerves.Container.beam)200    │201  6 │ defmodule Nerves.Container do202    │ ~~~~~~~~~~~~~~~~~~~~~~~~~~~~~203    │204    └─ lib/nerves/container.ex:6: Nerves.Container (module)205206    warning: redefining module Nerves.Fingerprint (current version loaded from /work/proj/_build/bbb/lib/nerves/ebin/Elixir.Nerves.Fingerprint.beam)207    │208  5 │ defmodule Nerves.Fingerprint do209    │ ~~~~~~~~~~~~~~~~~~~~~~~~~~~~~~~210    │211    └─ lib/nerves/fingerprint.ex:5: Nerves.Fingerprint (module)212213    warning: redefining module Nerves.MixPackage (current version loaded from /work/proj/_build/bbb/lib/nerves/ebin/Elixir.Nerves.MixPackage.beam)214    │215  5 │ defmodule Nerves.MixPackage do216    │ ~~~~~~~~~~~~~~~~~~~~~~~~~~~~~~217    │218    └─ lib/nerves/mix_package.ex:5: Nerves.MixPackage (module)219220    warning: redefining module Nerves.Paths (current version loaded from /work/proj/_build/bbb/lib/nerves/ebin/Elixir.Nerves.Paths.beam)221    │222  5 │ defmodule Nerves.Paths do223    │ ~~~~~~~~~~~~~~~~~~~~~~~~~224    │225    └─ lib/nerves/paths.ex:5: Nerves.Paths (module)226227    warning: redefining module Nerves.TargetTuple (current version loaded from /work/proj/_build/bbb/lib/nerves/ebin/Elixir.Nerves.TargetTuple.beam)228    │229  5 │ defmodule Nerves.TargetTuple do230    │ ~~~~~~~~~~~~~~~~~~~~~~~~~~~~~~~231    │232    └─ lib/nerves/target_tuple.ex:5: Nerves.TargetTuple (module)233234Generated nerves app235==> nerves_toolchain_armv7_nerves_linux_gnueabihf236Compiling 1 file (.ex)237Generated nerves_toolchain_armv7_nerves_linux_gnueabihf app238==> talib_ex_nif239gcc -g -O3 -ansi -pedantic -Wall -Wextra -I/usr/local/lib/erlang/erts-17.1/include -Wno-unused-parameter -fPIC -I/usr/include/ta-lib c_src/func_acos.c c_src/func_ad.c c_src/func_add.c c_src/func_adosc.c c_src/func_adx.c c_src/func_adxr.c c_src/func_apo.c c_src/func_aroon.c c_src/func_aroonosc.c c_src/func_asin.c c_src/func_atan.c c_src/func_atr.c c_src/func_avgprice.c c_src/func_bbands.c c_src/func_beta.c c_src/func_bop.c c_src/func_cci.c c_src/func_cdl2_crows.c c_src/func_cdl3_black_crows.c c_src/func_cdl3_inside.c c_src/func_cdl3_line_strike.c c_src/func_cdl3_outside.c c_src/func_cdl3_stars_in_south.c c_src/func_cdl3_white_soldiers.c c_src/func_cdl_abandoned_baby.c c_src/func_cdl_advance_block.c c_src/func_cdl_belt_hold.c c_src/func_cdl_breakaway.c c_src/func_cdl_closing_marubozu.c c_src/func_cdl_conceal_baby_swallow.c c_src/func_cdl_counterattack.c c_src/func_cdl_dark_cloud_cover.c c_src/func_cdl_doji.c c_src/func_cdl_doji_star.c c_src/func_cdl_dragonfly_doji.c c_src/func_cdl_engulfing.c c_src/func_cdl_evening_doji_star.c c_src/func_cdl_evening_star.c c_src/func_cdl_gap_side_side_white.c c_src/func_cdl_gravestone_doji.c c_src/func_cdl_hammer.c c_src/func_cdl_hanging_man.c c_src/func_cdl_harami.c c_src/func_cdl_harami_cross.c c_src/func_cdl_highwave.c c_src/func_cdl_hikkake.c c_src/func_cdl_hikkake_mod.c c_src/func_cdl_homing_pigeon.c c_src/func_cdl_identical_3_crows.c c_src/func_cdl_inneck.c c_src/func_cdl_inverted_hammer.c c_src/func_cdl_kicking.c c_src/func_cdl_kicking_by_length.c c_src/func_cdl_ladder_bottom.c c_src/func_cdl_long_legged_doji.c c_src/func_cdl_long_line.c c_src/func_cdl_marubozu.c c_src/func_cdl_mat_hold.c c_src/func_cdl_matching_low.c c_src/func_cdl_morning_doji_star.c c_src/func_cdl_morning_star.c c_src/func_cdl_on_neck.c c_src/func_cdl_piercing.c c_src/func_cdl_rickshaw_man.c c_src/func_cdl_rise_fall_3_methods.c c_src/func_cdl_separating_lines.c c_src/func_cdl_shooting_star.c c_src/func_cdl_short_line.c c_src/func_cdl_spinning_top.c c_src/func_cdl_stalled_pattern.c c_src/func_cdl_stick_sandwich.c c_src/func_cdl_takuri.c c_src/func_cdl_tasuki_gap.c c_src/func_cdl_thrusting.c c_src/func_cdl_tri_star.c c_src/func_cdl_unique_3_river.c c_src/func_cdl_upside_downside_gap_3_methods.c c_src/func_cdl_upside_gap_2_crows.c c_src/func_ceil.c c_src/func_cmo.c c_src/func_correl.c c_src/func_cos.c c_src/func_cosh.c c_src/func_dema.c c_src/func_div.c c_src/func_dx.c c_src/func_ema.c c_src/func_exp.c c_src/func_floor.c c_src/func_ht_dcperiod.c c_src/func_ht_dcphase.c c_src/func_ht_phasor.c c_src/func_ht_sine.c c_src/func_ht_trendline.c c_src/func_ht_trendmode.c c_src/func_kama.c c_src/func_linear_reg.c c_src/func_linear_reg_angle.c c_src/func_linear_reg_intercept.c c_src/func_linear_reg_slope.c c_src/func_ln.c c_src/func_log10.c c_src/func_ma.c c_src/func_macd.c c_src/func_macdext.c c_src/func_macdfix.c c_src/func_mama.c c_src/func_mavp.c c_src/func_max.c c_src/func_max_index.c c_src/func_med_price.c c_src/func_mfi.c c_src/func_mid_point.c c_src/func_mid_price.c c_src/func_min.c c_src/func_min_index.c c_src/func_min_max.c c_src/func_min_max_index.c c_src/func_minus_di.c c_src/func_minus_dm.c c_src/func_mom.c c_src/func_mult.c c_src/func_natr.c c_src/func_obv.c c_src/func_plus_di.c c_src/func_plus_dm.c c_src/func_ppo.c c_src/func_roc.c c_src/func_rocp.c c_src/func_rocr.c c_src/func_rocr100.c c_src/func_rsi.c c_src/func_sar.c c_src/func_sarext.c c_src/func_sin.c c_src/func_sinh.c c_src/func_sma.c c_src/func_sqrt.c c_src/func_stddev.c c_src/func_stoch.c c_src/func_stochf.c c_src/func_stochrsi.c c_src/func_sub.c c_src/func_sum.c c_src/func_t3.c c_src/func_tan.c c_src/func_tanh.c c_src/func_tema.c c_src/func_trange.c c_src/func_trima.c c_src/func_trix.c c_src/func_tsf.c c_src/func_typprice.c c_src/func_ultosc.c c_src/func_var.c c_src/func_wclprice.c c_src/func_willr.c c_src/func_wma.c c_src/talib.c c_src/util.c --sysroot=/home/nerves/.nerves/artifacts/nerves_system_bbb-2.30.2/staging -lta_lib -L/usr/lib -L/usr/local/lib/erlang/lib/erl_interface-5.8.2/lib -lerl_interface  -shared  -o priv/talib.so240In file included from /home/nerves/.nerves/artifacts/nerves_system_bbb-2.30.2/staging/usr/include/features.h:564,241                 from /home/nerves/.nerves/artifacts/nerves_system_bbb-2.30.2/staging/usr/include/sys/types.h:25,242                 from /usr/local/lib/erlang/erts-17.1/include/erl_drv_nif.h:161,243                 from /usr/local/lib/erlang/erts-17.1/include/erl_nif.h:33,244                 from c_src/func_acos.c:2:245/home/nerves/.nerves/artifacts/nerves_system_bbb-2.30.2/staging/usr/include/gnu/stubs.h:7:11: fatal error: gnu/stubs-soft.h: No such file or directory246    7 | # include <gnu/stubs-soft.h>247      |           ^~~~~~~~~~~~~~~~~~248compilation terminated.249In file included from /home/nerves/.nerves/artifacts/nerves_system_bbb-2.30.2/staging/usr/include/features.h:564,250                 from /home/nerves/.nerves/artifacts/nerves_system_bbb-2.30.2/staging/usr/include/sys/types.h:25,251                 from /usr/local/lib/erlang/erts-17.1/include/erl_drv_nif.h:161,252                 from /usr/local/lib/erlang/erts-17.1/include/erl_nif.h:33,253                 from c_src/func_ad.c:2:254/home/nerves/.nerves/artifacts/nerves_system_bbb-2.30.2/staging/usr/include/gnu/stubs.h:7:11: fatal error: gnu/stubs-soft.h: No such file or directory255    7 | # include <gnu/stubs-soft.h>256      |           ^~~~~~~~~~~~~~~~~~257compilation terminated.258In file included from /home/nerves/.nerves/artifacts/nerves_system_bbb-2.30.2/staging/usr/include/features.h:564,259                 from /home/nerves/.nerves/artifacts/nerves_system_bbb-2.30.2/staging/usr/include/sys/types.h:25,260                 from /usr/local/lib/erlang/erts-17.1/include/erl_drv_nif.h:161,261                 from /usr/local/lib/erlang/erts-17.1/include/erl_nif.h:33,262                 from c_src/func_add.c:2:263/home/nerves/.nerves/artifacts/nerves_system_bbb-2.30.2/staging/usr/include/gnu/stubs.h:7:11: fatal error: gnu/stubs-soft.h: No such file or directory264    7 | # include <gnu/stubs-soft.h>265      |           ^~~~~~~~~~~~~~~~~~266compilation terminated.267In file included from /home/nerves/.nerves/artifacts/nerves_system_bbb-2.30.2/staging/usr/include/features.h:564,268                 from /home/nerves/.nerves/artifacts/nerves_system_bbb-2.30.2/staging/usr/include/sys/types.h:25,269                 from /usr/local/lib/erlang/erts-17.1/include/erl_drv_nif.h:161,270                 from /usr/local/lib/erlang/erts-17.1/include/erl_nif.h:33,271                 from c_src/func_adosc.c:2:272/home/nerves/.nerves/artifacts/nerves_system_bbb-2.30.2/staging/usr/include/gnu/stubs.h:7:11: fatal error: gnu/stubs-soft.h: No such file or directory273    7 | # include <gnu/stubs-soft.h>274      |           ^~~~~~~~~~~~~~~~~~275compilation terminated.276In file included from /home/nerves/.nerves/artifacts/nerves_system_bbb-2.30.2/staging/usr/include/features.h:564,277                 from /home/nerves/.nerves/artifacts/nerves_system_bbb-2.30.2/staging/usr/include/sys/types.h:25,278                 from /usr/local/lib/erlang/erts-17.1/include/erl_drv_nif.h:161,279                 from /usr/local/lib/erlang/erts-17.1/include/erl_nif.h:33,280                 from c_src/func_adx.c:2:281/home/nerves/.nerves/artifacts/nerves_system_bbb-2.30.2/staging/usr/include/gnu/stubs.h:7:11: fatal error: gnu/stubs-soft.h: No such file or directory282    7 | # include <gnu/stubs-soft.h>283      |           ^~~~~~~~~~~~~~~~~~284compilation terminated.285In file included from /home/nerves/.nerves/artifacts/nerves_system_bbb-2.30.2/staging/usr/include/features.h:564,286                 from /home/nerves/.nerves/artifacts/nerves_system_bbb-2.30.2/staging/usr/include/sys/types.h:25,287                 from /usr/local/lib/erlang/erts-17.1/include/erl_drv_nif.h:161,288                 from /usr/local/lib/erlang/erts-17.1/include/erl_nif.h:33,289                 from c_src/func_adxr.c:2:290/home/nerves/.nerves/artifacts/nerves_system_bbb-2.30.2/staging/usr/include/gnu/stubs.h:7:11: fatal error: gnu/stubs-soft.h: No such file or directory291    7 | # include <gnu/stubs-soft.h>292      |           ^~~~~~~~~~~~~~~~~~293compilation terminated.294In file included from /home/nerves/.nerves/artifacts/nerves_system_bbb-2.30.2/staging/usr/include/features.h:564,295                 from /home/nerves/.nerves/artifacts/nerves_system_bbb-2.30.2/staging/usr/include/sys/types.h:25,296                 from /usr/local/lib/erlang/erts-17.1/include/erl_drv_nif.h:161,297                 from /usr/local/lib/erlang/erts-17.1/include/erl_nif.h:33,298                 from c_src/func_apo.c:2:299/home/nerves/.nerves/artifacts/nerves_system_bbb-2.30.2/staging/usr/include/gnu/stubs.h:7:11: fatal error: gnu/stubs-soft.h: No such file or directory300    7 | # include <gnu/stubs-soft.h>301      |           ^~~~~~~~~~~~~~~~~~302compilation terminated.303In file included from /home/nerves/.nerves/artifacts/nerves_system_bbb-2.30.2/staging/usr/include/features.h:564,304                 from /home/nerves/.nerves/artifacts/nerves_system_bbb-2.30.2/staging/usr/include/sys/types.h:25,305                 from /usr/local/lib/erlang/erts-17.1/include/erl_drv_nif.h:161,306                 from /usr/local/lib/erlang/erts-17.1/include/erl_nif.h:33,307                 from c_src/func_aroon.c:2:308/home/nerves/.nerves/artifacts/nerves_system_bbb-2.30.2/staging/usr/include/gnu/stubs.h:7:11: fatal error: gnu/stubs-soft.h: No such file or directory309    7 | # include <gnu/stubs-soft.h>310      |           ^~~~~~~~~~~~~~~~~~311compilation terminated.312In file included from /home/nerves/.nerves/artifacts/nerves_system_bbb-2.30.2/staging/usr/include/features.h:564,313                 from /home/nerves/.nerves/artifacts/nerves_system_bbb-2.30.2/staging/usr/include/sys/types.h:25,314                 from /usr/local/lib/erlang/erts-17.1/include/erl_drv_nif.h:161,315                 from /usr/local/lib/erlang/erts-17.1/include/erl_nif.h:33,316                 from c_src/func_aroonosc.c:2:317/home/nerves/.nerves/artifacts/nerves_system_bbb-2.30.2/staging/usr/include/gnu/stubs.h:7:11: fatal error: gnu/stubs-soft.h: No such file or directory318    7 | # include <gnu/stubs-soft.h>319      |           ^~~~~~~~~~~~~~~~~~320compilation terminated.321In file included from /home/nerves/.nerves/artifacts/nerves_system_bbb-2.30.2/staging/usr/include/features.h:564,322                 from /home/nerves/.nerves/artifacts/nerves_system_bbb-2.30.2/staging/usr/include/sys/types.h:25,323                 from /usr/local/lib/erlang/erts-17.1/include/erl_drv_nif.h:161,324                 from /usr/local/lib/erlang/erts-17.1/include/erl_nif.h:33,325                 from c_src/func_asin.c:2:326/home/nerves/.nerves/artifacts/nerves_system_bbb-2.30.2/staging/usr/include/gnu/stubs.h:7:11: fatal error: gnu/stubs-soft.h: No such file or directory327    7 | # include <gnu/stubs-soft.h>328      |           ^~~~~~~~~~~~~~~~~~329compilation terminated.330In file included from /home/nerves/.nerves/artifacts/nerves_system_bbb-2.30.2/staging/usr/include/features.h:564,331                 from /home/nerves/.nerves/artifacts/nerves_system_bbb-2.30.2/staging/usr/include/sys/types.h:25,332                 from /usr/local/lib/erlang/erts-17.1/include/erl_drv_nif.h:161,333                 from /usr/local/lib/erlang/erts-17.1/include/erl_nif.h:33,334                 from c_src/func_atan.c:2:335/home/nerves/.nerves/artifacts/nerves_system_bbb-2.30.2/staging/usr/include/gnu/stubs.h:7:11: fatal error: gnu/stubs-soft.h: No such file or directory336    7 | # include <gnu/stubs-soft.h>337      |           ^~~~~~~~~~~~~~~~~~338compilation terminated.339In file included from /home/nerves/.nerves/artifacts/nerves_system_bbb-2.30.2/staging/usr/include/features.h:564,340                 from /home/nerves/.nerves/artifacts/nerves_system_bbb-2.30.2/staging/usr/include/sys/types.h:25,341                 from /usr/local/lib/erlang/erts-17.1/include/erl_drv_nif.h:161,342                 from /usr/local/lib/erlang/erts-17.1/include/erl_nif.h:33,343                 from c_src/func_atr.c:2:344/home/nerves/.nerves/artifacts/nerves_system_bbb-2.30.2/staging/usr/include/gnu/stubs.h:7:11: fatal error: gnu/stubs-soft.h: No such file or directory345    7 | # include <gnu/stubs-soft.h>346      |           ^~~~~~~~~~~~~~~~~~347compilation terminated.348In file included from /home/nerves/.nerves/artifacts/nerves_system_bbb-2.30.2/staging/usr/include/features.h:564,349                 from /home/nerves/.nerves/artifacts/nerves_system_bbb-2.30.2/staging/usr/include/sys/types.h:25,350                 from /usr/local/lib/erlang/erts-17.1/include/erl_drv_nif.h:161,351                 from /usr/local/lib/erlang/erts-17.1/include/erl_nif.h:33,352                 from c_src/func_avgprice.c:2:353/home/nerves/.nerves/artifacts/nerves_system_bbb-2.30.2/staging/usr/include/gnu/stubs.h:7:11: fatal error: gnu/stubs-soft.h: No such file or directory354    7 | # include <gnu/stubs-soft.h>355      |           ^~~~~~~~~~~~~~~~~~356compilation terminated.357In file included from /home/nerves/.nerves/artifacts/nerves_system_bbb-2.30.2/staging/usr/include/features.h:564,358                 from /home/nerves/.nerves/artifacts/nerves_system_bbb-2.30.2/staging/usr/include/sys/types.h:25,359                 from /usr/local/lib/erlang/erts-17.1/include/erl_drv_nif.h:161,360                 from /usr/local/lib/erlang/erts-17.1/include/erl_nif.h:33,361                 from c_src/func_bbands.c:2:362/home/nerves/.nerves/artifacts/nerves_system_bbb-2.30.2/staging/usr/include/gnu/stubs.h:7:11: fatal error: gnu/stubs-soft.h: No such file or directory363    7 | # include <gnu/stubs-soft.h>364      |           ^~~~~~~~~~~~~~~~~~365compilation terminated.366In file included from /home/nerves/.nerves/artifacts/nerves_system_bbb-2.30.2/staging/usr/include/features.h:564,367                 from /home/nerves/.nerves/artifacts/nerves_system_bbb-2.30.2/staging/usr/include/sys/types.h:25,368                 from /usr/local/lib/erlang/erts-17.1/include/erl_drv_nif.h:161,369                 from /usr/local/lib/erlang/erts-17.1/include/erl_nif.h:33,370                 from c_src/func_beta.c:2:371/home/nerves/.nerves/artifacts/nerves_system_bbb-2.30.2/staging/usr/include/gnu/stubs.h:7:11: fatal error: gnu/stubs-soft.h: No such file or directory372    7 | # include <gnu/stubs-soft.h>373      |           ^~~~~~~~~~~~~~~~~~374compilation terminated.375In file included from /home/nerves/.nerves/artifacts/nerves_system_bbb-2.30.2/staging/usr/include/features.h:564,376                 from /home/nerves/.nerves/artifacts/nerves_system_bbb-2.30.2/staging/usr/include/sys/types.h:25,377                 from /usr/local/lib/erlang/erts-17.1/include/erl_drv_nif.h:161,378                 from /usr/local/lib/erlang/erts-17.1/include/erl_nif.h:33,379                 from c_src/func_bop.c:2:380/home/nerves/.nerves/artifacts/nerves_system_bbb-2.30.2/staging/usr/include/gnu/stubs.h:7:11: fatal error: gnu/stubs-soft.h: No such file or directory381    7 | # include <gnu/stubs-soft.h>382      |           ^~~~~~~~~~~~~~~~~~383compilation terminated.384In file included from /home/nerves/.nerves/artifacts/nerves_system_bbb-2.30.2/staging/usr/include/features.h:564,385                 from /home/nerves/.nerves/artifacts/nerves_system_bbb-2.30.2/staging/usr/include/sys/types.h:25,386                 from /usr/local/lib/erlang/erts-17.1/include/erl_drv_nif.h:161,387                 from /usr/local/lib/erlang/erts-17.1/include/erl_nif.h:33,388                 from c_src/func_cci.c:2:389/home/nerves/.nerves/artifacts/nerves_system_bbb-2.30.2/staging/usr/include/gnu/stubs.h:7:11: fatal error: gnu/stubs-soft.h: No such file or directory390    7 | # include <gnu/stubs-soft.h>391      |           ^~~~~~~~~~~~~~~~~~392compilation terminated.393In file included from /home/nerves/.nerves/artifacts/nerves_system_bbb-2.30.2/staging/usr/include/features.h:564,394                 from /home/nerves/.nerves/artifacts/nerves_system_bbb-2.30.2/staging/usr/include/sys/types.h:25,395                 from /usr/local/lib/erlang/erts-17.1/include/erl_drv_nif.h:161,396                 from /usr/local/lib/erlang/erts-17.1/include/erl_nif.h:33,397                 from c_src/func_cdl2_crows.c:2:398/home/nerves/.nerves/artifacts/nerves_system_bbb-2.30.2/staging/usr/include/gnu/stubs.h:7:11: fatal error: gnu/stubs-soft.h: No such file or directory399    7 | # include <gnu/stubs-soft.h>400      |           ^~~~~~~~~~~~~~~~~~401compilation terminated.402In file included from /home/nerves/.nerves/artifacts/nerves_system_bbb-2.30.2/staging/usr/include/features.h:564,403                 from /home/nerves/.nerves/artifacts/nerves_system_bbb-2.30.2/staging/usr/include/sys/types.h:25,404                 from /usr/local/lib/erlang/erts-17.1/include/erl_drv_nif.h:161,405                 from /usr/local/lib/erlang/erts-17.1/include/erl_nif.h:33,406                 from c_src/func_cdl3_black_crows.c:2:407/home/nerves/.nerves/artifacts/nerves_system_bbb-2.30.2/staging/usr/include/gnu/stubs.h:7:11: fatal error: gnu/stubs-soft.h: No such file or directory408    7 | # include <gnu/stubs-soft.h>409      |           ^~~~~~~~~~~~~~~~~~410compilation terminated.411In file included from /home/nerves/.nerves/artifacts/nerves_system_bbb-2.30.2/staging/usr/include/features.h:564,412                 from /home/nerves/.nerves/artifacts/nerves_system_bbb-2.30.2/staging/usr/include/sys/types.h:25,413                 from /usr/local/lib/erlang/erts-17.1/include/erl_drv_nif.h:161,414                 from /usr/local/lib/erlang/erts-17.1/include/erl_nif.h:33,415                 from c_src/func_cdl3_inside.c:2:416/home/nerves/.nerves/artifacts/nerves_system_bbb-2.30.2/staging/usr/include/gnu/stubs.h:7:11: fatal error: gnu/stubs-soft.h: No such file or directory417    7 | # include <gnu/stubs-soft.h>418      |           ^~~~~~~~~~~~~~~~~~419compilation terminated.420In file included from /home/nerves/.nerves/artifacts/nerves_system_bbb-2.30.2/staging/usr/include/features.h:564,421                 from /home/nerves/.nerves/artifacts/nerves_system_bbb-2.30.2/staging/usr/include/sys/types.h:25,422                 from /usr/local/lib/erlang/erts-17.1/include/erl_drv_nif.h:161,423                 from /usr/local/lib/erlang/erts-17.1/include/erl_nif.h:33,424                 from c_src/func_cdl3_line_strike.c:2:425/home/nerves/.nerves/artifacts/nerves_system_bbb-2.30.2/staging/usr/include/gnu/stubs.h:7:11: fatal error: gnu/stubs-soft.h: No such file or directory426    7 | # include <gnu/stubs-soft.h>427      |           ^~~~~~~~~~~~~~~~~~428compilation terminated.429In file included from /home/nerves/.nerves/artifacts/nerves_system_bbb-2.30.2/staging/usr/include/features.h:564,430                 from /home/nerves/.nerves/artifacts/nerves_system_bbb-2.30.2/staging/usr/include/sys/types.h:25,431                 from /usr/local/lib/erlang/erts-17.1/include/erl_drv_nif.h:161,432                 from /usr/local/lib/erlang/erts-17.1/include/erl_nif.h:33,433                 from c_src/func_cdl3_outside.c:2:434/home/nerves/.nerves/artifacts/nerves_system_bbb-2.30.2/staging/usr/include/gnu/stubs.h:7:11: fatal error: gnu/stubs-soft.h: No such file or directory435    7 | # include <gnu/stubs-soft.h>436      |           ^~~~~~~~~~~~~~~~~~437compilation terminated.438In file included from /home/nerves/.nerves/artifacts/nerves_system_bbb-2.30.2/staging/usr/include/features.h:564,439                 from /home/nerves/.nerves/artifacts/nerves_system_bbb-2.30.2/staging/usr/include/sys/types.h:25,440                 from /usr/local/lib/erlang/erts-17.1/include/erl_drv_nif.h:161,441                 from /usr/local/lib/erlang/erts-17.1/include/erl_nif.h:33,442                 from c_src/func_cdl3_stars_in_south.c:2:443/home/nerves/.nerves/artifacts/nerves_system_bbb-2.30.2/staging/usr/include/gnu/stubs.h:7:11: fatal error: gnu/stubs-soft.h: No such file or directory444    7 | # include <gnu/stubs-soft.h>445      |           ^~~~~~~~~~~~~~~~~~446compilation terminated.447In file included from /home/nerves/.nerves/artifacts/nerves_system_bbb-2.30.2/staging/usr/include/features.h:564,448                 from /home/nerves/.nerves/artifacts/nerves_system_bbb-2.30.2/staging/usr/include/sys/types.h:25,449                 from /usr/local/lib/erlang/erts-17.1/include/erl_drv_nif.h:161,450                 from /usr/local/lib/erlang/erts-17.1/include/erl_nif.h:33,451                 from c_src/func_cdl3_white_soldiers.c:2:452/home/nerves/.nerves/artifacts/nerves_system_bbb-2.30.2/staging/usr/include/gnu/stubs.h:7:11: fatal error: gnu/stubs-soft.h: No such file or directory453    7 | # include <gnu/stubs-soft.h>454      |           ^~~~~~~~~~~~~~~~~~455compilation terminated.456In file included from /home/nerves/.nerves/artifacts/nerves_system_bbb-2.30.2/staging/usr/include/features.h:564,457                 from /home/nerves/.nerves/artifacts/nerves_system_bbb-2.30.2/staging/usr/include/sys/types.h:25,458                 from /usr/local/lib/erlang/erts-17.1/include/erl_drv_nif.h:161,459                 from /usr/local/lib/erlang/erts-17.1/include/erl_nif.h:33,460                 from c_src/func_cdl_abandoned_baby.c:2:461/home/nerves/.nerves/artifacts/nerves_system_bbb-2.30.2/staging/usr/include/gnu/stubs.h:7:11: fatal error: gnu/stubs-soft.h: No such file or directory462    7 | # include <gnu/stubs-soft.h>463      |           ^~~~~~~~~~~~~~~~~~464compilation terminated.465In file included from /home/nerves/.nerves/artifacts/nerves_system_bbb-2.30.2/staging/usr/include/features.h:564,466                 from /home/nerves/.nerves/artifacts/nerves_system_bbb-2.30.2/staging/usr/include/sys/types.h:25,467                 from /usr/local/lib/erlang/erts-17.1/include/erl_drv_nif.h:161,468                 from /usr/local/lib/erlang/erts-17.1/include/erl_nif.h:33,469                 from c_src/func_cdl_advance_block.c:2:470/home/nerves/.nerves/artifacts/nerves_system_bbb-2.30.2/staging/usr/include/gnu/stubs.h:7:11: fatal error: gnu/stubs-soft.h: No such file or directory471    7 | # include <gnu/stubs-soft.h>472      |           ^~~~~~~~~~~~~~~~~~473compilation terminated.474In file included from /home/nerves/.nerves/artifacts/nerves_system_bbb-2.30.2/staging/usr/include/features.h:564,475                 from /home/nerves/.nerves/artifacts/nerves_system_bbb-2.30.2/staging/usr/include/sys/types.h:25,476                 from /usr/local/lib/erlang/erts-17.1/include/erl_drv_nif.h:161,477                 from /usr/local/lib/erlang/erts-17.1/include/erl_nif.h:33,478                 from c_src/func_cdl_belt_hold.c:2:479/home/nerves/.nerves/artifacts/nerves_system_bbb-2.30.2/staging/usr/include/gnu/stubs.h:7:11: fatal error: gnu/stubs-soft.h: No such file or directory480    7 | # include <gnu/stubs-soft.h>481      |           ^~~~~~~~~~~~~~~~~~482compilation terminated.483In file included from /home/nerves/.nerves/artifacts/nerves_system_bbb-2.30.2/staging/usr/include/features.h:564,484                 from /home/nerves/.nerves/artifacts/nerves_system_bbb-2.30.2/staging/usr/include/sys/types.h:25,485                 from /usr/local/lib/erlang/erts-17.1/include/erl_drv_nif.h:161,486                 from /usr/local/lib/erlang/erts-17.1/include/erl_nif.h:33,487                 from c_src/func_cdl_breakaway.c:2:488/home/nerves/.nerves/artifacts/nerves_system_bbb-2.30.2/staging/usr/include/gnu/stubs.h:7:11: fatal error: gnu/stubs-soft.h: No such file or directory489    7 | # include <gnu/stubs-soft.h>490      |           ^~~~~~~~~~~~~~~~~~491compilation terminated.492In file included from /home/nerves/.nerves/artifacts/nerves_system_bbb-2.30.2/staging/usr/include/features.h:564,493                 from /home/nerves/.nerves/artifacts/nerves_system_bbb-2.30.2/staging/usr/include/sys/types.h:25,494                 from /usr/local/lib/erlang/erts-17.1/include/erl_drv_nif.h:161,495                 from /usr/local/lib/erlang/erts-17.1/include/erl_nif.h:33,496                 from c_src/func_cdl_closing_marubozu.c:2:497/home/nerves/.nerves/artifacts/nerves_system_bbb-2.30.2/staging/usr/include/gnu/stubs.h:7:11: fatal error: gnu/stubs-soft.h: No such file or directory498    7 | # include <gnu/stubs-soft.h>499      |           ^~~~~~~~~~~~~~~~~~500compilation terminated.501In file included from /home/nerves/.nerves/artifacts/nerves_system_bbb-2.30.2/staging/usr/include/features.h:564,502                 from /home/nerves/.nerves/artifacts/nerves_system_bbb-2.30.2/staging/usr/include/sys/types.h:25,503                 from /usr/local/lib/erlang/erts-17.1/include/erl_drv_nif.h:161,504                 from /usr/local/lib/erlang/erts-17.1/include/erl_nif.h:33,505                 from c_src/func_cdl_conceal_baby_swallow.c:2:506/home/nerves/.nerves/artifacts/nerves_system_bbb-2.30.2/staging/usr/include/gnu/stubs.h:7:11: fatal error: gnu/stubs-soft.h: No such file or directory507    7 | # include <gnu/stubs-soft.h>508      |           ^~~~~~~~~~~~~~~~~~509compilation terminated.510In file included from /home/nerves/.nerves/artifacts/nerves_system_bbb-2.30.2/staging/usr/include/features.h:564,511                 from /home/nerves/.nerves/artifacts/nerves_system_bbb-2.30.2/staging/usr/include/sys/types.h:25,512                 from /usr/local/lib/erlang/erts-17.1/include/erl_drv_nif.h:161,513                 from /usr/local/lib/erlang/erts-17.1/include/erl_nif.h:33,514                 from c_src/func_cdl_counterattack.c:2:515/home/nerves/.nerves/artifacts/nerves_system_bbb-2.30.2/staging/usr/include/gnu/stubs.h:7:11: fatal error: gnu/stubs-soft.h: No such file or directory516    7 | # include <gnu/stubs-soft.h>517      |           ^~~~~~~~~~~~~~~~~~518compilation terminated.519In file included from /home/nerves/.nerves/artifacts/nerves_system_bbb-2.30.2/staging/usr/include/features.h:564,520                 from /home/nerves/.nerves/artifacts/nerves_system_bbb-2.30.2/staging/usr/include/sys/types.h:25,521                 from /usr/local/lib/erlang/erts-17.1/include/erl_drv_nif.h:161,522                 from /usr/local/lib/erlang/erts-17.1/include/erl_nif.h:33,523                 from c_src/func_cdl_dark_cloud_cover.c:2:524/home/nerves/.nerves/artifacts/nerves_system_bbb-2.30.2/staging/usr/include/gnu/stubs.h:7:11: fatal error: gnu/stubs-soft.h: No such file or directory525    7 | # include <gnu/stubs-soft.h>526      |           ^~~~~~~~~~~~~~~~~~527compilation terminated.528In file included from /home/nerves/.nerves/artifacts/nerves_system_bbb-2.30.2/staging/usr/include/features.h:564,529                 from /home/nerves/.nerves/artifacts/nerves_system_bbb-2.30.2/staging/usr/include/sys/types.h:25,530                 from /usr/local/lib/erlang/erts-17.1/include/erl_drv_nif.h:161,531                 from /usr/local/lib/erlang/erts-17.1/include/erl_nif.h:33,532                 from c_src/func_cdl_doji.c:2:533/home/nerves/.nerves/artifacts/nerves_system_bbb-2.30.2/staging/usr/include/gnu/stubs.h:7:11: fatal error: gnu/stubs-soft.h: No such file or directory534    7 | # include <gnu/stubs-soft.h>535      |           ^~~~~~~~~~~~~~~~~~536compilation terminated.537In file included from /home/nerves/.nerves/artifacts/nerves_system_bbb-2.30.2/staging/usr/include/features.h:564,538                 from /home/nerves/.nerves/artifacts/nerves_system_bbb-2.30.2/staging/usr/include/sys/types.h:25,539                 from /usr/local/lib/erlang/erts-17.1/include/erl_drv_nif.h:161,540                 from /usr/local/lib/erlang/erts-17.1/include/erl_nif.h:33,541                 from c_src/func_cdl_doji_star.c:2:542/home/nerves/.nerves/artifacts/nerves_system_bbb-2.30.2/staging/usr/include/gnu/stubs.h:7:11: fatal error: gnu/stubs-soft.h: No such file or directory543    7 | # include <gnu/stubs-soft.h>544      |           ^~~~~~~~~~~~~~~~~~545compilation terminated.546In file included from /home/nerves/.nerves/artifacts/nerves_system_bbb-2.30.2/staging/usr/include/features.h:564,547                 from /home/nerves/.nerves/artifacts/nerves_system_bbb-2.30.2/staging/usr/include/sys/types.h:25,548                 from /usr/local/lib/erlang/erts-17.1/include/erl_drv_nif.h:161,549                 from /usr/local/lib/erlang/erts-17.1/include/erl_nif.h:33,550                 from c_src/func_cdl_dragonfly_doji.c:2:551/home/nerves/.nerves/artifacts/nerves_system_bbb-2.30.2/staging/usr/include/gnu/stubs.h:7:11: fatal error: gnu/stubs-soft.h: No such file or directory552    7 | # include <gnu/stubs-soft.h>553      |           ^~~~~~~~~~~~~~~~~~554compilation terminated.555In file included from /home/nerves/.nerves/artifacts/nerves_system_bbb-2.30.2/staging/usr/include/features.h:564,556                 from /home/nerves/.nerves/artifacts/nerves_system_bbb-2.30.2/staging/usr/include/sys/types.h:25,557                 from /usr/local/lib/erlang/erts-17.1/include/erl_drv_nif.h:161,558                 from /usr/local/lib/erlang/erts-17.1/include/erl_nif.h:33,559                 from c_src/func_cdl_engulfing.c:2:560/home/nerves/.nerves/artifacts/nerves_system_bbb-2.30.2/staging/usr/include/gnu/stubs.h:7:11: fatal error: gnu/stubs-soft.h: No such file or directory561    7 | # include <gnu/stubs-soft.h>562      |           ^~~~~~~~~~~~~~~~~~563compilation terminated.564In file included from /home/nerves/.nerves/artifacts/nerves_system_bbb-2.30.2/staging/usr/include/features.h:564,565                 from /home/nerves/.nerves/artifacts/nerves_system_bbb-2.30.2/staging/usr/include/sys/types.h:25,566                 from /usr/local/lib/erlang/erts-17.1/include/erl_drv_nif.h:161,567                 from /usr/local/lib/erlang/erts-17.1/include/erl_nif.h:33,568                 from c_src/func_cdl_evening_doji_star.c:2:569/home/nerves/.nerves/artifacts/nerves_system_bbb-2.30.2/staging/usr/include/gnu/stubs.h:7:11: fatal error: gnu/stubs-soft.h: No such file or directory570    7 | # include <gnu/stubs-soft.h>571      |           ^~~~~~~~~~~~~~~~~~572compilation terminated.573In file included from /home/nerves/.nerves/artifacts/nerves_system_bbb-2.30.2/staging/usr/include/features.h:564,574                 from /home/nerves/.nerves/artifacts/nerves_system_bbb-2.30.2/staging/usr/include/sys/types.h:25,575                 from /usr/local/lib/erlang/erts-17.1/include/erl_drv_nif.h:161,576                 from /usr/local/lib/erlang/erts-17.1/include/erl_nif.h:33,577                 from c_src/func_cdl_evening_star.c:2:578/home/nerves/.nerves/artifacts/nerves_system_bbb-2.30.2/staging/usr/include/gnu/stubs.h:7:11: fatal error: gnu/stubs-soft.h: No such file or directory579    7 | # include <gnu/stubs-soft.h>580      |           ^~~~~~~~~~~~~~~~~~581compilation terminated.582In file included from /home/nerves/.nerves/artifacts/nerves_system_bbb-2.30.2/staging/usr/include/features.h:564,583                 from /home/nerves/.nerves/artifacts/nerves_system_bbb-2.30.2/staging/usr/include/sys/types.h:25,584                 from /usr/local/lib/erlang/erts-17.1/include/erl_drv_nif.h:161,585                 from /usr/local/lib/erlang/erts-17.1/include/erl_nif.h:33,586                 from c_src/func_cdl_gap_side_side_white.c:2:587/home/nerves/.nerves/artifacts/nerves_system_bbb-2.30.2/staging/usr/include/gnu/stubs.h:7:11: fatal error: gnu/stubs-soft.h: No such file or directory588    7 | # include <gnu/stubs-soft.h>589      |           ^~~~~~~~~~~~~~~~~~590compilation terminated.591In file included from /home/nerves/.nerves/artifacts/nerves_system_bbb-2.30.2/staging/usr/include/features.h:564,592                 from /home/nerves/.nerves/artifacts/nerves_system_bbb-2.30.2/staging/usr/include/sys/types.h:25,593                 from /usr/local/lib/erlang/erts-17.1/include/erl_drv_nif.h:161,594                 from /usr/local/lib/erlang/erts-17.1/include/erl_nif.h:33,595                 from c_src/func_cdl_gravestone_doji.c:2:596/home/nerves/.nerves/artifacts/nerves_system_bbb-2.30.2/staging/usr/include/gnu/stubs.h:7:11: fatal error: gnu/stubs-soft.h: No such file or directory597    7 | # include <gnu/stubs-soft.h>598      |           ^~~~~~~~~~~~~~~~~~599compilation terminated.600In file included from /home/nerves/.nerves/artifacts/nerves_system_bbb-2.30.2/staging/usr/include/features.h:564,601                 from /home/nerves/.nerves/artifacts/nerves_system_bbb-2.30.2/staging/usr/include/sys/types.h:25,602                 from /usr/local/lib/erlang/erts-17.1/include/erl_drv_nif.h:161,603                 from /usr/local/lib/erlang/erts-17.1/include/erl_nif.h:33,604                 from c_src/func_cdl_hammer.c:2:605/home/nerves/.nerves/artifacts/nerves_system_bbb-2.30.2/staging/usr/include/gnu/stubs.h:7:11: fatal error: gnu/stubs-soft.h: No such file or directory606    7 | # include <gnu/stubs-soft.h>607      |           ^~~~~~~~~~~~~~~~~~608compilation terminated.609In file included from /home/nerves/.nerves/artifacts/nerves_system_bbb-2.30.2/staging/usr/include/features.h:564,610                 from /home/nerves/.nerves/artifacts/nerves_system_bbb-2.30.2/staging/usr/include/sys/types.h:25,611                 from /usr/local/lib/erlang/erts-17.1/include/erl_drv_nif.h:161,612                 from /usr/local/lib/erlang/erts-17.1/include/erl_nif.h:33,613                 from c_src/func_cdl_hanging_man.c:2:614/home/nerves/.nerves/artifacts/nerves_system_bbb-2.30.2/staging/usr/include/gnu/stubs.h:7:11: fatal error: gnu/stubs-soft.h: No such file or directory615    7 | # include <gnu/stubs-soft.h>616      |           ^~~~~~~~~~~~~~~~~~617compilation terminated.618In file included from /home/nerves/.nerves/artifacts/nerves_system_bbb-2.30.2/staging/usr/include/features.h:564,619                 from /home/nerves/.nerves/artifacts/nerves_system_bbb-2.30.2/staging/usr/include/sys/types.h:25,620                 from /usr/local/lib/erlang/erts-17.1/include/erl_drv_nif.h:161,621                 from /usr/local/lib/erlang/erts-17.1/include/erl_nif.h:33,622                 from c_src/func_cdl_harami.c:2:623/home/nerves/.nerves/artifacts/nerves_system_bbb-2.30.2/staging/usr/include/gnu/stubs.h:7:11: fatal error: gnu/stubs-soft.h: No such file or directory624    7 | # include <gnu/stubs-soft.h>625      |           ^~~~~~~~~~~~~~~~~~626compilation terminated.627In file included from /home/nerves/.nerves/artifacts/nerves_system_bbb-2.30.2/staging/usr/include/features.h:564,628                 from /home/nerves/.nerves/artifacts/nerves_system_bbb-2.30.2/staging/usr/include/sys/types.h:25,629                 from /usr/local/lib/erlang/erts-17.1/include/erl_drv_nif.h:161,630                 from /usr/local/lib/erlang/erts-17.1/include/erl_nif.h:33,631                 from c_src/func_cdl_harami_cross.c:2:632/home/nerves/.nerves/artifacts/nerves_system_bbb-2.30.2/staging/usr/include/gnu/stubs.h:7:11: fatal error: gnu/stubs-soft.h: No such file or directory633    7 | # include <gnu/stubs-soft.h>634      |           ^~~~~~~~~~~~~~~~~~635compilation terminated.636In file included from /home/nerves/.nerves/artifacts/nerves_system_bbb-2.30.2/staging/usr/include/features.h:564,637                 from /home/nerves/.nerves/artifacts/nerves_system_bbb-2.30.2/staging/usr/include/sys/types.h:25,638                 from /usr/local/lib/erlang/erts-17.1/include/erl_drv_nif.h:161,639                 from /usr/local/lib/erlang/erts-17.1/include/erl_nif.h:33,640                 from c_src/func_cdl_highwave.c:2:641/home/nerves/.nerves/artifacts/nerves_system_bbb-2.30.2/staging/usr/include/gnu/stubs.h:7:11: fatal error: gnu/stubs-soft.h: No such file or directory642    7 | # include <gnu/stubs-soft.h>643      |           ^~~~~~~~~~~~~~~~~~644compilation terminated.645In file included from /home/nerves/.nerves/artifacts/nerves_system_bbb-2.30.2/staging/usr/include/features.h:564,646                 from /home/nerves/.nerves/artifacts/nerves_system_bbb-2.30.2/staging/usr/include/sys/types.h:25,647                 from /usr/local/lib/erlang/erts-17.1/include/erl_drv_nif.h:161,648                 from /usr/local/lib/erlang/erts-17.1/include/erl_nif.h:33,649                 from c_src/func_cdl_hikkake.c:2:650/home/nerves/.nerves/artifacts/nerves_system_bbb-2.30.2/staging/usr/include/gnu/stubs.h:7:11: fatal error: gnu/stubs-soft.h: No such file or directory651    7 | # include <gnu/stubs-soft.h>652      |           ^~~~~~~~~~~~~~~~~~653compilation terminated.654In file included from /home/nerves/.nerves/artifacts/nerves_system_bbb-2.30.2/staging/usr/include/features.h:564,655                 from /home/nerves/.nerves/artifacts/nerves_system_bbb-2.30.2/staging/usr/include/sys/types.h:25,656                 from /usr/local/lib/erlang/erts-17.1/include/erl_drv_nif.h:161,657                 from /usr/local/lib/erlang/erts-17.1/include/erl_nif.h:33,658                 from c_src/func_cdl_hikkake_mod.c:2:659/home/nerves/.nerves/artifacts/nerves_system_bbb-2.30.2/staging/usr/include/gnu/stubs.h:7:11: fatal error: gnu/stubs-soft.h: No such file or directory660    7 | # include <gnu/stubs-soft.h>661      |           ^~~~~~~~~~~~~~~~~~662compilation terminated.663In file included from /home/nerves/.nerves/artifacts/nerves_system_bbb-2.30.2/staging/usr/include/features.h:564,664                 from /home/nerves/.nerves/artifacts/nerves_system_bbb-2.30.2/staging/usr/include/sys/types.h:25,665                 from /usr/local/lib/erlang/erts-17.1/include/erl_drv_nif.h:161,666                 from /usr/local/lib/erlang/erts-17.1/include/erl_nif.h:33,667                 from c_src/func_cdl_homing_pigeon.c:2:668/home/nerves/.nerves/artifacts/nerves_system_bbb-2.30.2/staging/usr/include/gnu/stubs.h:7:11: fatal error: gnu/stubs-soft.h: No such file or directory669    7 | # include <gnu/stubs-soft.h>670      |           ^~~~~~~~~~~~~~~~~~671compilation terminated.672In file included from /home/nerves/.nerves/artifacts/nerves_system_bbb-2.30.2/staging/usr/include/features.h:564,673                 from /home/nerves/.nerves/artifacts/nerves_system_bbb-2.30.2/staging/usr/include/sys/types.h:25,674                 from /usr/local/lib/erlang/erts-17.1/include/erl_drv_nif.h:161,675                 from /usr/local/lib/erlang/erts-17.1/include/erl_nif.h:33,676                 from c_src/func_cdl_identical_3_crows.c:2:677/home/nerves/.nerves/artifacts/nerves_system_bbb-2.30.2/staging/usr/include/gnu/stubs.h:7:11: fatal error: gnu/stubs-soft.h: No such file or directory678    7 | # include <gnu/stubs-soft.h>679      |           ^~~~~~~~~~~~~~~~~~680compilation terminated.681In file included from /home/nerves/.nerves/artifacts/nerves_system_bbb-2.30.2/staging/usr/include/features.h:564,682                 from /home/nerves/.nerves/artifacts/nerves_system_bbb-2.30.2/staging/usr/include/sys/types.h:25,683                 from /usr/local/lib/erlang/erts-17.1/include/erl_drv_nif.h:161,684                 from /usr/local/lib/erlang/erts-17.1/include/erl_nif.h:33,685                 from c_src/func_cdl_inneck.c:2:686/home/nerves/.nerves/artifacts/nerves_system_bbb-2.30.2/staging/usr/include/gnu/stubs.h:7:11: fatal error: gnu/stubs-soft.h: No such file or directory687    7 | # include <gnu/stubs-soft.h>688      |           ^~~~~~~~~~~~~~~~~~689compilation terminated.690In file included from /home/nerves/.nerves/artifacts/nerves_system_bbb-2.30.2/staging/usr/include/features.h:564,691                 from /home/nerves/.nerves/artifacts/nerves_system_bbb-2.30.2/staging/usr/include/sys/types.h:25,692                 from /usr/local/lib/erlang/erts-17.1/include/erl_drv_nif.h:161,693                 from /usr/local/lib/erlang/erts-17.1/include/erl_nif.h:33,694                 from c_src/func_cdl_inverted_hammer.c:2:695/home/nerves/.nerves/artifacts/nerves_system_bbb-2.30.2/staging/usr/include/gnu/stubs.h:7:11: fatal error: gnu/stubs-soft.h: No such file or directory696    7 | # include <gnu/stubs-soft.h>697      |           ^~~~~~~~~~~~~~~~~~698compilation terminated.699In file included from /home/nerves/.nerves/artifacts/nerves_system_bbb-2.30.2/staging/usr/include/features.h:564,700                 from /home/nerves/.nerves/artifacts/nerves_system_bbb-2.30.2/staging/usr/include/sys/types.h:25,701                 from /usr/local/lib/erlang/erts-17.1/include/erl_drv_nif.h:161,702                 from /usr/local/lib/erlang/erts-17.1/include/erl_nif.h:33,703                 from c_src/func_cdl_kicking.c:2:704/home/nerves/.nerves/artifacts/nerves_system_bbb-2.30.2/staging/usr/include/gnu/stubs.h:7:11: fatal error: gnu/stubs-soft.h: No such file or directory705    7 | # include <gnu/stubs-soft.h>706      |           ^~~~~~~~~~~~~~~~~~707compilation terminated.708In file included from /home/nerves/.nerves/artifacts/nerves_system_bbb-2.30.2/staging/usr/include/features.h:564,709                 from /home/nerves/.nerves/artifacts/nerves_system_bbb-2.30.2/staging/usr/include/sys/types.h:25,710                 from /usr/local/lib/erlang/erts-17.1/include/erl_drv_nif.h:161,711                 from /usr/local/lib/erlang/erts-17.1/include/erl_nif.h:33,712                 from c_src/func_cdl_kicking_by_length.c:2:713/home/nerves/.nerves/artifacts/nerves_system_bbb-2.30.2/staging/usr/include/gnu/stubs.h:7:11: fatal error: gnu/stubs-soft.h: No such file or directory714    7 | # include <gnu/stubs-soft.h>715      |           ^~~~~~~~~~~~~~~~~~716compilation terminated.717In file included from /home/nerves/.nerves/artifacts/nerves_system_bbb-2.30.2/staging/usr/include/features.h:564,718                 from /home/nerves/.nerves/artifacts/nerves_system_bbb-2.30.2/staging/usr/include/sys/types.h:25,719                 from /usr/local/lib/erlang/erts-17.1/include/erl_drv_nif.h:161,720                 from /usr/local/lib/erlang/erts-17.1/include/erl_nif.h:33,721                 from c_src/func_cdl_ladder_bottom.c:2:722/home/nerves/.nerves/artifacts/nerves_system_bbb-2.30.2/staging/usr/include/gnu/stubs.h:7:11: fatal error: gnu/stubs-soft.h: No such file or directory723    7 | # include <gnu/stubs-soft.h>724      |           ^~~~~~~~~~~~~~~~~~725compilation terminated.726In file included from /home/nerves/.nerves/artifacts/nerves_system_bbb-2.30.2/staging/usr/include/features.h:564,727                 from /home/nerves/.nerves/artifacts/nerves_system_bbb-2.30.2/staging/usr/include/sys/types.h:25,728                 from /usr/local/lib/erlang/erts-17.1/include/erl_drv_nif.h:161,729                 from /usr/local/lib/erlang/erts-17.1/include/erl_nif.h:33,730                 from c_src/func_cdl_long_legged_doji.c:2:731/home/nerves/.nerves/artifacts/nerves_system_bbb-2.30.2/staging/usr/include/gnu/stubs.h:7:11: fatal error: gnu/stubs-soft.h: No such file or directory732    7 | # include <gnu/stubs-soft.h>733      |           ^~~~~~~~~~~~~~~~~~734compilation terminated.735In file included from /home/nerves/.nerves/artifacts/nerves_system_bbb-2.30.2/staging/usr/include/features.h:564,736                 from /home/nerves/.nerves/artifacts/nerves_system_bbb-2.30.2/staging/usr/include/sys/types.h:25,737                 from /usr/local/lib/erlang/erts-17.1/include/erl_drv_nif.h:161,738                 from /usr/local/lib/erlang/erts-17.1/include/erl_nif.h:33,739                 from c_src/func_cdl_long_line.c:2:740/home/nerves/.nerves/artifacts/nerves_system_bbb-2.30.2/staging/usr/include/gnu/stubs.h:7:11: fatal error: gnu/stubs-soft.h: No such file or directory741    7 | # include <gnu/stubs-soft.h>742      |           ^~~~~~~~~~~~~~~~~~743compilation terminated.744In file included from /home/nerves/.nerves/artifacts/nerves_system_bbb-2.30.2/staging/usr/include/features.h:564,745                 from /home/nerves/.nerves/artifacts/nerves_system_bbb-2.30.2/staging/usr/include/sys/types.h:25,746                 from /usr/local/lib/erlang/erts-17.1/include/erl_drv_nif.h:161,747                 from /usr/local/lib/erlang/erts-17.1/include/erl_nif.h:33,748                 from c_src/func_cdl_marubozu.c:2:749/home/nerves/.nerves/artifacts/nerves_system_bbb-2.30.2/staging/usr/include/gnu/stubs.h:7:11: fatal error: gnu/stubs-soft.h: No such file or directory750    7 | # include <gnu/stubs-soft.h>751      |           ^~~~~~~~~~~~~~~~~~752compilation terminated.753In file included from /home/nerves/.nerves/artifacts/nerves_system_bbb-2.30.2/staging/usr/include/features.h:564,754                 from /home/nerves/.nerves/artifacts/nerves_system_bbb-2.30.2/staging/usr/include/sys/types.h:25,755                 from /usr/local/lib/erlang/erts-17.1/include/erl_drv_nif.h:161,756                 from /usr/local/lib/erlang/erts-17.1/include/erl_nif.h:33,757                 from c_src/func_cdl_mat_hold.c:2:758/home/nerves/.nerves/artifacts/nerves_system_bbb-2.30.2/staging/usr/include/gnu/stubs.h:7:11: fatal error: gnu/stubs-soft.h: No such file or directory759    7 | # include <gnu/stubs-soft.h>760      |           ^~~~~~~~~~~~~~~~~~761compilation terminated.762In file included from /home/nerves/.nerves/artifacts/nerves_system_bbb-2.30.2/staging/usr/include/features.h:564,763                 from /home/nerves/.nerves/artifacts/nerves_system_bbb-2.30.2/staging/usr/include/sys/types.h:25,764                 from /usr/local/lib/erlang/erts-17.1/include/erl_drv_nif.h:161,765                 from /usr/local/lib/erlang/erts-17.1/include/erl_nif.h:33,766                 from c_src/func_cdl_matching_low.c:2:767/home/nerves/.nerves/artifacts/nerves_system_bbb-2.30.2/staging/usr/include/gnu/stubs.h:7:11: fatal error: gnu/stubs-soft.h: No such file or directory768    7 | # include <gnu/stubs-soft.h>769      |           ^~~~~~~~~~~~~~~~~~770compilation terminated.771In file included from /home/nerves/.nerves/artifacts/nerves_system_bbb-2.30.2/staging/usr/include/features.h:564,772                 from /home/nerves/.nerves/artifacts/nerves_system_bbb-2.30.2/staging/usr/include/sys/types.h:25,773                 from /usr/local/lib/erlang/erts-17.1/include/erl_drv_nif.h:161,774                 from /usr/local/lib/erlang/erts-17.1/include/erl_nif.h:33,775                 from c_src/func_cdl_morning_doji_star.c:2:776/home/nerves/.nerves/artifacts/nerves_system_bbb-2.30.2/staging/usr/include/gnu/stubs.h:7:11: fatal error: gnu/stubs-soft.h: No such file or directory777    7 | # include <gnu/stubs-soft.h>778      |           ^~~~~~~~~~~~~~~~~~779compilation terminated.780In file included from /home/nerves/.nerves/artifacts/nerves_system_bbb-2.30.2/staging/usr/include/features.h:564,781                 from /home/nerves/.nerves/artifacts/nerves_system_bbb-2.30.2/staging/usr/include/sys/types.h:25,782                 from /usr/local/lib/erlang/erts-17.1/include/erl_drv_nif.h:161,783                 from /usr/local/lib/erlang/erts-17.1/include/erl_nif.h:33,784                 from c_src/func_cdl_morning_star.c:2:785/home/nerves/.nerves/artifacts/nerves_system_bbb-2.30.2/staging/usr/include/gnu/stubs.h:7:11: fatal error: gnu/stubs-soft.h: No such file or directory786    7 | # include <gnu/stubs-soft.h>787      |           ^~~~~~~~~~~~~~~~~~788compilation terminated.789In file included from /home/nerves/.nerves/artifacts/nerves_system_bbb-2.30.2/staging/usr/include/features.h:564,790                 from /home/nerves/.nerves/artifacts/nerves_system_bbb-2.30.2/staging/usr/include/sys/types.h:25,791                 from /usr/local/lib/erlang/erts-17.1/include/erl_drv_nif.h:161,792                 from /usr/local/lib/erlang/erts-17.1/include/erl_nif.h:33,793                 from c_src/func_cdl_on_neck.c:2:794/home/nerves/.nerves/artifacts/nerves_system_bbb-2.30.2/staging/usr/include/gnu/stubs.h:7:11: fatal error: gnu/stubs-soft.h: No such file or directory795    7 | # include <gnu/stubs-soft.h>796      |           ^~~~~~~~~~~~~~~~~~797compilation terminated.798In file included from /home/nerves/.nerves/artifacts/nerves_system_bbb-2.30.2/staging/usr/include/features.h:564,799                 from /home/nerves/.nerves/artifacts/nerves_system_bbb-2.30.2/staging/usr/include/sys/types.h:25,800                 from /usr/local/lib/erlang/erts-17.1/include/erl_drv_nif.h:161,801                 from /usr/local/lib/erlang/erts-17.1/include/erl_nif.h:33,802                 from c_src/func_cdl_piercing.c:2:803/home/nerves/.nerves/artifacts/nerves_system_bbb-2.30.2/staging/usr/include/gnu/stubs.h:7:11: fatal error: gnu/stubs-soft.h: No such file or directory804    7 | # include <gnu/stubs-soft.h>805      |           ^~~~~~~~~~~~~~~~~~806compilation terminated.807In file included from /home/nerves/.nerves/artifacts/nerves_system_bbb-2.30.2/staging/usr/include/features.h:564,808                 from /home/nerves/.nerves/artifacts/nerves_system_bbb-2.30.2/staging/usr/include/sys/types.h:25,809                 from /usr/local/lib/erlang/erts-17.1/include/erl_drv_nif.h:161,810                 from /usr/local/lib/erlang/erts-17.1/include/erl_nif.h:33,811                 from c_src/func_cdl_rickshaw_man.c:2:812/home/nerves/.nerves/artifacts/nerves_system_bbb-2.30.2/staging/usr/include/gnu/stubs.h:7:11: fatal error: gnu/stubs-soft.h: No such file or directory813    7 | # include <gnu/stubs-soft.h>814      |           ^~~~~~~~~~~~~~~~~~815compilation terminated.816In file included from /home/nerves/.nerves/artifacts/nerves_system_bbb-2.30.2/staging/usr/include/features.h:564,817                 from /home/nerves/.nerves/artifacts/nerves_system_bbb-2.30.2/staging/usr/include/sys/types.h:25,818                 from /usr/local/lib/erlang/erts-17.1/include/erl_drv_nif.h:161,819                 from /usr/local/lib/erlang/erts-17.1/include/erl_nif.h:33,820                 from c_src/func_cdl_rise_fall_3_methods.c:2:821/home/nerves/.nerves/artifacts/nerves_system_bbb-2.30.2/staging/usr/include/gnu/stubs.h:7:11: fatal error: gnu/stubs-soft.h: No such file or directory822    7 | # include <gnu/stubs-soft.h>823      |           ^~~~~~~~~~~~~~~~~~824compilation terminated.825In file included from /home/nerves/.nerves/artifacts/nerves_system_bbb-2.30.2/staging/usr/include/features.h:564,826                 from /home/nerves/.nerves/artifacts/nerves_system_bbb-2.30.2/staging/usr/include/sys/types.h:25,827                 from /usr/local/lib/erlang/erts-17.1/include/erl_drv_nif.h:161,828                 from /usr/local/lib/erlang/erts-17.1/include/erl_nif.h:33,829                 from c_src/func_cdl_separating_lines.c:2:830/home/nerves/.nerves/artifacts/nerves_system_bbb-2.30.2/staging/usr/include/gnu/stubs.h:7:11: fatal error: gnu/stubs-soft.h: No such file or directory831    7 | # include <gnu/stubs-soft.h>832      |           ^~~~~~~~~~~~~~~~~~833compilation terminated.834In file included from /home/nerves/.nerves/artifacts/nerves_system_bbb-2.30.2/staging/usr/include/features.h:564,835                 from /home/nerves/.nerves/artifacts/nerves_system_bbb-2.30.2/staging/usr/include/sys/types.h:25,836                 from /usr/local/lib/erlang/erts-17.1/include/erl_drv_nif.h:161,837                 from /usr/local/lib/erlang/erts-17.1/include/erl_nif.h:33,838                 from c_src/func_cdl_shooting_star.c:2:839/home/nerves/.nerves/artifacts/nerves_system_bbb-2.30.2/staging/usr/include/gnu/stubs.h:7:11: fatal error: gnu/stubs-soft.h: No such file or directory840    7 | # include <gnu/stubs-soft.h>841      |           ^~~~~~~~~~~~~~~~~~842compilation terminated.843In file included from /home/nerves/.nerves/artifacts/nerves_system_bbb-2.30.2/staging/usr/include/features.h:564,844                 from /home/nerves/.nerves/artifacts/nerves_system_bbb-2.30.2/staging/usr/include/sys/types.h:25,845                 from /usr/local/lib/erlang/erts-17.1/include/erl_drv_nif.h:161,846                 from /usr/local/lib/erlang/erts-17.1/include/erl_nif.h:33,847                 from c_src/func_cdl_short_line.c:2:848/home/nerves/.nerves/artifacts/nerves_system_bbb-2.30.2/staging/usr/include/gnu/stubs.h:7:11: fatal error: gnu/stubs-soft.h: No such file or directory849    7 | # include <gnu/stubs-soft.h>850      |           ^~~~~~~~~~~~~~~~~~851compilation terminated.852In file included from /home/nerves/.nerves/artifacts/nerves_system_bbb-2.30.2/staging/usr/include/features.h:564,853                 from /home/nerves/.nerves/artifacts/nerves_system_bbb-2.30.2/staging/usr/include/sys/types.h:25,854                 from /usr/local/lib/erlang/erts-17.1/include/erl_drv_nif.h:161,855                 from /usr/local/lib/erlang/erts-17.1/include/erl_nif.h:33,856                 from c_src/func_cdl_spinning_top.c:2:857/home/nerves/.nerves/artifacts/nerves_system_bbb-2.30.2/staging/usr/include/gnu/stubs.h:7:11: fatal error: gnu/stubs-soft.h: No such file or directory858    7 | # include <gnu/stubs-soft.h>859      |           ^~~~~~~~~~~~~~~~~~860compilation terminated.861In file included from /home/nerves/.nerves/artifacts/nerves_system_bbb-2.30.2/staging/usr/include/features.h:564,862                 from /home/nerves/.nerves/artifacts/nerves_system_bbb-2.30.2/staging/usr/include/sys/types.h:25,863                 from /usr/local/lib/erlang/erts-17.1/include/erl_drv_nif.h:161,864                 from /usr/local/lib/erlang/erts-17.1/include/erl_nif.h:33,865                 from c_src/func_cdl_stalled_pattern.c:2:866/home/nerves/.nerves/artifacts/nerves_system_bbb-2.30.2/staging/usr/include/gnu/stubs.h:7:11: fatal error: gnu/stubs-soft.h: No such file or directory867    7 | # include <gnu/stubs-soft.h>868      |           ^~~~~~~~~~~~~~~~~~869compilation terminated.870In file included from /home/nerves/.nerves/artifacts/nerves_system_bbb-2.30.2/staging/usr/include/features.h:564,871                 from /home/nerves/.nerves/artifacts/nerves_system_bbb-2.30.2/staging/usr/include/sys/types.h:25,872                 from /usr/local/lib/erlang/erts-17.1/include/erl_drv_nif.h:161,873                 from /usr/local/lib/erlang/erts-17.1/include/erl_nif.h:33,874                 from c_src/func_cdl_stick_sandwich.c:2:875/home/nerves/.nerves/artifacts/nerves_system_bbb-2.30.2/staging/usr/include/gnu/stubs.h:7:11: fatal error: gnu/stubs-soft.h: No such file or directory876    7 | # include <gnu/stubs-soft.h>877      |           ^~~~~~~~~~~~~~~~~~878compilation terminated.879In file included from /home/nerves/.nerves/artifacts/nerves_system_bbb-2.30.2/staging/usr/include/features.h:564,880                 from /home/nerves/.nerves/artifacts/nerves_system_bbb-2.30.2/staging/usr/include/sys/types.h:25,881                 from /usr/local/lib/erlang/erts-17.1/include/erl_drv_nif.h:161,882                 from /usr/local/lib/erlang/erts-17.1/include/erl_nif.h:33,883                 from c_src/func_cdl_takuri.c:2:884/home/nerves/.nerves/artifacts/nerves_system_bbb-2.30.2/staging/usr/include/gnu/stubs.h:7:11: fatal error: gnu/stubs-soft.h: No such file or directory885    7 | # include <gnu/stubs-soft.h>886      |           ^~~~~~~~~~~~~~~~~~887compilation terminated.888In file included from /home/nerves/.nerves/artifacts/nerves_system_bbb-2.30.2/staging/usr/include/features.h:564,889                 from /home/nerves/.nerves/artifacts/nerves_system_bbb-2.30.2/staging/usr/include/sys/types.h:25,890                 from /usr/local/lib/erlang/erts-17.1/include/erl_drv_nif.h:161,891                 from /usr/local/lib/erlang/erts-17.1/include/erl_nif.h:33,892                 from c_src/func_cdl_tasuki_gap.c:2:893/home/nerves/.nerves/artifacts/nerves_system_bbb-2.30.2/staging/usr/include/gnu/stubs.h:7:11: fatal error: gnu/stubs-soft.h: No such file or directory894    7 | # include <gnu/stubs-soft.h>895      |           ^~~~~~~~~~~~~~~~~~896compilation terminated.897In file included from /home/nerves/.nerves/artifacts/nerves_system_bbb-2.30.2/staging/usr/include/features.h:564,898                 from /home/nerves/.nerves/artifacts/nerves_system_bbb-2.30.2/staging/usr/include/sys/types.h:25,899                 from /usr/local/lib/erlang/erts-17.1/include/erl_drv_nif.h:161,900                 from /usr/local/lib/erlang/erts-17.1/include/erl_nif.h:33,901                 from c_src/func_cdl_thrusting.c:2:902/home/nerves/.nerves/artifacts/nerves_system_bbb-2.30.2/staging/usr/include/gnu/stubs.h:7:11: fatal error: gnu/stubs-soft.h: No such file or directory903    7 | # include <gnu/stubs-soft.h>904      |           ^~~~~~~~~~~~~~~~~~905compilation terminated.906In file included from /home/nerves/.nerves/artifacts/nerves_system_bbb-2.30.2/staging/usr/include/features.h:564,907                 from /home/nerves/.nerves/artifacts/nerves_system_bbb-2.30.2/staging/usr/include/sys/types.h:25,908                 from /usr/local/lib/erlang/erts-17.1/include/erl_drv_nif.h:161,909                 from /usr/local/lib/erlang/erts-17.1/include/erl_nif.h:33,910                 from c_src/func_cdl_tri_star.c:2:911/home/nerves/.nerves/artifacts/nerves_system_bbb-2.30.2/staging/usr/include/gnu/stubs.h:7:11: fatal error: gnu/stubs-soft.h: No such file or directory912    7 | # include <gnu/stubs-soft.h>913      |           ^~~~~~~~~~~~~~~~~~914compilation terminated.915In file included from /home/nerves/.nerves/artifacts/nerves_system_bbb-2.30.2/staging/usr/include/features.h:564,916                 from /home/nerves/.nerves/artifacts/nerves_system_bbb-2.30.2/staging/usr/include/sys/types.h:25,917                 from /usr/local/lib/erlang/erts-17.1/include/erl_drv_nif.h:161,918                 from /usr/local/lib/erlang/erts-17.1/include/erl_nif.h:33,919                 from c_src/func_cdl_unique_3_river.c:2:920/home/nerves/.nerves/artifacts/nerves_system_bbb-2.30.2/staging/usr/include/gnu/stubs.h:7:11: fatal error: gnu/stubs-soft.h: No such file or directory921    7 | # include <gnu/stubs-soft.h>922      |           ^~~~~~~~~~~~~~~~~~923compilation terminated.924In file included from /home/nerves/.nerves/artifacts/nerves_system_bbb-2.30.2/staging/usr/include/features.h:564,925                 from /home/nerves/.nerves/artifacts/nerves_system_bbb-2.30.2/staging/usr/include/sys/types.h:25,926                 from /usr/local/lib/erlang/erts-17.1/include/erl_drv_nif.h:161,927                 from /usr/local/lib/erlang/erts-17.1/include/erl_nif.h:33,928                 from c_src/func_cdl_upside_downside_gap_3_methods.c:2:929/home/nerves/.nerves/artifacts/nerves_system_bbb-2.30.2/staging/usr/include/gnu/stubs.h:7:11: fatal error: gnu/stubs-soft.h: No such file or directory930    7 | # include <gnu/stubs-soft.h>931      |           ^~~~~~~~~~~~~~~~~~932compilation terminated.933In file included from /home/nerves/.nerves/artifacts/nerves_system_bbb-2.30.2/staging/usr/include/features.h:564,934                 from /home/nerves/.nerves/artifacts/nerves_system_bbb-2.30.2/staging/usr/include/sys/types.h:25,935                 from /usr/local/lib/erlang/erts-17.1/include/erl_drv_nif.h:161,936                 from /usr/local/lib/erlang/erts-17.1/include/erl_nif.h:33,937                 from c_src/func_cdl_upside_gap_2_crows.c:2:938/home/nerves/.nerves/artifacts/nerves_system_bbb-2.30.2/staging/usr/include/gnu/stubs.h:7:11: fatal error: gnu/stubs-soft.h: No such file or directory939    7 | # include <gnu/stubs-soft.h>940      |           ^~~~~~~~~~~~~~~~~~941compilation terminated.942In file included from /home/nerves/.nerves/artifacts/nerves_system_bbb-2.30.2/staging/usr/include/features.h:564,943                 from /home/nerves/.nerves/artifacts/nerves_system_bbb-2.30.2/staging/usr/include/sys/types.h:25,944                 from /usr/local/lib/erlang/erts-17.1/include/erl_drv_nif.h:161,945                 from /usr/local/lib/erlang/erts-17.1/include/erl_nif.h:33,946                 from c_src/func_ceil.c:2:947/home/nerves/.nerves/artifacts/nerves_system_bbb-2.30.2/staging/usr/include/gnu/stubs.h:7:11: fatal error: gnu/stubs-soft.h: No such file or directory948    7 | # include <gnu/stubs-soft.h>949      |           ^~~~~~~~~~~~~~~~~~950compilation terminated.951In file included from /home/nerves/.nerves/artifacts/nerves_system_bbb-2.30.2/staging/usr/include/features.h:564,952                 from /home/nerves/.nerves/artifacts/nerves_system_bbb-2.30.2/staging/usr/include/sys/types.h:25,953                 from /usr/local/lib/erlang/erts-17.1/include/erl_drv_nif.h:161,954                 from /usr/local/lib/erlang/erts-17.1/include/erl_nif.h:33,955                 from c_src/func_cmo.c:2:956/home/nerves/.nerves/artifacts/nerves_system_bbb-2.30.2/staging/usr/include/gnu/stubs.h:7:11: fatal error: gnu/stubs-soft.h: No such file or directory957    7 | # include <gnu/stubs-soft.h>958      |           ^~~~~~~~~~~~~~~~~~959compilation terminated.960In file included from /home/nerves/.nerves/artifacts/nerves_system_bbb-2.30.2/staging/usr/include/features.h:564,961                 from /home/nerves/.nerves/artifacts/nerves_system_bbb-2.30.2/staging/usr/include/sys/types.h:25,962                 from /usr/local/lib/erlang/erts-17.1/include/erl_drv_nif.h:161,963                 from /usr/local/lib/erlang/erts-17.1/include/erl_nif.h:33,964                 from c_src/func_correl.c:2:965/home/nerves/.nerves/artifacts/nerves_system_bbb-2.30.2/staging/usr/include/gnu/stubs.h:7:11: fatal error: gnu/stubs-soft.h: No such file or directory966    7 | # include <gnu/stubs-soft.h>967      |           ^~~~~~~~~~~~~~~~~~968compilation terminated.969In file included from /home/nerves/.nerves/artifacts/nerves_system_bbb-2.30.2/staging/usr/include/features.h:564,970                 from /home/nerves/.nerves/artifacts/nerves_system_bbb-2.30.2/staging/usr/include/sys/types.h:25,971                 from /usr/local/lib/erlang/erts-17.1/include/erl_drv_nif.h:161,972                 from /usr/local/lib/erlang/erts-17.1/include/erl_nif.h:33,973                 from c_src/func_cos.c:2:974/home/nerves/.nerves/artifacts/nerves_system_bbb-2.30.2/staging/usr/include/gnu/stubs.h:7:11: fatal error: gnu/stubs-soft.h: No such file or directory975    7 | # include <gnu/stubs-soft.h>976      |           ^~~~~~~~~~~~~~~~~~977compilation terminated.978In file included from /home/nerves/.nerves/artifacts/nerves_system_bbb-2.30.2/staging/usr/include/features.h:564,979                 from /home/nerves/.nerves/artifacts/nerves_system_bbb-2.30.2/staging/usr/include/sys/types.h:25,980                 from /usr/local/lib/erlang/erts-17.1/include/erl_drv_nif.h:161,981                 from /usr/local/lib/erlang/erts-17.1/include/erl_nif.h:33,982                 from c_src/func_cosh.c:2:983/home/nerves/.nerves/artifacts/nerves_system_bbb-2.30.2/staging/usr/include/gnu/stubs.h:7:11: fatal error: gnu/stubs-soft.h: No such file or directory984    7 | # include <gnu/stubs-soft.h>985      |           ^~~~~~~~~~~~~~~~~~986compilation terminated.987In file included from /home/nerves/.nerves/artifacts/nerves_system_bbb-2.30.2/staging/usr/include/features.h:564,988                 from /home/nerves/.nerves/artifacts/nerves_system_bbb-2.30.2/staging/usr/include/sys/types.h:25,989                 from /usr/local/lib/erlang/erts-17.1/include/erl_drv_nif.h:161,990                 from /usr/local/lib/erlang/erts-17.1/include/erl_nif.h:33,991                 from c_src/func_dema.c:2:992/home/nerves/.nerves/artifacts/nerves_system_bbb-2.30.2/staging/usr/include/gnu/stubs.h:7:11: fatal error: gnu/stubs-soft.h: No such file or directory993    7 | # include <gnu/stubs-soft.h>994      |           ^~~~~~~~~~~~~~~~~~995compilation terminated.996In file included from /home/nerves/.nerves/artifacts/nerves_system_bbb-2.30.2/staging/usr/include/features.h:564,997                 from /home/nerves/.nerves/artifacts/nerves_system_bbb-2.30.2/staging/usr/include/sys/types.h:25,998                 from /usr/local/lib/erlang/erts-17.1/include/erl_drv_nif.h:161,999                 from /usr/local/lib/erlang/erts-17.1/include/erl_nif.h:33,1000                 from c_src/func_div.c:2:1001/home/nerves/.nerves/artifacts/nerves_system_bbb-2.30.2/staging/usr/include/gnu/stubs.h:7:11: fatal error: gnu/stubs-soft.h: No such file or directory1002    7 | # include <gnu/stubs-soft.h>1003      |           ^~~~~~~~~~~~~~~~~~1004compilation terminated.1005In file included from /home/nerves/.nerves/artifacts/nerves_system_bbb-2.30.2/staging/usr/include/features.h:564,1006                 from /home/nerves/.nerves/artifacts/nerves_system_bbb-2.30.2/staging/usr/include/sys/types.h:25,1007                 from /usr/local/lib/erlang/erts-17.1/include/erl_drv_nif.h:161,1008                 from /usr/local/lib/erlang/erts-17.1/include/erl_nif.h:33,1009                 from c_src/func_dx.c:2:1010/home/nerves/.nerves/artifacts/nerves_system_bbb-2.30.2/staging/usr/include/gnu/stubs.h:7:11: fatal error: gnu/stubs-soft.h: No such file or directory1011    7 | # include <gnu/stubs-soft.h>1012      |           ^~~~~~~~~~~~~~~~~~1013compilation terminated.1014In file included from /home/nerves/.nerves/artifacts/nerves_system_bbb-2.30.2/staging/usr/include/features.h:564,1015                 from /home/nerves/.nerves/artifacts/nerves_system_bbb-2.30.2/staging/usr/include/sys/types.h:25,1016                 from /usr/local/lib/erlang/erts-17.1/include/erl_drv_nif.h:161,1017                 from /usr/local/lib/erlang/erts-17.1/include/erl_nif.h:33,1018                 from c_src/func_ema.c:2:1019/home/nerves/.nerves/artifacts/nerves_system_bbb-2.30.2/staging/usr/include/gnu/stubs.h:7:11: fatal error: gnu/stubs-soft.h: No such file or directory1020    7 | # include <gnu/stubs-soft.h>1021      |           ^~~~~~~~~~~~~~~~~~1022compilation terminated.1023In file included from /home/nerves/.nerves/artifacts/nerves_system_bbb-2.30.2/staging/usr/include/features.h:564,1024                 from /home/nerves/.nerves/artifacts/nerves_system_bbb-2.30.2/staging/usr/include/sys/types.h:25,1025                 from /usr/local/lib/erlang/erts-17.1/include/erl_drv_nif.h:161,1026                 from /usr/local/lib/erlang/erts-17.1/include/erl_nif.h:33,1027                 from c_src/func_exp.c:2:1028/home/nerves/.nerves/artifacts/nerves_system_bbb-2.30.2/staging/usr/include/gnu/stubs.h:7:11: fatal error: gnu/stubs-soft.h: No such file or directory1029    7 | # include <gnu/stubs-soft.h>1030      |           ^~~~~~~~~~~~~~~~~~1031compilation terminated.1032In file included from /home/nerves/.nerves/artifacts/nerves_system_bbb-2.30.2/staging/usr/include/features.h:564,1033                 from /home/nerves/.nerves/artifacts/nerves_system_bbb-2.30.2/staging/usr/include/sys/types.h:25,1034                 from /usr/local/lib/erlang/erts-17.1/include/erl_drv_nif.h:161,1035                 from /usr/local/lib/erlang/erts-17.1/include/erl_nif.h:33,1036                 from c_src/func_floor.c:2:1037/home/nerves/.nerves/artifacts/nerves_system_bbb-2.30.2/staging/usr/include/gnu/stubs.h:7:11: fatal error: gnu/stubs-soft.h: No such file or directory1038    7 | # include <gnu/stubs-soft.h>1039      |           ^~~~~~~~~~~~~~~~~~1040compilation terminated.1041In file included from /home/nerves/.nerves/artifacts/nerves_system_bbb-2.30.2/staging/usr/include/features.h:564,1042                 from /home/nerves/.nerves/artifacts/nerves_system_bbb-2.30.2/staging/usr/include/sys/types.h:25,1043                 from /usr/local/lib/erlang/erts-17.1/include/erl_drv_nif.h:161,1044                 from /usr/local/lib/erlang/erts-17.1/include/erl_nif.h:33,1045                 from c_src/func_ht_dcperiod.c:2:1046/home/nerves/.nerves/artifacts/nerves_system_bbb-2.30.2/staging/usr/include/gnu/stubs.h:7:11: fatal error: gnu/stubs-soft.h: No such file or directory1047    7 | # include <gnu/stubs-soft.h>1048      |           ^~~~~~~~~~~~~~~~~~1049compilation terminated.1050In file included from /home/nerves/.nerves/artifacts/nerves_system_bbb-2.30.2/staging/usr/include/features.h:564,1051                 from /home/nerves/.nerves/artifacts/nerves_system_bbb-2.30.2/staging/usr/include/sys/types.h:25,1052                 from /usr/local/lib/erlang/erts-17.1/include/erl_drv_nif.h:161,1053                 from /usr/local/lib/erlang/erts-17.1/include/erl_nif.h:33,1054                 from c_src/func_ht_dcphase.c:2:1055/home/nerves/.nerves/artifacts/nerves_system_bbb-2.30.2/staging/usr/include/gnu/stubs.h:7:11: fatal error: gnu/stubs-soft.h: No such file or directory1056    7 | # include <gnu/stubs-soft.h>1057      |           ^~~~~~~~~~~~~~~~~~1058compilation terminated.1059In file included from /home/nerves/.nerves/artifacts/nerves_system_bbb-2.30.2/staging/usr/include/features.h:564,1060                 from /home/nerves/.nerves/artifacts/nerves_system_bbb-2.30.2/staging/usr/include/sys/types.h:25,1061                 from /usr/local/lib/erlang/erts-17.1/include/erl_drv_nif.h:161,1062                 from /usr/local/lib/erlang/erts-17.1/include/erl_nif.h:33,1063                 from c_src/func_ht_phasor.c:2:1064/home/nerves/.nerves/artifacts/nerves_system_bbb-2.30.2/staging/usr/include/gnu/stubs.h:7:11: fatal error: gnu/stubs-soft.h: No such file or directory1065    7 | # include <gnu/stubs-soft.h>1066      |           ^~~~~~~~~~~~~~~~~~1067compilation terminated.1068In file included from /home/nerves/.nerves/artifacts/nerves_system_bbb-2.30.2/staging/usr/include/features.h:564,1069                 from /home/nerves/.nerves/artifacts/nerves_system_bbb-2.30.2/staging/usr/include/sys/types.h:25,1070                 from /usr/local/lib/erlang/erts-17.1/include/erl_drv_nif.h:161,1071                 from /usr/local/lib/erlang/erts-17.1/include/erl_nif.h:33,1072                 from c_src/func_ht_sine.c:2:1073/home/nerves/.nerves/artifacts/nerves_system_bbb-2.30.2/staging/usr/include/gnu/stubs.h:7:11: fatal error: gnu/stubs-soft.h: No such file or directory1074    7 | # include <gnu/stubs-soft.h>1075      |           ^~~~~~~~~~~~~~~~~~1076compilation terminated.1077In file included from /home/nerves/.nerves/artifacts/nerves_system_bbb-2.30.2/staging/usr/include/features.h:564,1078                 from /home/nerves/.nerves/artifacts/nerves_system_bbb-2.30.2/staging/usr/include/sys/types.h:25,1079                 from /usr/local/lib/erlang/erts-17.1/include/erl_drv_nif.h:161,1080                 from /usr/local/lib/erlang/erts-17.1/include/erl_nif.h:33,1081                 from c_src/func_ht_trendline.c:2:1082/home/nerves/.nerves/artifacts/nerves_system_bbb-2.30.2/staging/usr/include/gnu/stubs.h:7:11: fatal error: gnu/stubs-soft.h: No such file or directory1083    7 | # include <gnu/stubs-soft.h>1084      |           ^~~~~~~~~~~~~~~~~~1085compilation terminated.1086In file included from /home/nerves/.nerves/artifacts/nerves_system_bbb-2.30.2/staging/usr/include/features.h:564,1087                 from /home/nerves/.nerves/artifacts/nerves_system_bbb-2.30.2/staging/usr/include/sys/types.h:25,1088                 from /usr/local/lib/erlang/erts-17.1/include/erl_drv_nif.h:161,1089                 from /usr/local/lib/erlang/erts-17.1/include/erl_nif.h:33,1090                 from c_src/func_ht_trendmode.c:2:1091/home/nerves/.nerves/artifacts/nerves_system_bbb-2.30.2/staging/usr/include/gnu/stubs.h:7:11: fatal error: gnu/stubs-soft.h: No such file or directory1092    7 | # include <gnu/stubs-soft.h>1093      |           ^~~~~~~~~~~~~~~~~~1094compilation terminated.1095In file included from /home/nerves/.nerves/artifacts/nerves_system_bbb-2.30.2/staging/usr/include/features.h:564,1096                 from /home/nerves/.nerves/artifacts/nerves_system_bbb-2.30.2/staging/usr/include/sys/types.h:25,1097                 from /usr/local/lib/erlang/erts-17.1/include/erl_drv_nif.h:161,1098                 from /usr/local/lib/erlang/erts-17.1/include/erl_nif.h:33,1099                 from c_src/func_kama.c:2:1100/home/nerves/.nerves/artifacts/nerves_system_bbb-2.30.2/staging/usr/include/gnu/stubs.h:7:11: fatal error: gnu/stubs-soft.h: No such file or directory1101    7 | # include <gnu/stubs-soft.h>1102      |           ^~~~~~~~~~~~~~~~~~1103compilation terminated.1104In file included from /home/nerves/.nerves/artifacts/nerves_system_bbb-2.30.2/staging/usr/include/features.h:564,1105                 from /home/nerves/.nerves/artifacts/nerves_system_bbb-2.30.2/staging/usr/include/sys/types.h:25,1106                 from /usr/local/lib/erlang/erts-17.1/include/erl_drv_nif.h:161,1107                 from /usr/local/lib/erlang/erts-17.1/include/erl_nif.h:33,1108                 from c_src/func_linear_reg.c:2:1109/home/nerves/.nerves/artifacts/nerves_system_bbb-2.30.2/staging/usr/include/gnu/stubs.h:7:11: fatal error: gnu/stubs-soft.h: No such file or directory1110    7 | # include <gnu/stubs-soft.h>1111      |           ^~~~~~~~~~~~~~~~~~1112compilation terminated.1113In file included from /home/nerves/.nerves/artifacts/nerves_system_bbb-2.30.2/staging/usr/include/features.h:564,1114                 from /home/nerves/.nerves/artifacts/nerves_system_bbb-2.30.2/staging/usr/include/sys/types.h:25,1115                 from /usr/local/lib/erlang/erts-17.1/include/erl_drv_nif.h:161,1116                 from /usr/local/lib/erlang/erts-17.1/include/erl_nif.h:33,1117                 from c_src/func_linear_reg_angle.c:2:1118/home/nerves/.nerves/artifacts/nerves_system_bbb-2.30.2/staging/usr/include/gnu/stubs.h:7:11: fatal error: gnu/stubs-soft.h: No such file or directory1119    7 | # include <gnu/stubs-soft.h>1120      |           ^~~~~~~~~~~~~~~~~~1121compilation terminated.1122In file included from /home/nerves/.nerves/artifacts/nerves_system_bbb-2.30.2/staging/usr/include/features.h:564,1123                 from /home/nerves/.nerves/artifacts/nerves_system_bbb-2.30.2/staging/usr/include/sys/types.h:25,1124                 from /usr/local/lib/erlang/erts-17.1/include/erl_drv_nif.h:161,1125                 from /usr/local/lib/erlang/erts-17.1/include/erl_nif.h:33,1126                 from c_src/func_linear_reg_intercept.c:2:1127/home/nerves/.nerves/artifacts/nerves_system_bbb-2.30.2/staging/usr/include/gnu/stubs.h:7:11: fatal error: gnu/stubs-soft.h: No such file or directory1128    7 | # include <gnu/stubs-soft.h>1129      |           ^~~~~~~~~~~~~~~~~~1130compilation terminated.1131In file included from /home/nerves/.nerves/artifacts/nerves_system_bbb-2.30.2/staging/usr/include/features.h:564,1132                 from /home/nerves/.nerves/artifacts/nerves_system_bbb-2.30.2/staging/usr/include/sys/types.h:25,1133                 from /usr/local/lib/erlang/erts-17.1/include/erl_drv_nif.h:161,1134                 from /usr/local/lib/erlang/erts-17.1/include/erl_nif.h:33,1135                 from c_src/func_linear_reg_slope.c:2:1136/home/nerves/.nerves/artifacts/nerves_system_bbb-2.30.2/staging/usr/include/gnu/stubs.h:7:11: fatal error: gnu/stubs-soft.h: No such file or directory1137    7 | # include <gnu/stubs-soft.h>1138      |           ^~~~~~~~~~~~~~~~~~1139compilation terminated.1140In file included from /home/nerves/.nerves/artifacts/nerves_system_bbb-2.30.2/staging/usr/include/features.h:564,1141                 from /home/nerves/.nerves/artifacts/nerves_system_bbb-2.30.2/staging/usr/include/sys/types.h:25,1142                 from /usr/local/lib/erlang/erts-17.1/include/erl_drv_nif.h:161,1143                 from /usr/local/lib/erlang/erts-17.1/include/erl_nif.h:33,1144                 from c_src/func_ln.c:2:1145/home/nerves/.nerves/artifacts/nerves_system_bbb-2.30.2/staging/usr/include/gnu/stubs.h:7:11: fatal error: gnu/stubs-soft.h: No such file or directory1146    7 | # include <gnu/stubs-soft.h>1147      |           ^~~~~~~~~~~~~~~~~~1148compilation terminated.1149In file included from /home/nerves/.nerves/artifacts/nerves_system_bbb-2.30.2/staging/usr/include/features.h:564,1150                 from /home/nerves/.nerves/artifacts/nerves_system_bbb-2.30.2/staging/usr/include/sys/types.h:25,1151                 from /usr/local/lib/erlang/erts-17.1/include/erl_drv_nif.h:161,1152                 from /usr/local/lib/erlang/erts-17.1/include/erl_nif.h:33,1153                 from c_src/func_log10.c:2:1154/home/nerves/.nerves/artifacts/nerves_system_bbb-2.30.2/staging/usr/include/gnu/stubs.h:7:11: fatal error: gnu/stubs-soft.h: No such file or directory1155    7 | # include <gnu/stubs-soft.h>1156      |           ^~~~~~~~~~~~~~~~~~1157compilation terminated.1158In file included from /home/nerves/.nerves/artifacts/nerves_system_bbb-2.30.2/staging/usr/include/features.h:564,1159                 from /home/nerves/.nerves/artifacts/nerves_system_bbb-2.30.2/staging/usr/include/sys/types.h:25,1160                 from /usr/local/lib/erlang/erts-17.1/include/erl_drv_nif.h:161,1161                 from /usr/local/lib/erlang/erts-17.1/include/erl_nif.h:33,1162                 from c_src/func_ma.c:2:1163/home/nerves/.nerves/artifacts/nerves_system_bbb-2.30.2/staging/usr/include/gnu/stubs.h:7:11: fatal error: gnu/stubs-soft.h: No such file or directory1164    7 | # include <gnu/stubs-soft.h>1165      |           ^~~~~~~~~~~~~~~~~~1166compilation terminated.1167In file included from /home/nerves/.nerves/artifacts/nerves_system_bbb-2.30.2/staging/usr/include/features.h:564,1168                 from /home/nerves/.nerves/artifacts/nerves_system_bbb-2.30.2/staging/usr/include/sys/types.h:25,1169                 from /usr/local/lib/erlang/erts-17.1/include/erl_drv_nif.h:161,1170                 from /usr/local/lib/erlang/erts-17.1/include/erl_nif.h:33,1171                 from c_src/func_macd.c:2:1172/home/nerves/.nerves/artifacts/nerves_system_bbb-2.30.2/staging/usr/include/gnu/stubs.h:7:11: fatal error: gnu/stubs-soft.h: No such file or directory1173    7 | # include <gnu/stubs-soft.h>1174      |           ^~~~~~~~~~~~~~~~~~1175compilation terminated.1176In file included from /home/nerves/.nerves/artifacts/nerves_system_bbb-2.30.2/staging/usr/include/features.h:564,1177                 from /home/nerves/.nerves/artifacts/nerves_system_bbb-2.30.2/staging/usr/include/sys/types.h:25,1178                 from /usr/local/lib/erlang/erts-17.1/include/erl_drv_nif.h:161,1179                 from /usr/local/lib/erlang/erts-17.1/include/erl_nif.h:33,1180                 from c_src/func_macdext.c:2:1181/home/nerves/.nerves/artifacts/nerves_system_bbb-2.30.2/staging/usr/include/gnu/stubs.h:7:11: fatal error: gnu/stubs-soft.h: No such file or directory1182    7 | # include <gnu/stubs-soft.h>1183      |           ^~~~~~~~~~~~~~~~~~1184compilation terminated.1185In file included from /home/nerves/.nerves/artifacts/nerves_system_bbb-2.30.2/staging/usr/include/features.h:564,1186                 from /home/nerves/.nerves/artifacts/nerves_system_bbb-2.30.2/staging/usr/include/sys/types.h:25,1187                 from /usr/local/lib/erlang/erts-17.1/include/erl_drv_nif.h:161,1188                 from /usr/local/lib/erlang/erts-17.1/include/erl_nif.h:33,1189                 from c_src/func_macdfix.c:2:1190/home/nerves/.nerves/artifacts/nerves_system_bbb-2.30.2/staging/usr/include/gnu/stubs.h:7:11: fatal error: gnu/stubs-soft.h: No such file or directory1191    7 | # include <gnu/stubs-soft.h>1192      |           ^~~~~~~~~~~~~~~~~~1193compilation terminated.1194In file included from /home/nerves/.nerves/artifacts/nerves_system_bbb-2.30.2/staging/usr/include/features.h:564,1195                 from /home/nerves/.nerves/artifacts/nerves_system_bbb-2.30.2/staging/usr/include/sys/types.h:25,1196                 from /usr/local/lib/erlang/erts-17.1/include/erl_drv_nif.h:161,1197                 from /usr/local/lib/erlang/erts-17.1/include/erl_nif.h:33,1198                 from c_src/func_mama.c:2:1199/home/nerves/.nerves/artifacts/nerves_system_bbb-2.30.2/staging/usr/include/gnu/stubs.h:7:11: fatal error: gnu/stubs-soft.h: No such file or directory1200    7 | # include <gnu/stubs-soft.h>1201      |           ^~~~~~~~~~~~~~~~~~1202compilation terminated.1203In file included from /home/nerves/.nerves/artifacts/nerves_system_bbb-2.30.2/staging/usr/include/features.h:564,1204                 from /home/nerves/.nerves/artifacts/nerves_system_bbb-2.30.2/staging/usr/include/sys/types.h:25,1205                 from /usr/local/lib/erlang/erts-17.1/include/erl_drv_nif.h:161,1206                 from /usr/local/lib/erlang/erts-17.1/include/erl_nif.h:33,1207                 from c_src/func_mavp.c:2:1208/home/nerves/.nerves/artifacts/nerves_system_bbb-2.30.2/staging/usr/include/gnu/stubs.h:7:11: fatal error: gnu/stubs-soft.h: No such file or directory1209    7 | # include <gnu/stubs-soft.h>1210      |           ^~~~~~~~~~~~~~~~~~1211compilation terminated.1212In file included from /home/nerves/.nerves/artifacts/nerves_system_bbb-2.30.2/staging/usr/include/features.h:564,1213                 from /home/nerves/.nerves/artifacts/nerves_system_bbb-2.30.2/staging/usr/include/sys/types.h:25,1214                 from /usr/local/lib/erlang/erts-17.1/include/erl_drv_nif.h:161,1215                 from /usr/local/lib/erlang/erts-17.1/include/erl_nif.h:33,1216                 from c_src/func_max.c:2:1217/home/nerves/.nerves/artifacts/nerves_system_bbb-2.30.2/staging/usr/include/gnu/stubs.h:7:11: fatal error: gnu/stubs-soft.h: No such file or directory1218    7 | # include <gnu/stubs-soft.h>1219      |           ^~~~~~~~~~~~~~~~~~1220compilation terminated.1221In file included from /home/nerves/.nerves/artifacts/nerves_system_bbb-2.30.2/staging/usr/include/features.h:564,1222                 from /home/nerves/.nerves/artifacts/nerves_system_bbb-2.30.2/staging/usr/include/sys/types.h:25,1223                 from /usr/local/lib/erlang/erts-17.1/include/erl_drv_nif.h:161,1224                 from /usr/local/lib/erlang/erts-17.1/include/erl_nif.h:33,1225                 from c_src/func_max_index.c:2:1226/home/nerves/.nerves/artifacts/nerves_system_bbb-2.30.2/staging/usr/include/gnu/stubs.h:7:11: fatal error: gnu/stubs-soft.h: No such file or directory1227    7 | # include <gnu/stubs-soft.h>1228      |           ^~~~~~~~~~~~~~~~~~1229compilation terminated.1230In file included from /home/nerves/.nerves/artifacts/nerves_system_bbb-2.30.2/staging/usr/include/features.h:564,1231                 from /home/nerves/.nerves/artifacts/nerves_system_bbb-2.30.2/staging/usr/include/sys/types.h:25,1232                 from /usr/local/lib/erlang/erts-17.1/include/erl_drv_nif.h:161,1233                 from /usr/local/lib/erlang/erts-17.1/include/erl_nif.h:33,1234                 from c_src/func_med_price.c:2:1235/home/nerves/.nerves/artifacts/nerves_system_bbb-2.30.2/staging/usr/include/gnu/stubs.h:7:11: fatal error: gnu/stubs-soft.h: No such file or directory1236    7 | # include <gnu/stubs-soft.h>1237      |           ^~~~~~~~~~~~~~~~~~1238compilation terminated.1239In file included from /home/nerves/.nerves/artifacts/nerves_system_bbb-2.30.2/staging/usr/include/features.h:564,1240                 from /home/nerves/.nerves/artifacts/nerves_system_bbb-2.30.2/staging/usr/include/sys/types.h:25,1241                 from /usr/local/lib/erlang/erts-17.1/include/erl_drv_nif.h:161,1242                 from /usr/local/lib/erlang/erts-17.1/include/erl_nif.h:33,1243                 from c_src/func_mfi.c:2:1244/home/nerves/.nerves/artifacts/nerves_system_bbb-2.30.2/staging/usr/include/gnu/stubs.h:7:11: fatal error: gnu/stubs-soft.h: No such file or directory1245    7 | # include <gnu/stubs-soft.h>1246      |           ^~~~~~~~~~~~~~~~~~1247compilation terminated.1248In file included from /home/nerves/.nerves/artifacts/nerves_system_bbb-2.30.2/staging/usr/include/features.h:564,1249                 from /home/nerves/.nerves/artifacts/nerves_system_bbb-2.30.2/staging/usr/include/sys/types.h:25,1250                 from /usr/local/lib/erlang/erts-17.1/include/erl_drv_nif.h:161,1251                 from /usr/local/lib/erlang/erts-17.1/include/erl_nif.h:33,1252                 from c_src/func_mid_point.c:2:1253/home/nerves/.nerves/artifacts/nerves_system_bbb-2.30.2/staging/usr/include/gnu/stubs.h:7:11: fatal error: gnu/stubs-soft.h: No such file or directory1254    7 | # include <gnu/stubs-soft.h>1255      |           ^~~~~~~~~~~~~~~~~~1256compilation terminated.1257In file included from /home/nerves/.nerves/artifacts/nerves_system_bbb-2.30.2/staging/usr/include/features.h:564,1258                 from /home/nerves/.nerves/artifacts/nerves_system_bbb-2.30.2/staging/usr/include/sys/types.h:25,1259                 from /usr/local/lib/erlang/erts-17.1/include/erl_drv_nif.h:161,1260                 from /usr/local/lib/erlang/erts-17.1/include/erl_nif.h:33,1261                 from c_src/func_mid_price.c:2:1262/home/nerves/.nerves/artifacts/nerves_system_bbb-2.30.2/staging/usr/include/gnu/stubs.h:7:11: fatal error: gnu/stubs-soft.h: No such file or directory1263    7 | # include <gnu/stubs-soft.h>1264      |           ^~~~~~~~~~~~~~~~~~1265compilation terminated.1266In file included from /home/nerves/.nerves/artifacts/nerves_system_bbb-2.30.2/staging/usr/include/features.h:564,1267                 from /home/nerves/.nerves/artifacts/nerves_system_bbb-2.30.2/staging/usr/include/sys/types.h:25,1268                 from /usr/local/lib/erlang/erts-17.1/include/erl_drv_nif.h:161,1269                 from /usr/local/lib/erlang/erts-17.1/include/erl_nif.h:33,1270                 from c_src/func_min.c:2:1271/home/nerves/.nerves/artifacts/nerves_system_bbb-2.30.2/staging/usr/include/gnu/stubs.h:7:11: fatal error: gnu/stubs-soft.h: No such file or directory1272    7 | # include <gnu/stubs-soft.h>1273      |           ^~~~~~~~~~~~~~~~~~1274compilation terminated.1275In file included from /home/nerves/.nerves/artifacts/nerves_system_bbb-2.30.2/staging/usr/include/features.h:564,1276                 from /home/nerves/.nerves/artifacts/nerves_system_bbb-2.30.2/staging/usr/include/sys/types.h:25,1277                 from /usr/local/lib/erlang/erts-17.1/include/erl_drv_nif.h:161,1278                 from /usr/local/lib/erlang/erts-17.1/include/erl_nif.h:33,1279                 from c_src/func_min_index.c:2:1280/home/nerves/.nerves/artifacts/nerves_system_bbb-2.30.2/staging/usr/include/gnu/stubs.h:7:11: fatal error: gnu/stubs-soft.h: No such file or directory1281    7 | # include <gnu/stubs-soft.h>1282      |           ^~~~~~~~~~~~~~~~~~1283compilation terminated.1284In file included from /home/nerves/.nerves/artifacts/nerves_system_bbb-2.30.2/staging/usr/include/features.h:564,1285                 from /home/nerves/.nerves/artifacts/nerves_system_bbb-2.30.2/staging/usr/include/sys/types.h:25,1286                 from /usr/local/lib/erlang/erts-17.1/include/erl_drv_nif.h:161,1287                 from /usr/local/lib/erlang/erts-17.1/include/erl_nif.h:33,1288                 from c_src/func_min_max.c:2:1289/home/nerves/.nerves/artifacts/nerves_system_bbb-2.30.2/staging/usr/include/gnu/stubs.h:7:11: fatal error: gnu/stubs-soft.h: No such file or directory1290    7 | # include <gnu/stubs-soft.h>1291      |           ^~~~~~~~~~~~~~~~~~1292compilation terminated.1293In file included from /home/nerves/.nerves/artifacts/nerves_system_bbb-2.30.2/staging/usr/include/features.h:564,1294                 from /home/nerves/.nerves/artifacts/nerves_system_bbb-2.30.2/staging/usr/include/sys/types.h:25,1295                 from /usr/local/lib/erlang/erts-17.1/include/erl_drv_nif.h:161,1296                 from /usr/local/lib/erlang/erts-17.1/include/erl_nif.h:33,1297                 from c_src/func_min_max_index.c:2:1298/home/nerves/.nerves/artifacts/nerves_system_bbb-2.30.2/staging/usr/include/gnu/stubs.h:7:11: fatal error: gnu/stubs-soft.h: No such file or directory1299    7 | # include <gnu/stubs-soft.h>1300      |           ^~~~~~~~~~~~~~~~~~1301compilation terminated.1302In file included from /home/nerves/.nerves/artifacts/nerves_system_bbb-2.30.2/staging/usr/include/features.h:564,1303                 from /home/nerves/.nerves/artifacts/nerves_system_bbb-2.30.2/staging/usr/include/sys/types.h:25,1304                 from /usr/local/lib/erlang/erts-17.1/include/erl_drv_nif.h:161,1305                 from /usr/local/lib/erlang/erts-17.1/include/erl_nif.h:33,1306                 from c_src/func_minus_di.c:2:1307/home/nerves/.nerves/artifacts/nerves_system_bbb-2.30.2/staging/usr/include/gnu/stubs.h:7:11: fatal error: gnu/stubs-soft.h: No such file or directory1308    7 | # include <gnu/stubs-soft.h>1309      |           ^~~~~~~~~~~~~~~~~~1310compilation terminated.1311In file included from /home/nerves/.nerves/artifacts/nerves_system_bbb-2.30.2/staging/usr/include/features.h:564,1312                 from /home/nerves/.nerves/artifacts/nerves_system_bbb-2.30.2/staging/usr/include/sys/types.h:25,1313                 from /usr/local/lib/erlang/erts-17.1/include/erl_drv_nif.h:161,1314                 from /usr/local/lib/erlang/erts-17.1/include/erl_nif.h:33,1315                 from c_src/func_minus_dm.c:2:1316/home/nerves/.nerves/artifacts/nerves_system_bbb-2.30.2/staging/usr/include/gnu/stubs.h:7:11: fatal error: gnu/stubs-soft.h: No such file or directory1317    7 | # include <gnu/stubs-soft.h>1318      |           ^~~~~~~~~~~~~~~~~~1319compilation terminated.1320In file included from /home/nerves/.nerves/artifacts/nerves_system_bbb-2.30.2/staging/usr/include/features.h:564,1321                 from /home/nerves/.nerves/artifacts/nerves_system_bbb-2.30.2/staging/usr/include/sys/types.h:25,1322                 from /usr/local/lib/erlang/erts-17.1/include/erl_drv_nif.h:161,1323                 from /usr/local/lib/erlang/erts-17.1/include/erl_nif.h:33,1324                 from c_src/func_mom.c:2:1325/home/nerves/.nerves/artifacts/nerves_system_bbb-2.30.2/staging/usr/include/gnu/stubs.h:7:11: fatal error: gnu/stubs-soft.h: No such file or directory1326    7 | # include <gnu/stubs-soft.h>1327      |           ^~~~~~~~~~~~~~~~~~1328compilation terminated.1329In file included from /home/nerves/.nerves/artifacts/nerves_system_bbb-2.30.2/staging/usr/include/features.h:564,1330                 from /home/nerves/.nerves/artifacts/nerves_system_bbb-2.30.2/staging/usr/include/sys/types.h:25,1331                 from /usr/local/lib/erlang/erts-17.1/include/erl_drv_nif.h:161,1332                 from /usr/local/lib/erlang/erts-17.1/include/erl_nif.h:33,1333                 from c_src/func_mult.c:2:1334/home/nerves/.nerves/artifacts/nerves_system_bbb-2.30.2/staging/usr/include/gnu/stubs.h:7:11: fatal error: gnu/stubs-soft.h: No such file or directory1335    7 | # include <gnu/stubs-soft.h>1336      |           ^~~~~~~~~~~~~~~~~~1337compilation terminated.1338In file included from /home/nerves/.nerves/artifacts/nerves_system_bbb-2.30.2/staging/usr/include/features.h:564,1339                 from /home/nerves/.nerves/artifacts/nerves_system_bbb-2.30.2/staging/usr/include/sys/types.h:25,1340                 from /usr/local/lib/erlang/erts-17.1/include/erl_drv_nif.h:161,1341                 from /usr/local/lib/erlang/erts-17.1/include/erl_nif.h:33,1342                 from c_src/func_natr.c:2:1343/home/nerves/.nerves/artifacts/nerves_system_bbb-2.30.2/staging/usr/include/gnu/stubs.h:7:11: fatal error: gnu/stubs-soft.h: No such file or directory1344    7 | # include <gnu/stubs-soft.h>1345      |           ^~~~~~~~~~~~~~~~~~1346compilation terminated.1347In file included from /home/nerves/.nerves/artifacts/nerves_system_bbb-2.30.2/staging/usr/include/features.h:564,1348                 from /home/nerves/.nerves/artifacts/nerves_system_bbb-2.30.2/staging/usr/include/sys/types.h:25,1349                 from /usr/local/lib/erlang/erts-17.1/include/erl_drv_nif.h:161,1350                 from /usr/local/lib/erlang/erts-17.1/include/erl_nif.h:33,1351                 from c_src/func_obv.c:2:1352/home/nerves/.nerves/artifacts/nerves_system_bbb-2.30.2/staging/usr/include/gnu/stubs.h:7:11: fatal error: gnu/stubs-soft.h: No such file or directory1353    7 | # include <gnu/stubs-soft.h>1354      |           ^~~~~~~~~~~~~~~~~~1355compilation terminated.1356In file included from /home/nerves/.nerves/artifacts/nerves_system_bbb-2.30.2/staging/usr/include/features.h:564,1357                 from /home/nerves/.nerves/artifacts/nerves_system_bbb-2.30.2/staging/usr/include/sys/types.h:25,1358                 from /usr/local/lib/erlang/erts-17.1/include/erl_drv_nif.h:161,1359                 from /usr/local/lib/erlang/erts-17.1/include/erl_nif.h:33,1360                 from c_src/func_plus_di.c:2:1361/home/nerves/.nerves/artifacts/nerves_system_bbb-2.30.2/staging/usr/include/gnu/stubs.h:7:11: fatal error: gnu/stubs-soft.h: No such file or directory1362    7 | # include <gnu/stubs-soft.h>1363      |           ^~~~~~~~~~~~~~~~~~1364compilation terminated.1365In file included from /home/nerves/.nerves/artifacts/nerves_system_bbb-2.30.2/staging/usr/include/features.h:564,1366                 from /home/nerves/.nerves/artifacts/nerves_system_bbb-2.30.2/staging/usr/include/sys/types.h:25,1367                 from /usr/local/lib/erlang/erts-17.1/include/erl_drv_nif.h:161,1368                 from /usr/local/lib/erlang/erts-17.1/include/erl_nif.h:33,1369                 from c_src/func_plus_dm.c:2:1370/home/nerves/.nerves/artifacts/nerves_system_bbb-2.30.2/staging/usr/include/gnu/stubs.h:7:11: fatal error: gnu/stubs-soft.h: No such file or directory1371    7 | # include <gnu/stubs-soft.h>1372      |           ^~~~~~~~~~~~~~~~~~1373compilation terminated.1374In file included from /home/nerves/.nerves/artifacts/nerves_system_bbb-2.30.2/staging/usr/include/features.h:564,1375                 from /home/nerves/.nerves/artifacts/nerves_system_bbb-2.30.2/staging/usr/include/sys/types.h:25,1376                 from /usr/local/lib/erlang/erts-17.1/include/erl_drv_nif.h:161,1377                 from /usr/local/lib/erlang/erts-17.1/include/erl_nif.h:33,1378                 from c_src/func_ppo.c:2:1379/home/nerves/.nerves/artifacts/nerves_system_bbb-2.30.2/staging/usr/include/gnu/stubs.h:7:11: fatal error: gnu/stubs-soft.h: No such file or directory1380    7 | # include <gnu/stubs-soft.h>1381      |           ^~~~~~~~~~~~~~~~~~1382compilation terminated.1383In file included from /home/nerves/.nerves/artifacts/nerves_system_bbb-2.30.2/staging/usr/include/features.h:564,1384                 from /home/nerves/.nerves/artifacts/nerves_system_bbb-2.30.2/staging/usr/include/sys/types.h:25,1385                 from /usr/local/lib/erlang/erts-17.1/include/erl_drv_nif.h:161,1386                 from /usr/local/lib/erlang/erts-17.1/include/erl_nif.h:33,1387                 from c_src/func_roc.c:2:1388/home/nerves/.nerves/artifacts/nerves_system_bbb-2.30.2/staging/usr/include/gnu/stubs.h:7:11: fatal error: gnu/stubs-soft.h: No such file or directory1389    7 | # include <gnu/stubs-soft.h>1390      |           ^~~~~~~~~~~~~~~~~~1391compilation terminated.1392In file included from /home/nerves/.nerves/artifacts/nerves_system_bbb-2.30.2/staging/usr/include/features.h:564,1393                 from /home/nerves/.nerves/artifacts/nerves_system_bbb-2.30.2/staging/usr/include/sys/types.h:25,1394                 from /usr/local/lib/erlang/erts-17.1/include/erl_drv_nif.h:161,1395                 from /usr/local/lib/erlang/erts-17.1/include/erl_nif.h:33,1396                 from c_src/func_rocp.c:2:1397/home/nerves/.nerves/artifacts/nerves_system_bbb-2.30.2/staging/usr/include/gnu/stubs.h:7:11: fatal error: gnu/stubs-soft.h: No such file or directory1398    7 | # include <gnu/stubs-soft.h>1399      |           ^~~~~~~~~~~~~~~~~~1400compilation terminated.1401In file included from /home/nerves/.nerves/artifacts/nerves_system_bbb-2.30.2/staging/usr/include/features.h:564,1402                 from /home/nerves/.nerves/artifacts/nerves_system_bbb-2.30.2/staging/usr/include/sys/types.h:25,1403                 from /usr/local/lib/erlang/erts-17.1/include/erl_drv_nif.h:161,1404                 from /usr/local/lib/erlang/erts-17.1/include/erl_nif.h:33,1405                 from c_src/func_rocr.c:2:1406/home/nerves/.nerves/artifacts/nerves_system_bbb-2.30.2/staging/usr/include/gnu/stubs.h:7:11: fatal error: gnu/stubs-soft.h: No such file or directory1407    7 | # include <gnu/stubs-soft.h>1408      |           ^~~~~~~~~~~~~~~~~~1409compilation terminated.1410In file included from /home/nerves/.nerves/artifacts/nerves_system_bbb-2.30.2/staging/usr/include/features.h:564,1411                 from /home/nerves/.nerves/artifacts/nerves_system_bbb-2.30.2/staging/usr/include/sys/types.h:25,1412                 from /usr/local/lib/erlang/erts-17.1/include/erl_drv_nif.h:161,1413                 from /usr/local/lib/erlang/erts-17.1/include/erl_nif.h:33,1414                 from c_src/func_rocr100.c:2:1415/home/nerves/.nerves/artifacts/nerves_system_bbb-2.30.2/staging/usr/include/gnu/stubs.h:7:11: fatal error: gnu/stubs-soft.h: No such file or directory1416    7 | # include <gnu/stubs-soft.h>1417      |           ^~~~~~~~~~~~~~~~~~1418compilation terminated.1419In file included from /home/nerves/.nerves/artifacts/nerves_system_bbb-2.30.2/staging/usr/include/features.h:564,1420                 from /home/nerves/.nerves/artifacts/nerves_system_bbb-2.30.2/staging/usr/include/sys/types.h:25,1421                 from /usr/local/lib/erlang/erts-17.1/include/erl_drv_nif.h:161,1422                 from /usr/local/lib/erlang/erts-17.1/include/erl_nif.h:33,1423                 from c_src/func_rsi.c:2:1424/home/nerves/.nerves/artifacts/nerves_system_bbb-2.30.2/staging/usr/include/gnu/stubs.h:7:11: fatal error: gnu/stubs-soft.h: No such file or directory1425    7 | # include <gnu/stubs-soft.h>1426      |           ^~~~~~~~~~~~~~~~~~1427compilation terminated.1428In file included from /home/nerves/.nerves/artifacts/nerves_system_bbb-2.30.2/staging/usr/include/features.h:564,1429                 from /home/nerves/.nerves/artifacts/nerves_system_bbb-2.30.2/staging/usr/include/sys/types.h:25,1430                 from /usr/local/lib/erlang/erts-17.1/include/erl_drv_nif.h:161,1431                 from /usr/local/lib/erlang/erts-17.1/include/erl_nif.h:33,1432                 from c_src/func_sar.c:2:1433/home/nerves/.nerves/artifacts/nerves_system_bbb-2.30.2/staging/usr/include/gnu/stubs.h:7:11: fatal error: gnu/stubs-soft.h: No such file or directory1434    7 | # include <gnu/stubs-soft.h>1435      |           ^~~~~~~~~~~~~~~~~~1436compilation terminated.1437In file included from /home/nerves/.nerves/artifacts/nerves_system_bbb-2.30.2/staging/usr/include/features.h:564,1438                 from /home/nerves/.nerves/artifacts/nerves_system_bbb-2.30.2/staging/usr/include/sys/types.h:25,1439                 from /usr/local/lib/erlang/erts-17.1/include/erl_drv_nif.h:161,1440                 from /usr/local/lib/erlang/erts-17.1/include/erl_nif.h:33,1441                 from c_src/func_sarext.c:2:1442/home/nerves/.nerves/artifacts/nerves_system_bbb-2.30.2/staging/usr/include/gnu/stubs.h:7:11: fatal error: gnu/stubs-soft.h: No such file or directory1443    7 | # include <gnu/stubs-soft.h>1444      |           ^~~~~~~~~~~~~~~~~~1445compilation terminated.1446In file included from /home/nerves/.nerves/artifacts/nerves_system_bbb-2.30.2/staging/usr/include/features.h:564,1447                 from /home/nerves/.nerves/artifacts/nerves_system_bbb-2.30.2/staging/usr/include/sys/types.h:25,1448                 from /usr/local/lib/erlang/erts-17.1/include/erl_drv_nif.h:161,1449                 from /usr/local/lib/erlang/erts-17.1/include/erl_nif.h:33,1450                 from c_src/func_sin.c:2:1451/home/nerves/.nerves/artifacts/nerves_system_bbb-2.30.2/staging/usr/include/gnu/stubs.h:7:11: fatal error: gnu/stubs-soft.h: No such file or directory1452    7 | # include <gnu/stubs-soft.h>1453      |           ^~~~~~~~~~~~~~~~~~1454compilation terminated.1455In file included from /home/nerves/.nerves/artifacts/nerves_system_bbb-2.30.2/staging/usr/include/features.h:564,1456                 from /home/nerves/.nerves/artifacts/nerves_system_bbb-2.30.2/staging/usr/include/sys/types.h:25,1457                 from /usr/local/lib/erlang/erts-17.1/include/erl_drv_nif.h:161,1458                 from /usr/local/lib/erlang/erts-17.1/include/erl_nif.h:33,1459                 from c_src/func_sinh.c:2:1460/home/nerves/.nerves/artifacts/nerves_system_bbb-2.30.2/staging/usr/include/gnu/stubs.h:7:11: fatal error: gnu/stubs-soft.h: No such file or directory1461    7 | # include <gnu/stubs-soft.h>1462      |           ^~~~~~~~~~~~~~~~~~1463compilation terminated.1464In file included from /home/nerves/.nerves/artifacts/nerves_system_bbb-2.30.2/staging/usr/include/features.h:564,1465                 from /home/nerves/.nerves/artifacts/nerves_system_bbb-2.30.2/staging/usr/include/sys/types.h:25,1466                 from /usr/local/lib/erlang/erts-17.1/include/erl_drv_nif.h:161,1467                 from /usr/local/lib/erlang/erts-17.1/include/erl_nif.h:33,1468                 from c_src/func_sma.c:2:1469/home/nerves/.nerves/artifacts/nerves_system_bbb-2.30.2/staging/usr/include/gnu/stubs.h:7:11: fatal error: gnu/stubs-soft.h: No such file or directory1470    7 | # include <gnu/stubs-soft.h>1471      |           ^~~~~~~~~~~~~~~~~~1472compilation terminated.1473In file included from /home/nerves/.nerves/artifacts/nerves_system_bbb-2.30.2/staging/usr/include/features.h:564,1474                 from /home/nerves/.nerves/artifacts/nerves_system_bbb-2.30.2/staging/usr/include/sys/types.h:25,1475                 from /usr/local/lib/erlang/erts-17.1/include/erl_drv_nif.h:161,1476                 from /usr/local/lib/erlang/erts-17.1/include/erl_nif.h:33,1477                 from c_src/func_sqrt.c:2:1478/home/nerves/.nerves/artifacts/nerves_system_bbb-2.30.2/staging/usr/include/gnu/stubs.h:7:11: fatal error: gnu/stubs-soft.h: No such file or directory1479    7 | # include <gnu/stubs-soft.h>1480      |           ^~~~~~~~~~~~~~~~~~1481compilation terminated.1482In file included from /home/nerves/.nerves/artifacts/nerves_system_bbb-2.30.2/staging/usr/include/features.h:564,1483                 from /home/nerves/.nerves/artifacts/nerves_system_bbb-2.30.2/staging/usr/include/sys/types.h:25,1484                 from /usr/local/lib/erlang/erts-17.1/include/erl_drv_nif.h:161,1485                 from /usr/local/lib/erlang/erts-17.1/include/erl_nif.h:33,1486                 from c_src/func_stddev.c:2:1487/home/nerves/.nerves/artifacts/nerves_system_bbb-2.30.2/staging/usr/include/gnu/stubs.h:7:11: fatal error: gnu/stubs-soft.h: No such file or directory1488    7 | # include <gnu/stubs-soft.h>1489      |           ^~~~~~~~~~~~~~~~~~1490compilation terminated.1491In file included from /home/nerves/.nerves/artifacts/nerves_system_bbb-2.30.2/staging/usr/include/features.h:564,1492                 from /home/nerves/.nerves/artifacts/nerves_system_bbb-2.30.2/staging/usr/include/sys/types.h:25,1493                 from /usr/local/lib/erlang/erts-17.1/include/erl_drv_nif.h:161,1494                 from /usr/local/lib/erlang/erts-17.1/include/erl_nif.h:33,1495                 from c_src/func_stoch.c:2:1496/home/nerves/.nerves/artifacts/nerves_system_bbb-2.30.2/staging/usr/include/gnu/stubs.h:7:11: fatal error: gnu/stubs-soft.h: No such file or directory1497    7 | # include <gnu/stubs-soft.h>1498      |           ^~~~~~~~~~~~~~~~~~1499compilation terminated.1500In file included from /home/nerves/.nerves/artifacts/nerves_system_bbb-2.30.2/staging/usr/include/features.h:564,1501                 from /home/nerves/.nerves/artifacts/nerves_system_bbb-2.30.2/staging/usr/include/sys/types.h:25,1502                 from /usr/local/lib/erlang/erts-17.1/include/erl_drv_nif.h:161,1503                 from /usr/local/lib/erlang/erts-17.1/include/erl_nif.h:33,1504                 from c_src/func_stochf.c:2:1505/home/nerves/.nerves/artifacts/nerves_system_bbb-2.30.2/staging/usr/include/gnu/stubs.h:7:11: fatal error: gnu/stubs-soft.h: No such file or directory1506    7 | # include <gnu/stubs-soft.h>1507      |           ^~~~~~~~~~~~~~~~~~1508compilation terminated.1509In file included from /home/nerves/.nerves/artifacts/nerves_system_bbb-2.30.2/staging/usr/include/features.h:564,1510                 from /home/nerves/.nerves/artifacts/nerves_system_bbb-2.30.2/staging/usr/include/sys/types.h:25,1511                 from /usr/local/lib/erlang/erts-17.1/include/erl_drv_nif.h:161,1512                 from /usr/local/lib/erlang/erts-17.1/include/erl_nif.h:33,1513                 from c_src/func_stochrsi.c:2:1514/home/nerves/.nerves/artifacts/nerves_system_bbb-2.30.2/staging/usr/include/gnu/stubs.h:7:11: fatal error: gnu/stubs-soft.h: No such file or directory1515    7 | # include <gnu/stubs-soft.h>1516      |           ^~~~~~~~~~~~~~~~~~1517compilation terminated.1518In file included from /home/nerves/.nerves/artifacts/nerves_system_bbb-2.30.2/staging/usr/include/features.h:564,1519                 from /home/nerves/.nerves/artifacts/nerves_system_bbb-2.30.2/staging/usr/include/sys/types.h:25,1520                 from /usr/local/lib/erlang/erts-17.1/include/erl_drv_nif.h:161,1521                 from /usr/local/lib/erlang/erts-17.1/include/erl_nif.h:33,1522                 from c_src/func_sub.c:2:1523/home/nerves/.nerves/artifacts/nerves_system_bbb-2.30.2/staging/usr/include/gnu/stubs.h:7:11: fatal error: gnu/stubs-soft.h: No such file or directory1524    7 | # include <gnu/stubs-soft.h>1525      |           ^~~~~~~~~~~~~~~~~~1526compilation terminated.1527In file included from /home/nerves/.nerves/artifacts/nerves_system_bbb-2.30.2/staging/usr/include/features.h:564,1528                 from /home/nerves/.nerves/artifacts/nerves_system_bbb-2.30.2/staging/usr/include/sys/types.h:25,1529                 from /usr/local/lib/erlang/erts-17.1/include/erl_drv_nif.h:161,1530                 from /usr/local/lib/erlang/erts-17.1/include/erl_nif.h:33,1531                 from c_src/func_sum.c:2:1532/home/nerves/.nerves/artifacts/nerves_system_bbb-2.30.2/staging/usr/include/gnu/stubs.h:7:11: fatal error: gnu/stubs-soft.h: No such file or directory1533    7 | # include <gnu/stubs-soft.h>1534      |           ^~~~~~~~~~~~~~~~~~1535compilation terminated.1536In file included from /home/nerves/.nerves/artifacts/nerves_system_bbb-2.30.2/staging/usr/include/features.h:564,1537                 from /home/nerves/.nerves/artifacts/nerves_system_bbb-2.30.2/staging/usr/include/sys/types.h:25,1538                 from /usr/local/lib/erlang/erts-17.1/include/erl_drv_nif.h:161,1539                 from /usr/local/lib/erlang/erts-17.1/include/erl_nif.h:33,1540                 from c_src/func_t3.c:2:1541/home/nerves/.nerves/artifacts/nerves_system_bbb-2.30.2/staging/usr/include/gnu/stubs.h:7:11: fatal error: gnu/stubs-soft.h: No such file or directory1542    7 | # include <gnu/stubs-soft.h>1543      |           ^~~~~~~~~~~~~~~~~~1544compilation terminated.1545In file included from /home/nerves/.nerves/artifacts/nerves_system_bbb-2.30.2/staging/usr/include/features.h:564,1546                 from /home/nerves/.nerves/artifacts/nerves_system_bbb-2.30.2/staging/usr/include/sys/types.h:25,1547                 from /usr/local/lib/erlang/erts-17.1/include/erl_drv_nif.h:161,1548                 from /usr/local/lib/erlang/erts-17.1/include/erl_nif.h:33,1549                 from c_src/func_tan.c:2:1550/home/nerves/.nerves/artifacts/nerves_system_bbb-2.30.2/staging/usr/include/gnu/stubs.h:7:11: fatal error: gnu/stubs-soft.h: No such file or directory1551    7 | # include <gnu/stubs-soft.h>1552      |           ^~~~~~~~~~~~~~~~~~1553compilation terminated.1554In file included from /home/nerves/.nerves/artifacts/nerves_system_bbb-2.30.2/staging/usr/include/features.h:564,1555                 from /home/nerves/.nerves/artifacts/nerves_system_bbb-2.30.2/staging/usr/include/sys/types.h:25,1556                 from /usr/local/lib/erlang/erts-17.1/include/erl_drv_nif.h:161,1557                 from /usr/local/lib/erlang/erts-17.1/include/erl_nif.h:33,1558                 from c_src/func_tanh.c:2:1559/home/nerves/.nerves/artifacts/nerves_system_bbb-2.30.2/staging/usr/include/gnu/stubs.h:7:11: fatal error: gnu/stubs-soft.h: No such file or directory1560    7 | # include <gnu/stubs-soft.h>1561      |           ^~~~~~~~~~~~~~~~~~1562compilation terminated.1563In file included from /home/nerves/.nerves/artifacts/nerves_system_bbb-2.30.2/staging/usr/include/features.h:564,1564                 from /home/nerves/.nerves/artifacts/nerves_system_bbb-2.30.2/staging/usr/include/sys/types.h:25,1565                 from /usr/local/lib/erlang/erts-17.1/include/erl_drv_nif.h:161,1566                 from /usr/local/lib/erlang/erts-17.1/include/erl_nif.h:33,1567                 from c_src/func_tema.c:2:1568/home/nerves/.nerves/artifacts/nerves_system_bbb-2.30.2/staging/usr/include/gnu/stubs.h:7:11: fatal error: gnu/stubs-soft.h: No such file or directory1569    7 | # include <gnu/stubs-soft.h>1570      |           ^~~~~~~~~~~~~~~~~~1571compilation terminated.1572In file included from /home/nerves/.nerves/artifacts/nerves_system_bbb-2.30.2/staging/usr/include/features.h:564,1573                 from /home/nerves/.nerves/artifacts/nerves_system_bbb-2.30.2/staging/usr/include/sys/types.h:25,1574                 from /usr/local/lib/erlang/erts-17.1/include/erl_drv_nif.h:161,1575                 from /usr/local/lib/erlang/erts-17.1/include/erl_nif.h:33,1576                 from c_src/func_trange.c:2:1577/home/nerves/.nerves/artifacts/nerves_system_bbb-2.30.2/staging/usr/include/gnu/stubs.h:7:11: fatal error: gnu/stubs-soft.h: No such file or directory1578    7 | # include <gnu/stubs-soft.h>1579      |           ^~~~~~~~~~~~~~~~~~1580compilation terminated.1581In file included from /home/nerves/.nerves/artifacts/nerves_system_bbb-2.30.2/staging/usr/include/features.h:564,1582                 from /home/nerves/.nerves/artifacts/nerves_system_bbb-2.30.2/staging/usr/include/sys/types.h:25,1583                 from /usr/local/lib/erlang/erts-17.1/include/erl_drv_nif.h:161,1584                 from /usr/local/lib/erlang/erts-17.1/include/erl_nif.h:33,1585                 from c_src/func_trima.c:2:1586/home/nerves/.nerves/artifacts/nerves_system_bbb-2.30.2/staging/usr/include/gnu/stubs.h:7:11: fatal error: gnu/stubs-soft.h: No such file or directory1587    7 | # include <gnu/stubs-soft.h>1588      |           ^~~~~~~~~~~~~~~~~~1589compilation terminated.1590In file included from /home/nerves/.nerves/artifacts/nerves_system_bbb-2.30.2/staging/usr/include/features.h:564,1591                 from /home/nerves/.nerves/artifacts/nerves_system_bbb-2.30.2/staging/usr/include/sys/types.h:25,1592                 from /usr/local/lib/erlang/erts-17.1/include/erl_drv_nif.h:161,1593                 from /usr/local/lib/erlang/erts-17.1/include/erl_nif.h:33,1594                 from c_src/func_trix.c:2:1595/home/nerves/.nerves/artifacts/nerves_system_bbb-2.30.2/staging/usr/include/gnu/stubs.h:7:11: fatal error: gnu/stubs-soft.h: No such file or directory1596    7 | # include <gnu/stubs-soft.h>1597      |           ^~~~~~~~~~~~~~~~~~1598compilation terminated.1599In file included from /home/nerves/.nerves/artifacts/nerves_system_bbb-2.30.2/staging/usr/include/features.h:564,1600                 from /home/nerves/.nerves/artifacts/nerves_system_bbb-2.30.2/staging/usr/include/sys/types.h:25,1601                 from /usr/local/lib/erlang/erts-17.1/include/erl_drv_nif.h:161,1602                 from /usr/local/lib/erlang/erts-17.1/include/erl_nif.h:33,1603                 from c_src/func_tsf.c:2:1604/home/nerves/.nerves/artifacts/nerves_system_bbb-2.30.2/staging/usr/include/gnu/stubs.h:7:11: fatal error: gnu/stubs-soft.h: No such file or directory1605    7 | # include <gnu/stubs-soft.h>1606      |           ^~~~~~~~~~~~~~~~~~1607compilation terminated.1608In file included from /home/nerves/.nerves/artifacts/nerves_system_bbb-2.30.2/staging/usr/include/features.h:564,1609                 from /home/nerves/.nerves/artifacts/nerves_system_bbb-2.30.2/staging/usr/include/sys/types.h:25,1610                 from /usr/local/lib/erlang/erts-17.1/include/erl_drv_nif.h:161,1611                 from /usr/local/lib/erlang/erts-17.1/include/erl_nif.h:33,1612                 from c_src/func_typprice.c:2:1613/home/nerves/.nerves/artifacts/nerves_system_bbb-2.30.2/staging/usr/include/gnu/stubs.h:7:11: fatal error: gnu/stubs-soft.h: No such file or directory1614    7 | # include <gnu/stubs-soft.h>1615      |           ^~~~~~~~~~~~~~~~~~1616compilation terminated.1617In file included from /home/nerves/.nerves/artifacts/nerves_system_bbb-2.30.2/staging/usr/include/features.h:564,1618                 from /home/nerves/.nerves/artifacts/nerves_system_bbb-2.30.2/staging/usr/include/sys/types.h:25,1619                 from /usr/local/lib/erlang/erts-17.1/include/erl_drv_nif.h:161,1620                 from /usr/local/lib/erlang/erts-17.1/include/erl_nif.h:33,1621                 from c_src/func_ultosc.c:2:1622/home/nerves/.nerves/artifacts/nerves_system_bbb-2.30.2/staging/usr/include/gnu/stubs.h:7:11: fatal error: gnu/stubs-soft.h: No such file or directory1623    7 | # include <gnu/stubs-soft.h>1624      |           ^~~~~~~~~~~~~~~~~~1625compilation terminated.1626In file included from /home/nerves/.nerves/artifacts/nerves_system_bbb-2.30.2/staging/usr/include/features.h:564,1627                 from /home/nerves/.nerves/artifacts/nerves_system_bbb-2.30.2/staging/usr/include/sys/types.h:25,1628                 from /usr/local/lib/erlang/erts-17.1/include/erl_drv_nif.h:161,1629                 from /usr/local/lib/erlang/erts-17.1/include/erl_nif.h:33,1630                 from c_src/func_var.c:2:1631/home/nerves/.nerves/artifacts/nerves_system_bbb-2.30.2/staging/usr/include/gnu/stubs.h:7:11: fatal error: gnu/stubs-soft.h: No such file or directory1632    7 | # include <gnu/stubs-soft.h>1633      |           ^~~~~~~~~~~~~~~~~~1634compilation terminated.1635In file included from /home/nerves/.nerves/artifacts/nerves_system_bbb-2.30.2/staging/usr/include/features.h:564,1636                 from /home/nerves/.nerves/artifacts/nerves_system_bbb-2.30.2/staging/usr/include/sys/types.h:25,1637                 from /usr/local/lib/erlang/erts-17.1/include/erl_drv_nif.h:161,1638                 from /usr/local/lib/erlang/erts-17.1/include/erl_nif.h:33,1639                 from c_src/func_wclprice.c:2:1640/home/nerves/.nerves/artifacts/nerves_system_bbb-2.30.2/staging/usr/include/gnu/stubs.h:7:11: fatal error: gnu/stubs-soft.h: No such file or directory1641    7 | # include <gnu/stubs-soft.h>1642      |           ^~~~~~~~~~~~~~~~~~1643compilation terminated.1644In file included from /home/nerves/.nerves/artifacts/nerves_system_bbb-2.30.2/staging/usr/include/features.h:564,1645                 from /home/nerves/.nerves/artifacts/nerves_system_bbb-2.30.2/staging/usr/include/sys/types.h:25,1646                 from /usr/local/lib/erlang/erts-17.1/include/erl_drv_nif.h:161,1647                 from /usr/local/lib/erlang/erts-17.1/include/erl_nif.h:33,1648                 from c_src/func_willr.c:2:1649/home/nerves/.nerves/artifacts/nerves_system_bbb-2.30.2/staging/usr/include/gnu/stubs.h:7:11: fatal error: gnu/stubs-soft.h: No such file or directory1650    7 | # include <gnu/stubs-soft.h>1651      |           ^~~~~~~~~~~~~~~~~~1652compilation terminated.1653In file included from /home/nerves/.nerves/artifacts/nerves_system_bbb-2.30.2/staging/usr/include/features.h:564,1654                 from /home/nerves/.nerves/artifacts/nerves_system_bbb-2.30.2/staging/usr/include/sys/types.h:25,1655                 from /usr/local/lib/erlang/erts-17.1/include/erl_drv_nif.h:161,1656                 from /usr/local/lib/erlang/erts-17.1/include/erl_nif.h:33,1657                 from c_src/func_wma.c:2:1658/home/nerves/.nerves/artifacts/nerves_system_bbb-2.30.2/staging/usr/include/gnu/stubs.h:7:11: fatal error: gnu/stubs-soft.h: No such file or directory1659    7 | # include <gnu/stubs-soft.h>1660      |           ^~~~~~~~~~~~~~~~~~1661compilation terminated.1662In file included from /home/nerves/.nerves/artifacts/nerves_system_bbb-2.30.2/staging/usr/include/features.h:564,1663                 from /home/nerves/.nerves/artifacts/nerves_system_bbb-2.30.2/staging/usr/include/sys/types.h:25,1664                 from /usr/local/lib/erlang/erts-17.1/include/erl_drv_nif.h:161,1665                 from /usr/local/lib/erlang/erts-17.1/include/erl_nif.h:33,1666                 from c_src/talib.c:2:1667/home/nerves/.nerves/artifacts/nerves_system_bbb-2.30.2/staging/usr/include/gnu/stubs.h:7:11: fatal error: gnu/stubs-soft.h: No such file or directory1668    7 | # include <gnu/stubs-soft.h>1669      |           ^~~~~~~~~~~~~~~~~~1670compilation terminated.1671In file included from /home/nerves/.nerves/artifacts/nerves_system_bbb-2.30.2/staging/usr/include/features.h:564,1672                 from /home/nerves/.nerves/artifacts/nerves_system_bbb-2.30.2/staging/usr/include/sys/types.h:25,1673                 from /usr/local/lib/erlang/erts-17.1/include/erl_drv_nif.h:161,1674                 from /usr/local/lib/erlang/erts-17.1/include/erl_nif.h:33,1675                 from c_src/util.c:1:1676/home/nerves/.nerves/artifacts/nerves_system_bbb-2.30.2/staging/usr/include/gnu/stubs.h:7:11: fatal error: gnu/stubs-soft.h: No such file or directory1677    7 | # include <gnu/stubs-soft.h>1678      |           ^~~~~~~~~~~~~~~~~~1679compilation terminated.1680make: *** [Makefile:34: all] Error 11681could not compile dependency :talib_ex_nif, "mix compile" failed. Errors may have been logged above. You can recompile this dependency with "mix deps.compile talib_ex_nif --force", update it with "mix deps.update talib_ex_nif" or clean it with "mix deps.clean talib_ex_nif"1682==> nerves_compatibility_test1683** (Mix) Could not compile with "make" (exit status: 2).1684You need to have gcc and make installed. If you are using1685Ubuntu or any other Debian-based system, install the packages1686"build-essential". Also install "erlang-dev" package if not1687included in your Erlang/OTP version. If you're on Fedora, run1688"dnf group install 'Development Tools'".1689