Build log
nerves_system_rpi0
talib_ex_nif 0.1.0 · fail · run talib_ex_nif-0.1.0-1791124214336
1691 of 1691 lines
1Resolving Hex dependencies...2Resolution completed in 0.208s3Unchanged:4 circular_buffer 1.1.05 elixir_make 0.10.06 interactive_cmd 0.1.47 nerves 2.0.0-pre.28 nerves_discovery 0.1.59 nerves_logging 0.2.410 nerves_runtime 0.13.1311 nerves_system_bbb 2.30.212 nerves_system_br 1.34.413 nerves_system_mangopi_mq_pro 0.17.214 nerves_system_qemu_aarch64 0.4.215 nerves_system_rpi0 2.1.216 nerves_system_rpi4 2.1.217 nerves_system_rpi5 2.1.218 nerves_system_trellis 0.5.019 nerves_system_x86_64 1.34.220 nerves_toolchain_aarch64_nerves_linux_gnu 15.3.121 nerves_toolchain_armv6_nerves_linux_gnueabihf 15.3.122 nerves_toolchain_armv7_nerves_linux_gnueabihf 15.3.123 nerves_toolchain_riscv64_nerves_linux_gnu 15.3.124 nerves_toolchain_x86_64_nerves_linux_musl 15.3.125 nerves_uevent 0.1.726 property_table 0.3.427 ring_logger 0.11.728 tablet 0.3.329 talib_ex_nif 0.1.030 toolshed 0.5.031 uboot_env 1.0.232* Getting talib_ex_nif (Hex package)33* Getting nerves (Hex package)34* Getting ring_logger (Hex package)35* Getting toolshed (Hex package)36* Getting nerves_runtime (Hex package)37* Getting nerves_system_bbb (Hex package)38* Getting nerves_system_mangopi_mq_pro (Hex package)39* Getting nerves_system_qemu_aarch64 (Hex package)40* Getting nerves_system_rpi0 (Hex package)41* Getting nerves_system_rpi4 (Hex package)42* Getting nerves_system_rpi5 (Hex package)43* Getting nerves_system_trellis (Hex package)44* Getting nerves_system_x86_64 (Hex package)45* Getting nerves_system_br (Hex package)46* Getting nerves_toolchain_x86_64_nerves_linux_musl (Hex package)47* Getting nerves_toolchain_armv7_nerves_linux_gnueabihf (Hex package)48* Getting nerves_toolchain_aarch64_nerves_linux_gnu (Hex package)49* Getting nerves_toolchain_armv6_nerves_linux_gnueabihf (Hex package)50* Getting nerves_toolchain_riscv64_nerves_linux_gnu (Hex package)51* Getting nerves_logging (Hex package)52* Getting nerves_uevent (Hex package)53* Getting uboot_env (Hex package)54* Getting elixir_make (Hex package)55* Getting property_table (Hex package)56* Getting circular_buffer (Hex package)57* Getting interactive_cmd (Hex package)58* Getting nerves_discovery (Hex package)59* Getting tablet (Hex package)60==> nerves_system_br61Generated nerves_system_br app62==> circular_buffer63Compiling 1 file (.ex)64Generated circular_buffer app65==> tablet66Compiling 2 files (.ex)67Generated tablet app68==> elixir_make69Compiling 8 files (.ex)70Generated elixir_make app71==> nerves_logging72 CC kmsg_tailer.o73 LD kmsg_tailer74Compiling 5 files (.ex)75Generated nerves_logging app76==> nerves_discovery77Compiling 5 files (.ex)78Generated nerves_discovery app79==> ring_logger80Compiling 7 files (.ex)81Generated ring_logger app82==> interactive_cmd83Compiling 1 file (.ex)84Generated interactive_cmd app85==> nerves86Compiling 65 files (.ex)87 warning: redefining module Mix.Tasks.Nerves.Init (current version loaded from /work/proj/_build/rpi0/lib/nerves/ebin/Elixir.Mix.Tasks.Nerves.Init.beam)88 │89 6 │ defmodule Mix.Tasks.Nerves.Init do90 │ ~~~~~~~~~~~~~~~~~~~~~~~~~~~~~~~~~~91 │92 └─ lib/mix/tasks/nerves.init.ex:6: Mix.Tasks.Nerves.Init (module)9394 warning: redefining module Nerves (current version loaded from /work/proj/_build/rpi0/lib/nerves/ebin/Elixir.Nerves.beam)95 │96 6 │ defmodule Nerves do97 │ ~~~~~~~~~~~~~~~~~~~98 │99 └─ lib/nerves.ex:6: Nerves (module)100101 warning: redefining module Nerves.ArtifactResolver (current version loaded from /work/proj/_build/rpi0/lib/nerves/ebin/Elixir.Nerves.ArtifactResolver.beam)102 │103 5 │ defmodule Nerves.ArtifactResolver do104 │ ~~~~~~~~~~~~~~~~~~~~~~~~~~~~~~~~~~~~105 │106 └─ lib/nerves/artifact_resolver.ex:5: Nerves.ArtifactResolver (module)107108 warning: redefining module Nerves.BuildAction.AppModes (current version loaded from /work/proj/_build/rpi0/lib/nerves/ebin/Elixir.Nerves.BuildAction.AppModes.beam)109 │110 6 │ defmodule Nerves.BuildAction.AppModes do111 │ ~~~~~~~~~~~~~~~~~~~~~~~~~~~~~~~~~~~~~~~~112 │113 └─ lib/nerves/build_action/app_modes.ex:6: Nerves.BuildAction.AppModes (module)114115 warning: redefining module Nerves.BuildAction.CheckExecutables (current version loaded from /work/proj/_build/rpi0/lib/nerves/ebin/Elixir.Nerves.BuildAction.CheckExecutables.beam)116 │117 5 │ defmodule Nerves.BuildAction.CheckExecutables do118 │ ~~~~~~~~~~~~~~~~~~~~~~~~~~~~~~~~~~~~~~~~~~~~~~~~119 │120 └─ lib/nerves/build_action/check_executables.ex:5: Nerves.BuildAction.CheckExecutables (module)121122 warning: redefining module Nerves.BuildAction.Erlinit (current version loaded from /work/proj/_build/rpi0/lib/nerves/ebin/Elixir.Nerves.BuildAction.Erlinit.beam)123 │124 8 │ defmodule Nerves.BuildAction.Erlinit do125 │ ~~~~~~~~~~~~~~~~~~~~~~~~~~~~~~~~~~~~~~~126 │127 └─ lib/nerves/build_action/erlinit.ex:8: Nerves.BuildAction.Erlinit (module)128129 warning: redefining module Nerves.BuildAction.Firmware (current version loaded from /work/proj/_build/rpi0/lib/nerves/ebin/Elixir.Nerves.BuildAction.Firmware.beam)130 │131 5 │ defmodule Nerves.BuildAction.Firmware do132 │ ~~~~~~~~~~~~~~~~~~~~~~~~~~~~~~~~~~~~~~~~133 │134 └─ lib/nerves/build_action/firmware.ex:5: Nerves.BuildAction.Firmware (module)135136 warning: redefining module Nerves.BuildAction.IExStartupCheck (current version loaded from /work/proj/_build/rpi0/lib/nerves/ebin/Elixir.Nerves.BuildAction.IExStartupCheck.beam)137 │138 7 │ defmodule Nerves.BuildAction.IExStartupCheck do139 │ ~~~~~~~~~~~~~~~~~~~~~~~~~~~~~~~~~~~~~~~~~~~~~~~140 │141 └─ lib/nerves/build_action/iex_startup_check.ex:7: Nerves.BuildAction.IExStartupCheck (module)142143 warning: redefining module Nerves.BuildAction.NervesV1System (current version loaded from /work/proj/_build/rpi0/lib/nerves/ebin/Elixir.Nerves.BuildAction.NervesV1System.beam)144 │145 5 │ defmodule Nerves.BuildAction.NervesV1System do146 │ ~~~~~~~~~~~~~~~~~~~~~~~~~~~~~~~~~~~~~~~~~~~~~~147 │148 └─ lib/nerves/build_action/nerves_v1_system.ex:5: Nerves.BuildAction.NervesV1System (module)149150 warning: redefining module Nerves.BuildAction.NervesV1Toolchain (current version loaded from /work/proj/_build/rpi0/lib/nerves/ebin/Elixir.Nerves.BuildAction.NervesV1Toolchain.beam)151 │152 5 │ defmodule Nerves.BuildAction.NervesV1Toolchain do153 │ ~~~~~~~~~~~~~~~~~~~~~~~~~~~~~~~~~~~~~~~~~~~~~~~~~154 │155 └─ lib/nerves/build_action/nerves_v1_toolchain.ex:5: Nerves.BuildAction.NervesV1Toolchain (module)156157 warning: redefining module Nerves.BuildAction.Rootfs (current version loaded from /work/proj/_build/rpi0/lib/nerves/ebin/Elixir.Nerves.BuildAction.Rootfs.beam)158 │159 5 │ defmodule Nerves.BuildAction.Rootfs do160 │ ~~~~~~~~~~~~~~~~~~~~~~~~~~~~~~~~~~~~~~161 │162 └─ lib/nerves/build_action/rootfs.ex:5: Nerves.BuildAction.Rootfs (module)163164 warning: redefining module Nerves.BuildAction.SortApps (current version loaded from /work/proj/_build/rpi0/lib/nerves/ebin/Elixir.Nerves.BuildAction.SortApps.beam)165 │166 6 │ defmodule Nerves.BuildAction.SortApps do167 │ ~~~~~~~~~~~~~~~~~~~~~~~~~~~~~~~~~~~~~~~~168 │169 └─ lib/nerves/build_action/sort_apps.ex:6: Nerves.BuildAction.SortApps (module)170171 warning: redefining module Nerves.BuildAction.StripAll (current version loaded from /work/proj/_build/rpi0/lib/nerves/ebin/Elixir.Nerves.BuildAction.StripAll.beam)172 │173 5 │ defmodule Nerves.BuildAction.StripAll do174 │ ~~~~~~~~~~~~~~~~~~~~~~~~~~~~~~~~~~~~~~~~175 │176 └─ lib/nerves/build_action/strip_all.ex:5: Nerves.BuildAction.StripAll (module)177178 warning: redefining module Nerves.BuildAction.Trimmer (current version loaded from /work/proj/_build/rpi0/lib/nerves/ebin/Elixir.Nerves.BuildAction.Trimmer.beam)179 │180 5 │ defmodule Nerves.BuildAction.Trimmer do181 │ ~~~~~~~~~~~~~~~~~~~~~~~~~~~~~~~~~~~~~~~182 │183 └─ lib/nerves/build_action/trimmer.ex:5: Nerves.BuildAction.Trimmer (module)184185 warning: redefining module Nerves.BuildPlan (current version loaded from /work/proj/_build/rpi0/lib/nerves/ebin/Elixir.Nerves.BuildPlan.beam)186 │187 5 │ defmodule Nerves.BuildPlan do188 │ ~~~~~~~~~~~~~~~~~~~~~~~~~~~~~189 │190 └─ lib/nerves/build_plan.ex:5: Nerves.BuildPlan (module)191192 warning: redefining module Nerves.BuildPlan.Checks (current version loaded from /work/proj/_build/rpi0/lib/nerves/ebin/Elixir.Nerves.BuildPlan.Checks.beam)193 │194 5 │ defmodule Nerves.BuildPlan.Checks do195 │ ~~~~~~~~~~~~~~~~~~~~~~~~~~~~~~~~~~~~196 │197 └─ lib/nerves/build_plan/checks.ex:5: Nerves.BuildPlan.Checks (module)198199 warning: redefining module Nerves.Container (current version loaded from /work/proj/_build/rpi0/lib/nerves/ebin/Elixir.Nerves.Container.beam)200 │201 6 │ defmodule Nerves.Container do202 │ ~~~~~~~~~~~~~~~~~~~~~~~~~~~~~203 │204 └─ lib/nerves/container.ex:6: Nerves.Container (module)205206 warning: redefining module Nerves.Fingerprint (current version loaded from /work/proj/_build/rpi0/lib/nerves/ebin/Elixir.Nerves.Fingerprint.beam)207 │208 5 │ defmodule Nerves.Fingerprint do209 │ ~~~~~~~~~~~~~~~~~~~~~~~~~~~~~~~210 │211 └─ lib/nerves/fingerprint.ex:5: Nerves.Fingerprint (module)212213 warning: redefining module Nerves.MixPackage (current version loaded from /work/proj/_build/rpi0/lib/nerves/ebin/Elixir.Nerves.MixPackage.beam)214 │215 5 │ defmodule Nerves.MixPackage do216 │ ~~~~~~~~~~~~~~~~~~~~~~~~~~~~~~217 │218 └─ lib/nerves/mix_package.ex:5: Nerves.MixPackage (module)219220 warning: redefining module Nerves.Paths (current version loaded from /work/proj/_build/rpi0/lib/nerves/ebin/Elixir.Nerves.Paths.beam)221 │222 5 │ defmodule Nerves.Paths do223 │ ~~~~~~~~~~~~~~~~~~~~~~~~~224 │225 └─ lib/nerves/paths.ex:5: Nerves.Paths (module)226227 warning: redefining module Nerves.TargetTuple (current version loaded from /work/proj/_build/rpi0/lib/nerves/ebin/Elixir.Nerves.TargetTuple.beam)228 │229 5 │ defmodule Nerves.TargetTuple do230 │ ~~~~~~~~~~~~~~~~~~~~~~~~~~~~~~~231 │232 └─ lib/nerves/target_tuple.ex:5: Nerves.TargetTuple (module)233234Generated nerves app235==> nerves_toolchain_armv6_nerves_linux_gnueabihf236Compiling 1 file (.ex)237Generated nerves_toolchain_armv6_nerves_linux_gnueabihf app238==> nerves_system_rpi0239Generated nerves_system_rpi0 app240==> talib_ex_nif241gcc -g -O3 -ansi -pedantic -Wall -Wextra -I/usr/local/lib/erlang/erts-17.1/include -Wno-unused-parameter -fPIC -I/usr/include/ta-lib c_src/func_acos.c c_src/func_ad.c c_src/func_add.c c_src/func_adosc.c c_src/func_adx.c c_src/func_adxr.c c_src/func_apo.c c_src/func_aroon.c c_src/func_aroonosc.c c_src/func_asin.c c_src/func_atan.c c_src/func_atr.c c_src/func_avgprice.c c_src/func_bbands.c c_src/func_beta.c c_src/func_bop.c c_src/func_cci.c c_src/func_cdl2_crows.c c_src/func_cdl3_black_crows.c c_src/func_cdl3_inside.c c_src/func_cdl3_line_strike.c c_src/func_cdl3_outside.c c_src/func_cdl3_stars_in_south.c c_src/func_cdl3_white_soldiers.c c_src/func_cdl_abandoned_baby.c c_src/func_cdl_advance_block.c c_src/func_cdl_belt_hold.c c_src/func_cdl_breakaway.c c_src/func_cdl_closing_marubozu.c c_src/func_cdl_conceal_baby_swallow.c c_src/func_cdl_counterattack.c c_src/func_cdl_dark_cloud_cover.c c_src/func_cdl_doji.c c_src/func_cdl_doji_star.c c_src/func_cdl_dragonfly_doji.c c_src/func_cdl_engulfing.c c_src/func_cdl_evening_doji_star.c c_src/func_cdl_evening_star.c c_src/func_cdl_gap_side_side_white.c c_src/func_cdl_gravestone_doji.c c_src/func_cdl_hammer.c c_src/func_cdl_hanging_man.c c_src/func_cdl_harami.c c_src/func_cdl_harami_cross.c c_src/func_cdl_highwave.c c_src/func_cdl_hikkake.c c_src/func_cdl_hikkake_mod.c c_src/func_cdl_homing_pigeon.c c_src/func_cdl_identical_3_crows.c c_src/func_cdl_inneck.c c_src/func_cdl_inverted_hammer.c c_src/func_cdl_kicking.c c_src/func_cdl_kicking_by_length.c c_src/func_cdl_ladder_bottom.c c_src/func_cdl_long_legged_doji.c c_src/func_cdl_long_line.c c_src/func_cdl_marubozu.c c_src/func_cdl_mat_hold.c c_src/func_cdl_matching_low.c c_src/func_cdl_morning_doji_star.c c_src/func_cdl_morning_star.c c_src/func_cdl_on_neck.c c_src/func_cdl_piercing.c c_src/func_cdl_rickshaw_man.c c_src/func_cdl_rise_fall_3_methods.c c_src/func_cdl_separating_lines.c c_src/func_cdl_shooting_star.c c_src/func_cdl_short_line.c c_src/func_cdl_spinning_top.c c_src/func_cdl_stalled_pattern.c c_src/func_cdl_stick_sandwich.c c_src/func_cdl_takuri.c c_src/func_cdl_tasuki_gap.c c_src/func_cdl_thrusting.c c_src/func_cdl_tri_star.c c_src/func_cdl_unique_3_river.c c_src/func_cdl_upside_downside_gap_3_methods.c c_src/func_cdl_upside_gap_2_crows.c c_src/func_ceil.c c_src/func_cmo.c c_src/func_correl.c c_src/func_cos.c c_src/func_cosh.c c_src/func_dema.c c_src/func_div.c c_src/func_dx.c c_src/func_ema.c c_src/func_exp.c c_src/func_floor.c c_src/func_ht_dcperiod.c c_src/func_ht_dcphase.c c_src/func_ht_phasor.c c_src/func_ht_sine.c c_src/func_ht_trendline.c c_src/func_ht_trendmode.c c_src/func_kama.c c_src/func_linear_reg.c c_src/func_linear_reg_angle.c c_src/func_linear_reg_intercept.c c_src/func_linear_reg_slope.c c_src/func_ln.c c_src/func_log10.c c_src/func_ma.c c_src/func_macd.c c_src/func_macdext.c c_src/func_macdfix.c c_src/func_mama.c c_src/func_mavp.c c_src/func_max.c c_src/func_max_index.c c_src/func_med_price.c c_src/func_mfi.c c_src/func_mid_point.c c_src/func_mid_price.c c_src/func_min.c c_src/func_min_index.c c_src/func_min_max.c c_src/func_min_max_index.c c_src/func_minus_di.c c_src/func_minus_dm.c c_src/func_mom.c c_src/func_mult.c c_src/func_natr.c c_src/func_obv.c c_src/func_plus_di.c c_src/func_plus_dm.c c_src/func_ppo.c c_src/func_roc.c c_src/func_rocp.c c_src/func_rocr.c c_src/func_rocr100.c c_src/func_rsi.c c_src/func_sar.c c_src/func_sarext.c c_src/func_sin.c c_src/func_sinh.c c_src/func_sma.c c_src/func_sqrt.c c_src/func_stddev.c c_src/func_stoch.c c_src/func_stochf.c c_src/func_stochrsi.c c_src/func_sub.c c_src/func_sum.c c_src/func_t3.c c_src/func_tan.c c_src/func_tanh.c c_src/func_tema.c c_src/func_trange.c c_src/func_trima.c c_src/func_trix.c c_src/func_tsf.c c_src/func_typprice.c c_src/func_ultosc.c c_src/func_var.c c_src/func_wclprice.c c_src/func_willr.c c_src/func_wma.c c_src/talib.c c_src/util.c --sysroot=/home/nerves/.nerves/artifacts/nerves_system_rpi0-2.1.2/staging -lta_lib -L/usr/lib -L/usr/local/lib/erlang/lib/erl_interface-5.8.2/lib -lerl_interface -shared -o priv/talib.so242In file included from /home/nerves/.nerves/artifacts/nerves_system_rpi0-2.1.2/staging/usr/include/features.h:564,243 from /home/nerves/.nerves/artifacts/nerves_system_rpi0-2.1.2/staging/usr/include/sys/types.h:25,244 from /usr/local/lib/erlang/erts-17.1/include/erl_drv_nif.h:161,245 from /usr/local/lib/erlang/erts-17.1/include/erl_nif.h:33,246 from c_src/func_acos.c:2:247/home/nerves/.nerves/artifacts/nerves_system_rpi0-2.1.2/staging/usr/include/gnu/stubs.h:7:11: fatal error: gnu/stubs-soft.h: No such file or directory248 7 | # include <gnu/stubs-soft.h>249 | ^~~~~~~~~~~~~~~~~~250compilation terminated.251In file included from /home/nerves/.nerves/artifacts/nerves_system_rpi0-2.1.2/staging/usr/include/features.h:564,252 from /home/nerves/.nerves/artifacts/nerves_system_rpi0-2.1.2/staging/usr/include/sys/types.h:25,253 from /usr/local/lib/erlang/erts-17.1/include/erl_drv_nif.h:161,254 from /usr/local/lib/erlang/erts-17.1/include/erl_nif.h:33,255 from c_src/func_ad.c:2:256/home/nerves/.nerves/artifacts/nerves_system_rpi0-2.1.2/staging/usr/include/gnu/stubs.h:7:11: fatal error: gnu/stubs-soft.h: No such file or directory257 7 | # include <gnu/stubs-soft.h>258 | ^~~~~~~~~~~~~~~~~~259compilation terminated.260In file included from /home/nerves/.nerves/artifacts/nerves_system_rpi0-2.1.2/staging/usr/include/features.h:564,261 from /home/nerves/.nerves/artifacts/nerves_system_rpi0-2.1.2/staging/usr/include/sys/types.h:25,262 from /usr/local/lib/erlang/erts-17.1/include/erl_drv_nif.h:161,263 from /usr/local/lib/erlang/erts-17.1/include/erl_nif.h:33,264 from c_src/func_add.c:2:265/home/nerves/.nerves/artifacts/nerves_system_rpi0-2.1.2/staging/usr/include/gnu/stubs.h:7:11: fatal error: gnu/stubs-soft.h: No such file or directory266 7 | # include <gnu/stubs-soft.h>267 | ^~~~~~~~~~~~~~~~~~268compilation terminated.269In file included from /home/nerves/.nerves/artifacts/nerves_system_rpi0-2.1.2/staging/usr/include/features.h:564,270 from /home/nerves/.nerves/artifacts/nerves_system_rpi0-2.1.2/staging/usr/include/sys/types.h:25,271 from /usr/local/lib/erlang/erts-17.1/include/erl_drv_nif.h:161,272 from /usr/local/lib/erlang/erts-17.1/include/erl_nif.h:33,273 from c_src/func_adosc.c:2:274/home/nerves/.nerves/artifacts/nerves_system_rpi0-2.1.2/staging/usr/include/gnu/stubs.h:7:11: fatal error: gnu/stubs-soft.h: No such file or directory275 7 | # include <gnu/stubs-soft.h>276 | ^~~~~~~~~~~~~~~~~~277compilation terminated.278In file included from /home/nerves/.nerves/artifacts/nerves_system_rpi0-2.1.2/staging/usr/include/features.h:564,279 from /home/nerves/.nerves/artifacts/nerves_system_rpi0-2.1.2/staging/usr/include/sys/types.h:25,280 from /usr/local/lib/erlang/erts-17.1/include/erl_drv_nif.h:161,281 from /usr/local/lib/erlang/erts-17.1/include/erl_nif.h:33,282 from c_src/func_adx.c:2:283/home/nerves/.nerves/artifacts/nerves_system_rpi0-2.1.2/staging/usr/include/gnu/stubs.h:7:11: fatal error: gnu/stubs-soft.h: No such file or directory284 7 | # include <gnu/stubs-soft.h>285 | ^~~~~~~~~~~~~~~~~~286compilation terminated.287In file included from /home/nerves/.nerves/artifacts/nerves_system_rpi0-2.1.2/staging/usr/include/features.h:564,288 from /home/nerves/.nerves/artifacts/nerves_system_rpi0-2.1.2/staging/usr/include/sys/types.h:25,289 from /usr/local/lib/erlang/erts-17.1/include/erl_drv_nif.h:161,290 from /usr/local/lib/erlang/erts-17.1/include/erl_nif.h:33,291 from c_src/func_adxr.c:2:292/home/nerves/.nerves/artifacts/nerves_system_rpi0-2.1.2/staging/usr/include/gnu/stubs.h:7:11: fatal error: gnu/stubs-soft.h: No such file or directory293 7 | # include <gnu/stubs-soft.h>294 | ^~~~~~~~~~~~~~~~~~295compilation terminated.296In file included from /home/nerves/.nerves/artifacts/nerves_system_rpi0-2.1.2/staging/usr/include/features.h:564,297 from /home/nerves/.nerves/artifacts/nerves_system_rpi0-2.1.2/staging/usr/include/sys/types.h:25,298 from /usr/local/lib/erlang/erts-17.1/include/erl_drv_nif.h:161,299 from /usr/local/lib/erlang/erts-17.1/include/erl_nif.h:33,300 from c_src/func_apo.c:2:301/home/nerves/.nerves/artifacts/nerves_system_rpi0-2.1.2/staging/usr/include/gnu/stubs.h:7:11: fatal error: gnu/stubs-soft.h: No such file or directory302 7 | # include <gnu/stubs-soft.h>303 | ^~~~~~~~~~~~~~~~~~304compilation terminated.305In file included from /home/nerves/.nerves/artifacts/nerves_system_rpi0-2.1.2/staging/usr/include/features.h:564,306 from /home/nerves/.nerves/artifacts/nerves_system_rpi0-2.1.2/staging/usr/include/sys/types.h:25,307 from /usr/local/lib/erlang/erts-17.1/include/erl_drv_nif.h:161,308 from /usr/local/lib/erlang/erts-17.1/include/erl_nif.h:33,309 from c_src/func_aroon.c:2:310/home/nerves/.nerves/artifacts/nerves_system_rpi0-2.1.2/staging/usr/include/gnu/stubs.h:7:11: fatal error: gnu/stubs-soft.h: No such file or directory311 7 | # include <gnu/stubs-soft.h>312 | ^~~~~~~~~~~~~~~~~~313compilation terminated.314In file included from /home/nerves/.nerves/artifacts/nerves_system_rpi0-2.1.2/staging/usr/include/features.h:564,315 from /home/nerves/.nerves/artifacts/nerves_system_rpi0-2.1.2/staging/usr/include/sys/types.h:25,316 from /usr/local/lib/erlang/erts-17.1/include/erl_drv_nif.h:161,317 from /usr/local/lib/erlang/erts-17.1/include/erl_nif.h:33,318 from c_src/func_aroonosc.c:2:319/home/nerves/.nerves/artifacts/nerves_system_rpi0-2.1.2/staging/usr/include/gnu/stubs.h:7:11: fatal error: gnu/stubs-soft.h: No such file or directory320 7 | # include <gnu/stubs-soft.h>321 | ^~~~~~~~~~~~~~~~~~322compilation terminated.323In file included from /home/nerves/.nerves/artifacts/nerves_system_rpi0-2.1.2/staging/usr/include/features.h:564,324 from /home/nerves/.nerves/artifacts/nerves_system_rpi0-2.1.2/staging/usr/include/sys/types.h:25,325 from /usr/local/lib/erlang/erts-17.1/include/erl_drv_nif.h:161,326 from /usr/local/lib/erlang/erts-17.1/include/erl_nif.h:33,327 from c_src/func_asin.c:2:328/home/nerves/.nerves/artifacts/nerves_system_rpi0-2.1.2/staging/usr/include/gnu/stubs.h:7:11: fatal error: gnu/stubs-soft.h: No such file or directory329 7 | # include <gnu/stubs-soft.h>330 | ^~~~~~~~~~~~~~~~~~331compilation terminated.332In file included from /home/nerves/.nerves/artifacts/nerves_system_rpi0-2.1.2/staging/usr/include/features.h:564,333 from /home/nerves/.nerves/artifacts/nerves_system_rpi0-2.1.2/staging/usr/include/sys/types.h:25,334 from /usr/local/lib/erlang/erts-17.1/include/erl_drv_nif.h:161,335 from /usr/local/lib/erlang/erts-17.1/include/erl_nif.h:33,336 from c_src/func_atan.c:2:337/home/nerves/.nerves/artifacts/nerves_system_rpi0-2.1.2/staging/usr/include/gnu/stubs.h:7:11: fatal error: gnu/stubs-soft.h: No such file or directory338 7 | # include <gnu/stubs-soft.h>339 | ^~~~~~~~~~~~~~~~~~340compilation terminated.341In file included from /home/nerves/.nerves/artifacts/nerves_system_rpi0-2.1.2/staging/usr/include/features.h:564,342 from /home/nerves/.nerves/artifacts/nerves_system_rpi0-2.1.2/staging/usr/include/sys/types.h:25,343 from /usr/local/lib/erlang/erts-17.1/include/erl_drv_nif.h:161,344 from /usr/local/lib/erlang/erts-17.1/include/erl_nif.h:33,345 from c_src/func_atr.c:2:346/home/nerves/.nerves/artifacts/nerves_system_rpi0-2.1.2/staging/usr/include/gnu/stubs.h:7:11: fatal error: gnu/stubs-soft.h: No such file or directory347 7 | # include <gnu/stubs-soft.h>348 | ^~~~~~~~~~~~~~~~~~349compilation terminated.350In file included from /home/nerves/.nerves/artifacts/nerves_system_rpi0-2.1.2/staging/usr/include/features.h:564,351 from /home/nerves/.nerves/artifacts/nerves_system_rpi0-2.1.2/staging/usr/include/sys/types.h:25,352 from /usr/local/lib/erlang/erts-17.1/include/erl_drv_nif.h:161,353 from /usr/local/lib/erlang/erts-17.1/include/erl_nif.h:33,354 from c_src/func_avgprice.c:2:355/home/nerves/.nerves/artifacts/nerves_system_rpi0-2.1.2/staging/usr/include/gnu/stubs.h:7:11: fatal error: gnu/stubs-soft.h: No such file or directory356 7 | # include <gnu/stubs-soft.h>357 | ^~~~~~~~~~~~~~~~~~358compilation terminated.359In file included from /home/nerves/.nerves/artifacts/nerves_system_rpi0-2.1.2/staging/usr/include/features.h:564,360 from /home/nerves/.nerves/artifacts/nerves_system_rpi0-2.1.2/staging/usr/include/sys/types.h:25,361 from /usr/local/lib/erlang/erts-17.1/include/erl_drv_nif.h:161,362 from /usr/local/lib/erlang/erts-17.1/include/erl_nif.h:33,363 from c_src/func_bbands.c:2:364/home/nerves/.nerves/artifacts/nerves_system_rpi0-2.1.2/staging/usr/include/gnu/stubs.h:7:11: fatal error: gnu/stubs-soft.h: No such file or directory365 7 | # include <gnu/stubs-soft.h>366 | ^~~~~~~~~~~~~~~~~~367compilation terminated.368In file included from /home/nerves/.nerves/artifacts/nerves_system_rpi0-2.1.2/staging/usr/include/features.h:564,369 from /home/nerves/.nerves/artifacts/nerves_system_rpi0-2.1.2/staging/usr/include/sys/types.h:25,370 from /usr/local/lib/erlang/erts-17.1/include/erl_drv_nif.h:161,371 from /usr/local/lib/erlang/erts-17.1/include/erl_nif.h:33,372 from c_src/func_beta.c:2:373/home/nerves/.nerves/artifacts/nerves_system_rpi0-2.1.2/staging/usr/include/gnu/stubs.h:7:11: fatal error: gnu/stubs-soft.h: No such file or directory374 7 | # include <gnu/stubs-soft.h>375 | ^~~~~~~~~~~~~~~~~~376compilation terminated.377In file included from /home/nerves/.nerves/artifacts/nerves_system_rpi0-2.1.2/staging/usr/include/features.h:564,378 from /home/nerves/.nerves/artifacts/nerves_system_rpi0-2.1.2/staging/usr/include/sys/types.h:25,379 from /usr/local/lib/erlang/erts-17.1/include/erl_drv_nif.h:161,380 from /usr/local/lib/erlang/erts-17.1/include/erl_nif.h:33,381 from c_src/func_bop.c:2:382/home/nerves/.nerves/artifacts/nerves_system_rpi0-2.1.2/staging/usr/include/gnu/stubs.h:7:11: fatal error: gnu/stubs-soft.h: No such file or directory383 7 | # include <gnu/stubs-soft.h>384 | ^~~~~~~~~~~~~~~~~~385compilation terminated.386In file included from /home/nerves/.nerves/artifacts/nerves_system_rpi0-2.1.2/staging/usr/include/features.h:564,387 from /home/nerves/.nerves/artifacts/nerves_system_rpi0-2.1.2/staging/usr/include/sys/types.h:25,388 from /usr/local/lib/erlang/erts-17.1/include/erl_drv_nif.h:161,389 from /usr/local/lib/erlang/erts-17.1/include/erl_nif.h:33,390 from c_src/func_cci.c:2:391/home/nerves/.nerves/artifacts/nerves_system_rpi0-2.1.2/staging/usr/include/gnu/stubs.h:7:11: fatal error: gnu/stubs-soft.h: No such file or directory392 7 | # include <gnu/stubs-soft.h>393 | ^~~~~~~~~~~~~~~~~~394compilation terminated.395In file included from /home/nerves/.nerves/artifacts/nerves_system_rpi0-2.1.2/staging/usr/include/features.h:564,396 from /home/nerves/.nerves/artifacts/nerves_system_rpi0-2.1.2/staging/usr/include/sys/types.h:25,397 from /usr/local/lib/erlang/erts-17.1/include/erl_drv_nif.h:161,398 from /usr/local/lib/erlang/erts-17.1/include/erl_nif.h:33,399 from c_src/func_cdl2_crows.c:2:400/home/nerves/.nerves/artifacts/nerves_system_rpi0-2.1.2/staging/usr/include/gnu/stubs.h:7:11: fatal error: gnu/stubs-soft.h: No such file or directory401 7 | # include <gnu/stubs-soft.h>402 | ^~~~~~~~~~~~~~~~~~403compilation terminated.404In file included from /home/nerves/.nerves/artifacts/nerves_system_rpi0-2.1.2/staging/usr/include/features.h:564,405 from /home/nerves/.nerves/artifacts/nerves_system_rpi0-2.1.2/staging/usr/include/sys/types.h:25,406 from /usr/local/lib/erlang/erts-17.1/include/erl_drv_nif.h:161,407 from /usr/local/lib/erlang/erts-17.1/include/erl_nif.h:33,408 from c_src/func_cdl3_black_crows.c:2:409/home/nerves/.nerves/artifacts/nerves_system_rpi0-2.1.2/staging/usr/include/gnu/stubs.h:7:11: fatal error: gnu/stubs-soft.h: No such file or directory410 7 | # include <gnu/stubs-soft.h>411 | ^~~~~~~~~~~~~~~~~~412compilation terminated.413In file included from /home/nerves/.nerves/artifacts/nerves_system_rpi0-2.1.2/staging/usr/include/features.h:564,414 from /home/nerves/.nerves/artifacts/nerves_system_rpi0-2.1.2/staging/usr/include/sys/types.h:25,415 from /usr/local/lib/erlang/erts-17.1/include/erl_drv_nif.h:161,416 from /usr/local/lib/erlang/erts-17.1/include/erl_nif.h:33,417 from c_src/func_cdl3_inside.c:2:418/home/nerves/.nerves/artifacts/nerves_system_rpi0-2.1.2/staging/usr/include/gnu/stubs.h:7:11: fatal error: gnu/stubs-soft.h: No such file or directory419 7 | # include <gnu/stubs-soft.h>420 | ^~~~~~~~~~~~~~~~~~421compilation terminated.422In file included from /home/nerves/.nerves/artifacts/nerves_system_rpi0-2.1.2/staging/usr/include/features.h:564,423 from /home/nerves/.nerves/artifacts/nerves_system_rpi0-2.1.2/staging/usr/include/sys/types.h:25,424 from /usr/local/lib/erlang/erts-17.1/include/erl_drv_nif.h:161,425 from /usr/local/lib/erlang/erts-17.1/include/erl_nif.h:33,426 from c_src/func_cdl3_line_strike.c:2:427/home/nerves/.nerves/artifacts/nerves_system_rpi0-2.1.2/staging/usr/include/gnu/stubs.h:7:11: fatal error: gnu/stubs-soft.h: No such file or directory428 7 | # include <gnu/stubs-soft.h>429 | ^~~~~~~~~~~~~~~~~~430compilation terminated.431In file included from /home/nerves/.nerves/artifacts/nerves_system_rpi0-2.1.2/staging/usr/include/features.h:564,432 from /home/nerves/.nerves/artifacts/nerves_system_rpi0-2.1.2/staging/usr/include/sys/types.h:25,433 from /usr/local/lib/erlang/erts-17.1/include/erl_drv_nif.h:161,434 from /usr/local/lib/erlang/erts-17.1/include/erl_nif.h:33,435 from c_src/func_cdl3_outside.c:2:436/home/nerves/.nerves/artifacts/nerves_system_rpi0-2.1.2/staging/usr/include/gnu/stubs.h:7:11: fatal error: gnu/stubs-soft.h: No such file or directory437 7 | # include <gnu/stubs-soft.h>438 | ^~~~~~~~~~~~~~~~~~439compilation terminated.440In file included from /home/nerves/.nerves/artifacts/nerves_system_rpi0-2.1.2/staging/usr/include/features.h:564,441 from /home/nerves/.nerves/artifacts/nerves_system_rpi0-2.1.2/staging/usr/include/sys/types.h:25,442 from /usr/local/lib/erlang/erts-17.1/include/erl_drv_nif.h:161,443 from /usr/local/lib/erlang/erts-17.1/include/erl_nif.h:33,444 from c_src/func_cdl3_stars_in_south.c:2:445/home/nerves/.nerves/artifacts/nerves_system_rpi0-2.1.2/staging/usr/include/gnu/stubs.h:7:11: fatal error: gnu/stubs-soft.h: No such file or directory446 7 | # include <gnu/stubs-soft.h>447 | ^~~~~~~~~~~~~~~~~~448compilation terminated.449In file included from /home/nerves/.nerves/artifacts/nerves_system_rpi0-2.1.2/staging/usr/include/features.h:564,450 from /home/nerves/.nerves/artifacts/nerves_system_rpi0-2.1.2/staging/usr/include/sys/types.h:25,451 from /usr/local/lib/erlang/erts-17.1/include/erl_drv_nif.h:161,452 from /usr/local/lib/erlang/erts-17.1/include/erl_nif.h:33,453 from c_src/func_cdl3_white_soldiers.c:2:454/home/nerves/.nerves/artifacts/nerves_system_rpi0-2.1.2/staging/usr/include/gnu/stubs.h:7:11: fatal error: gnu/stubs-soft.h: No such file or directory455 7 | # include <gnu/stubs-soft.h>456 | ^~~~~~~~~~~~~~~~~~457compilation terminated.458In file included from /home/nerves/.nerves/artifacts/nerves_system_rpi0-2.1.2/staging/usr/include/features.h:564,459 from /home/nerves/.nerves/artifacts/nerves_system_rpi0-2.1.2/staging/usr/include/sys/types.h:25,460 from /usr/local/lib/erlang/erts-17.1/include/erl_drv_nif.h:161,461 from /usr/local/lib/erlang/erts-17.1/include/erl_nif.h:33,462 from c_src/func_cdl_abandoned_baby.c:2:463/home/nerves/.nerves/artifacts/nerves_system_rpi0-2.1.2/staging/usr/include/gnu/stubs.h:7:11: fatal error: gnu/stubs-soft.h: No such file or directory464 7 | # include <gnu/stubs-soft.h>465 | ^~~~~~~~~~~~~~~~~~466compilation terminated.467In file included from /home/nerves/.nerves/artifacts/nerves_system_rpi0-2.1.2/staging/usr/include/features.h:564,468 from /home/nerves/.nerves/artifacts/nerves_system_rpi0-2.1.2/staging/usr/include/sys/types.h:25,469 from /usr/local/lib/erlang/erts-17.1/include/erl_drv_nif.h:161,470 from /usr/local/lib/erlang/erts-17.1/include/erl_nif.h:33,471 from c_src/func_cdl_advance_block.c:2:472/home/nerves/.nerves/artifacts/nerves_system_rpi0-2.1.2/staging/usr/include/gnu/stubs.h:7:11: fatal error: gnu/stubs-soft.h: No such file or directory473 7 | # include <gnu/stubs-soft.h>474 | ^~~~~~~~~~~~~~~~~~475compilation terminated.476In file included from /home/nerves/.nerves/artifacts/nerves_system_rpi0-2.1.2/staging/usr/include/features.h:564,477 from /home/nerves/.nerves/artifacts/nerves_system_rpi0-2.1.2/staging/usr/include/sys/types.h:25,478 from /usr/local/lib/erlang/erts-17.1/include/erl_drv_nif.h:161,479 from /usr/local/lib/erlang/erts-17.1/include/erl_nif.h:33,480 from c_src/func_cdl_belt_hold.c:2:481/home/nerves/.nerves/artifacts/nerves_system_rpi0-2.1.2/staging/usr/include/gnu/stubs.h:7:11: fatal error: gnu/stubs-soft.h: No such file or directory482 7 | # include <gnu/stubs-soft.h>483 | ^~~~~~~~~~~~~~~~~~484compilation terminated.485In file included from /home/nerves/.nerves/artifacts/nerves_system_rpi0-2.1.2/staging/usr/include/features.h:564,486 from /home/nerves/.nerves/artifacts/nerves_system_rpi0-2.1.2/staging/usr/include/sys/types.h:25,487 from /usr/local/lib/erlang/erts-17.1/include/erl_drv_nif.h:161,488 from /usr/local/lib/erlang/erts-17.1/include/erl_nif.h:33,489 from c_src/func_cdl_breakaway.c:2:490/home/nerves/.nerves/artifacts/nerves_system_rpi0-2.1.2/staging/usr/include/gnu/stubs.h:7:11: fatal error: gnu/stubs-soft.h: No such file or directory491 7 | # include <gnu/stubs-soft.h>492 | ^~~~~~~~~~~~~~~~~~493compilation terminated.494In file included from /home/nerves/.nerves/artifacts/nerves_system_rpi0-2.1.2/staging/usr/include/features.h:564,495 from /home/nerves/.nerves/artifacts/nerves_system_rpi0-2.1.2/staging/usr/include/sys/types.h:25,496 from /usr/local/lib/erlang/erts-17.1/include/erl_drv_nif.h:161,497 from /usr/local/lib/erlang/erts-17.1/include/erl_nif.h:33,498 from c_src/func_cdl_closing_marubozu.c:2:499/home/nerves/.nerves/artifacts/nerves_system_rpi0-2.1.2/staging/usr/include/gnu/stubs.h:7:11: fatal error: gnu/stubs-soft.h: No such file or directory500 7 | # include <gnu/stubs-soft.h>501 | ^~~~~~~~~~~~~~~~~~502compilation terminated.503In file included from /home/nerves/.nerves/artifacts/nerves_system_rpi0-2.1.2/staging/usr/include/features.h:564,504 from /home/nerves/.nerves/artifacts/nerves_system_rpi0-2.1.2/staging/usr/include/sys/types.h:25,505 from /usr/local/lib/erlang/erts-17.1/include/erl_drv_nif.h:161,506 from /usr/local/lib/erlang/erts-17.1/include/erl_nif.h:33,507 from c_src/func_cdl_conceal_baby_swallow.c:2:508/home/nerves/.nerves/artifacts/nerves_system_rpi0-2.1.2/staging/usr/include/gnu/stubs.h:7:11: fatal error: gnu/stubs-soft.h: No such file or directory509 7 | # include <gnu/stubs-soft.h>510 | ^~~~~~~~~~~~~~~~~~511compilation terminated.512In file included from /home/nerves/.nerves/artifacts/nerves_system_rpi0-2.1.2/staging/usr/include/features.h:564,513 from /home/nerves/.nerves/artifacts/nerves_system_rpi0-2.1.2/staging/usr/include/sys/types.h:25,514 from /usr/local/lib/erlang/erts-17.1/include/erl_drv_nif.h:161,515 from /usr/local/lib/erlang/erts-17.1/include/erl_nif.h:33,516 from c_src/func_cdl_counterattack.c:2:517/home/nerves/.nerves/artifacts/nerves_system_rpi0-2.1.2/staging/usr/include/gnu/stubs.h:7:11: fatal error: gnu/stubs-soft.h: No such file or directory518 7 | # include <gnu/stubs-soft.h>519 | ^~~~~~~~~~~~~~~~~~520compilation terminated.521In file included from /home/nerves/.nerves/artifacts/nerves_system_rpi0-2.1.2/staging/usr/include/features.h:564,522 from /home/nerves/.nerves/artifacts/nerves_system_rpi0-2.1.2/staging/usr/include/sys/types.h:25,523 from /usr/local/lib/erlang/erts-17.1/include/erl_drv_nif.h:161,524 from /usr/local/lib/erlang/erts-17.1/include/erl_nif.h:33,525 from c_src/func_cdl_dark_cloud_cover.c:2:526/home/nerves/.nerves/artifacts/nerves_system_rpi0-2.1.2/staging/usr/include/gnu/stubs.h:7:11: fatal error: gnu/stubs-soft.h: No such file or directory527 7 | # include <gnu/stubs-soft.h>528 | ^~~~~~~~~~~~~~~~~~529compilation terminated.530In file included from /home/nerves/.nerves/artifacts/nerves_system_rpi0-2.1.2/staging/usr/include/features.h:564,531 from /home/nerves/.nerves/artifacts/nerves_system_rpi0-2.1.2/staging/usr/include/sys/types.h:25,532 from /usr/local/lib/erlang/erts-17.1/include/erl_drv_nif.h:161,533 from /usr/local/lib/erlang/erts-17.1/include/erl_nif.h:33,534 from c_src/func_cdl_doji.c:2:535/home/nerves/.nerves/artifacts/nerves_system_rpi0-2.1.2/staging/usr/include/gnu/stubs.h:7:11: fatal error: gnu/stubs-soft.h: No such file or directory536 7 | # include <gnu/stubs-soft.h>537 | ^~~~~~~~~~~~~~~~~~538compilation terminated.539In file included from /home/nerves/.nerves/artifacts/nerves_system_rpi0-2.1.2/staging/usr/include/features.h:564,540 from /home/nerves/.nerves/artifacts/nerves_system_rpi0-2.1.2/staging/usr/include/sys/types.h:25,541 from /usr/local/lib/erlang/erts-17.1/include/erl_drv_nif.h:161,542 from /usr/local/lib/erlang/erts-17.1/include/erl_nif.h:33,543 from c_src/func_cdl_doji_star.c:2:544/home/nerves/.nerves/artifacts/nerves_system_rpi0-2.1.2/staging/usr/include/gnu/stubs.h:7:11: fatal error: gnu/stubs-soft.h: No such file or directory545 7 | # include <gnu/stubs-soft.h>546 | ^~~~~~~~~~~~~~~~~~547compilation terminated.548In file included from /home/nerves/.nerves/artifacts/nerves_system_rpi0-2.1.2/staging/usr/include/features.h:564,549 from /home/nerves/.nerves/artifacts/nerves_system_rpi0-2.1.2/staging/usr/include/sys/types.h:25,550 from /usr/local/lib/erlang/erts-17.1/include/erl_drv_nif.h:161,551 from /usr/local/lib/erlang/erts-17.1/include/erl_nif.h:33,552 from c_src/func_cdl_dragonfly_doji.c:2:553/home/nerves/.nerves/artifacts/nerves_system_rpi0-2.1.2/staging/usr/include/gnu/stubs.h:7:11: fatal error: gnu/stubs-soft.h: No such file or directory554 7 | # include <gnu/stubs-soft.h>555 | ^~~~~~~~~~~~~~~~~~556compilation terminated.557In file included from /home/nerves/.nerves/artifacts/nerves_system_rpi0-2.1.2/staging/usr/include/features.h:564,558 from /home/nerves/.nerves/artifacts/nerves_system_rpi0-2.1.2/staging/usr/include/sys/types.h:25,559 from /usr/local/lib/erlang/erts-17.1/include/erl_drv_nif.h:161,560 from /usr/local/lib/erlang/erts-17.1/include/erl_nif.h:33,561 from c_src/func_cdl_engulfing.c:2:562/home/nerves/.nerves/artifacts/nerves_system_rpi0-2.1.2/staging/usr/include/gnu/stubs.h:7:11: fatal error: gnu/stubs-soft.h: No such file or directory563 7 | # include <gnu/stubs-soft.h>564 | ^~~~~~~~~~~~~~~~~~565compilation terminated.566In file included from /home/nerves/.nerves/artifacts/nerves_system_rpi0-2.1.2/staging/usr/include/features.h:564,567 from /home/nerves/.nerves/artifacts/nerves_system_rpi0-2.1.2/staging/usr/include/sys/types.h:25,568 from /usr/local/lib/erlang/erts-17.1/include/erl_drv_nif.h:161,569 from /usr/local/lib/erlang/erts-17.1/include/erl_nif.h:33,570 from c_src/func_cdl_evening_doji_star.c:2:571/home/nerves/.nerves/artifacts/nerves_system_rpi0-2.1.2/staging/usr/include/gnu/stubs.h:7:11: fatal error: gnu/stubs-soft.h: No such file or directory572 7 | # include <gnu/stubs-soft.h>573 | ^~~~~~~~~~~~~~~~~~574compilation terminated.575In file included from /home/nerves/.nerves/artifacts/nerves_system_rpi0-2.1.2/staging/usr/include/features.h:564,576 from /home/nerves/.nerves/artifacts/nerves_system_rpi0-2.1.2/staging/usr/include/sys/types.h:25,577 from /usr/local/lib/erlang/erts-17.1/include/erl_drv_nif.h:161,578 from /usr/local/lib/erlang/erts-17.1/include/erl_nif.h:33,579 from c_src/func_cdl_evening_star.c:2:580/home/nerves/.nerves/artifacts/nerves_system_rpi0-2.1.2/staging/usr/include/gnu/stubs.h:7:11: fatal error: gnu/stubs-soft.h: No such file or directory581 7 | # include <gnu/stubs-soft.h>582 | ^~~~~~~~~~~~~~~~~~583compilation terminated.584In file included from /home/nerves/.nerves/artifacts/nerves_system_rpi0-2.1.2/staging/usr/include/features.h:564,585 from /home/nerves/.nerves/artifacts/nerves_system_rpi0-2.1.2/staging/usr/include/sys/types.h:25,586 from /usr/local/lib/erlang/erts-17.1/include/erl_drv_nif.h:161,587 from /usr/local/lib/erlang/erts-17.1/include/erl_nif.h:33,588 from c_src/func_cdl_gap_side_side_white.c:2:589/home/nerves/.nerves/artifacts/nerves_system_rpi0-2.1.2/staging/usr/include/gnu/stubs.h:7:11: fatal error: gnu/stubs-soft.h: No such file or directory590 7 | # include <gnu/stubs-soft.h>591 | ^~~~~~~~~~~~~~~~~~592compilation terminated.593In file included from /home/nerves/.nerves/artifacts/nerves_system_rpi0-2.1.2/staging/usr/include/features.h:564,594 from /home/nerves/.nerves/artifacts/nerves_system_rpi0-2.1.2/staging/usr/include/sys/types.h:25,595 from /usr/local/lib/erlang/erts-17.1/include/erl_drv_nif.h:161,596 from /usr/local/lib/erlang/erts-17.1/include/erl_nif.h:33,597 from c_src/func_cdl_gravestone_doji.c:2:598/home/nerves/.nerves/artifacts/nerves_system_rpi0-2.1.2/staging/usr/include/gnu/stubs.h:7:11: fatal error: gnu/stubs-soft.h: No such file or directory599 7 | # include <gnu/stubs-soft.h>600 | ^~~~~~~~~~~~~~~~~~601compilation terminated.602In file included from /home/nerves/.nerves/artifacts/nerves_system_rpi0-2.1.2/staging/usr/include/features.h:564,603 from /home/nerves/.nerves/artifacts/nerves_system_rpi0-2.1.2/staging/usr/include/sys/types.h:25,604 from /usr/local/lib/erlang/erts-17.1/include/erl_drv_nif.h:161,605 from /usr/local/lib/erlang/erts-17.1/include/erl_nif.h:33,606 from c_src/func_cdl_hammer.c:2:607/home/nerves/.nerves/artifacts/nerves_system_rpi0-2.1.2/staging/usr/include/gnu/stubs.h:7:11: fatal error: gnu/stubs-soft.h: No such file or directory608 7 | # include <gnu/stubs-soft.h>609 | ^~~~~~~~~~~~~~~~~~610compilation terminated.611In file included from /home/nerves/.nerves/artifacts/nerves_system_rpi0-2.1.2/staging/usr/include/features.h:564,612 from /home/nerves/.nerves/artifacts/nerves_system_rpi0-2.1.2/staging/usr/include/sys/types.h:25,613 from /usr/local/lib/erlang/erts-17.1/include/erl_drv_nif.h:161,614 from /usr/local/lib/erlang/erts-17.1/include/erl_nif.h:33,615 from c_src/func_cdl_hanging_man.c:2:616/home/nerves/.nerves/artifacts/nerves_system_rpi0-2.1.2/staging/usr/include/gnu/stubs.h:7:11: fatal error: gnu/stubs-soft.h: No such file or directory617 7 | # include <gnu/stubs-soft.h>618 | ^~~~~~~~~~~~~~~~~~619compilation terminated.620In file included from /home/nerves/.nerves/artifacts/nerves_system_rpi0-2.1.2/staging/usr/include/features.h:564,621 from /home/nerves/.nerves/artifacts/nerves_system_rpi0-2.1.2/staging/usr/include/sys/types.h:25,622 from /usr/local/lib/erlang/erts-17.1/include/erl_drv_nif.h:161,623 from /usr/local/lib/erlang/erts-17.1/include/erl_nif.h:33,624 from c_src/func_cdl_harami.c:2:625/home/nerves/.nerves/artifacts/nerves_system_rpi0-2.1.2/staging/usr/include/gnu/stubs.h:7:11: fatal error: gnu/stubs-soft.h: No such file or directory626 7 | # include <gnu/stubs-soft.h>627 | ^~~~~~~~~~~~~~~~~~628compilation terminated.629In file included from /home/nerves/.nerves/artifacts/nerves_system_rpi0-2.1.2/staging/usr/include/features.h:564,630 from /home/nerves/.nerves/artifacts/nerves_system_rpi0-2.1.2/staging/usr/include/sys/types.h:25,631 from /usr/local/lib/erlang/erts-17.1/include/erl_drv_nif.h:161,632 from /usr/local/lib/erlang/erts-17.1/include/erl_nif.h:33,633 from c_src/func_cdl_harami_cross.c:2:634/home/nerves/.nerves/artifacts/nerves_system_rpi0-2.1.2/staging/usr/include/gnu/stubs.h:7:11: fatal error: gnu/stubs-soft.h: No such file or directory635 7 | # include <gnu/stubs-soft.h>636 | ^~~~~~~~~~~~~~~~~~637compilation terminated.638In file included from /home/nerves/.nerves/artifacts/nerves_system_rpi0-2.1.2/staging/usr/include/features.h:564,639 from /home/nerves/.nerves/artifacts/nerves_system_rpi0-2.1.2/staging/usr/include/sys/types.h:25,640 from /usr/local/lib/erlang/erts-17.1/include/erl_drv_nif.h:161,641 from /usr/local/lib/erlang/erts-17.1/include/erl_nif.h:33,642 from c_src/func_cdl_highwave.c:2:643/home/nerves/.nerves/artifacts/nerves_system_rpi0-2.1.2/staging/usr/include/gnu/stubs.h:7:11: fatal error: gnu/stubs-soft.h: No such file or directory644 7 | # include <gnu/stubs-soft.h>645 | ^~~~~~~~~~~~~~~~~~646compilation terminated.647In file included from /home/nerves/.nerves/artifacts/nerves_system_rpi0-2.1.2/staging/usr/include/features.h:564,648 from /home/nerves/.nerves/artifacts/nerves_system_rpi0-2.1.2/staging/usr/include/sys/types.h:25,649 from /usr/local/lib/erlang/erts-17.1/include/erl_drv_nif.h:161,650 from /usr/local/lib/erlang/erts-17.1/include/erl_nif.h:33,651 from c_src/func_cdl_hikkake.c:2:652/home/nerves/.nerves/artifacts/nerves_system_rpi0-2.1.2/staging/usr/include/gnu/stubs.h:7:11: fatal error: gnu/stubs-soft.h: No such file or directory653 7 | # include <gnu/stubs-soft.h>654 | ^~~~~~~~~~~~~~~~~~655compilation terminated.656In file included from /home/nerves/.nerves/artifacts/nerves_system_rpi0-2.1.2/staging/usr/include/features.h:564,657 from /home/nerves/.nerves/artifacts/nerves_system_rpi0-2.1.2/staging/usr/include/sys/types.h:25,658 from /usr/local/lib/erlang/erts-17.1/include/erl_drv_nif.h:161,659 from /usr/local/lib/erlang/erts-17.1/include/erl_nif.h:33,660 from c_src/func_cdl_hikkake_mod.c:2:661/home/nerves/.nerves/artifacts/nerves_system_rpi0-2.1.2/staging/usr/include/gnu/stubs.h:7:11: fatal error: gnu/stubs-soft.h: No such file or directory662 7 | # include <gnu/stubs-soft.h>663 | ^~~~~~~~~~~~~~~~~~664compilation terminated.665In file included from /home/nerves/.nerves/artifacts/nerves_system_rpi0-2.1.2/staging/usr/include/features.h:564,666 from /home/nerves/.nerves/artifacts/nerves_system_rpi0-2.1.2/staging/usr/include/sys/types.h:25,667 from /usr/local/lib/erlang/erts-17.1/include/erl_drv_nif.h:161,668 from /usr/local/lib/erlang/erts-17.1/include/erl_nif.h:33,669 from c_src/func_cdl_homing_pigeon.c:2:670/home/nerves/.nerves/artifacts/nerves_system_rpi0-2.1.2/staging/usr/include/gnu/stubs.h:7:11: fatal error: gnu/stubs-soft.h: No such file or directory671 7 | # include <gnu/stubs-soft.h>672 | ^~~~~~~~~~~~~~~~~~673compilation terminated.674In file included from /home/nerves/.nerves/artifacts/nerves_system_rpi0-2.1.2/staging/usr/include/features.h:564,675 from /home/nerves/.nerves/artifacts/nerves_system_rpi0-2.1.2/staging/usr/include/sys/types.h:25,676 from /usr/local/lib/erlang/erts-17.1/include/erl_drv_nif.h:161,677 from /usr/local/lib/erlang/erts-17.1/include/erl_nif.h:33,678 from c_src/func_cdl_identical_3_crows.c:2:679/home/nerves/.nerves/artifacts/nerves_system_rpi0-2.1.2/staging/usr/include/gnu/stubs.h:7:11: fatal error: gnu/stubs-soft.h: No such file or directory680 7 | # include <gnu/stubs-soft.h>681 | ^~~~~~~~~~~~~~~~~~682compilation terminated.683In file included from /home/nerves/.nerves/artifacts/nerves_system_rpi0-2.1.2/staging/usr/include/features.h:564,684 from /home/nerves/.nerves/artifacts/nerves_system_rpi0-2.1.2/staging/usr/include/sys/types.h:25,685 from /usr/local/lib/erlang/erts-17.1/include/erl_drv_nif.h:161,686 from /usr/local/lib/erlang/erts-17.1/include/erl_nif.h:33,687 from c_src/func_cdl_inneck.c:2:688/home/nerves/.nerves/artifacts/nerves_system_rpi0-2.1.2/staging/usr/include/gnu/stubs.h:7:11: fatal error: gnu/stubs-soft.h: No such file or directory689 7 | # include <gnu/stubs-soft.h>690 | ^~~~~~~~~~~~~~~~~~691compilation terminated.692In file included from /home/nerves/.nerves/artifacts/nerves_system_rpi0-2.1.2/staging/usr/include/features.h:564,693 from /home/nerves/.nerves/artifacts/nerves_system_rpi0-2.1.2/staging/usr/include/sys/types.h:25,694 from /usr/local/lib/erlang/erts-17.1/include/erl_drv_nif.h:161,695 from /usr/local/lib/erlang/erts-17.1/include/erl_nif.h:33,696 from c_src/func_cdl_inverted_hammer.c:2:697/home/nerves/.nerves/artifacts/nerves_system_rpi0-2.1.2/staging/usr/include/gnu/stubs.h:7:11: fatal error: gnu/stubs-soft.h: No such file or directory698 7 | # include <gnu/stubs-soft.h>699 | ^~~~~~~~~~~~~~~~~~700compilation terminated.701In file included from /home/nerves/.nerves/artifacts/nerves_system_rpi0-2.1.2/staging/usr/include/features.h:564,702 from /home/nerves/.nerves/artifacts/nerves_system_rpi0-2.1.2/staging/usr/include/sys/types.h:25,703 from /usr/local/lib/erlang/erts-17.1/include/erl_drv_nif.h:161,704 from /usr/local/lib/erlang/erts-17.1/include/erl_nif.h:33,705 from c_src/func_cdl_kicking.c:2:706/home/nerves/.nerves/artifacts/nerves_system_rpi0-2.1.2/staging/usr/include/gnu/stubs.h:7:11: fatal error: gnu/stubs-soft.h: No such file or directory707 7 | # include <gnu/stubs-soft.h>708 | ^~~~~~~~~~~~~~~~~~709compilation terminated.710In file included from /home/nerves/.nerves/artifacts/nerves_system_rpi0-2.1.2/staging/usr/include/features.h:564,711 from /home/nerves/.nerves/artifacts/nerves_system_rpi0-2.1.2/staging/usr/include/sys/types.h:25,712 from /usr/local/lib/erlang/erts-17.1/include/erl_drv_nif.h:161,713 from /usr/local/lib/erlang/erts-17.1/include/erl_nif.h:33,714 from c_src/func_cdl_kicking_by_length.c:2:715/home/nerves/.nerves/artifacts/nerves_system_rpi0-2.1.2/staging/usr/include/gnu/stubs.h:7:11: fatal error: gnu/stubs-soft.h: No such file or directory716 7 | # include <gnu/stubs-soft.h>717 | ^~~~~~~~~~~~~~~~~~718compilation terminated.719In file included from /home/nerves/.nerves/artifacts/nerves_system_rpi0-2.1.2/staging/usr/include/features.h:564,720 from /home/nerves/.nerves/artifacts/nerves_system_rpi0-2.1.2/staging/usr/include/sys/types.h:25,721 from /usr/local/lib/erlang/erts-17.1/include/erl_drv_nif.h:161,722 from /usr/local/lib/erlang/erts-17.1/include/erl_nif.h:33,723 from c_src/func_cdl_ladder_bottom.c:2:724/home/nerves/.nerves/artifacts/nerves_system_rpi0-2.1.2/staging/usr/include/gnu/stubs.h:7:11: fatal error: gnu/stubs-soft.h: No such file or directory725 7 | # include <gnu/stubs-soft.h>726 | ^~~~~~~~~~~~~~~~~~727compilation terminated.728In file included from /home/nerves/.nerves/artifacts/nerves_system_rpi0-2.1.2/staging/usr/include/features.h:564,729 from /home/nerves/.nerves/artifacts/nerves_system_rpi0-2.1.2/staging/usr/include/sys/types.h:25,730 from /usr/local/lib/erlang/erts-17.1/include/erl_drv_nif.h:161,731 from /usr/local/lib/erlang/erts-17.1/include/erl_nif.h:33,732 from c_src/func_cdl_long_legged_doji.c:2:733/home/nerves/.nerves/artifacts/nerves_system_rpi0-2.1.2/staging/usr/include/gnu/stubs.h:7:11: fatal error: gnu/stubs-soft.h: No such file or directory734 7 | # include <gnu/stubs-soft.h>735 | ^~~~~~~~~~~~~~~~~~736compilation terminated.737In file included from /home/nerves/.nerves/artifacts/nerves_system_rpi0-2.1.2/staging/usr/include/features.h:564,738 from /home/nerves/.nerves/artifacts/nerves_system_rpi0-2.1.2/staging/usr/include/sys/types.h:25,739 from /usr/local/lib/erlang/erts-17.1/include/erl_drv_nif.h:161,740 from /usr/local/lib/erlang/erts-17.1/include/erl_nif.h:33,741 from c_src/func_cdl_long_line.c:2:742/home/nerves/.nerves/artifacts/nerves_system_rpi0-2.1.2/staging/usr/include/gnu/stubs.h:7:11: fatal error: gnu/stubs-soft.h: No such file or directory743 7 | # include <gnu/stubs-soft.h>744 | ^~~~~~~~~~~~~~~~~~745compilation terminated.746In file included from /home/nerves/.nerves/artifacts/nerves_system_rpi0-2.1.2/staging/usr/include/features.h:564,747 from /home/nerves/.nerves/artifacts/nerves_system_rpi0-2.1.2/staging/usr/include/sys/types.h:25,748 from /usr/local/lib/erlang/erts-17.1/include/erl_drv_nif.h:161,749 from /usr/local/lib/erlang/erts-17.1/include/erl_nif.h:33,750 from c_src/func_cdl_marubozu.c:2:751/home/nerves/.nerves/artifacts/nerves_system_rpi0-2.1.2/staging/usr/include/gnu/stubs.h:7:11: fatal error: gnu/stubs-soft.h: No such file or directory752 7 | # include <gnu/stubs-soft.h>753 | ^~~~~~~~~~~~~~~~~~754compilation terminated.755In file included from /home/nerves/.nerves/artifacts/nerves_system_rpi0-2.1.2/staging/usr/include/features.h:564,756 from /home/nerves/.nerves/artifacts/nerves_system_rpi0-2.1.2/staging/usr/include/sys/types.h:25,757 from /usr/local/lib/erlang/erts-17.1/include/erl_drv_nif.h:161,758 from /usr/local/lib/erlang/erts-17.1/include/erl_nif.h:33,759 from c_src/func_cdl_mat_hold.c:2:760/home/nerves/.nerves/artifacts/nerves_system_rpi0-2.1.2/staging/usr/include/gnu/stubs.h:7:11: fatal error: gnu/stubs-soft.h: No such file or directory761 7 | # include <gnu/stubs-soft.h>762 | ^~~~~~~~~~~~~~~~~~763compilation terminated.764In file included from /home/nerves/.nerves/artifacts/nerves_system_rpi0-2.1.2/staging/usr/include/features.h:564,765 from /home/nerves/.nerves/artifacts/nerves_system_rpi0-2.1.2/staging/usr/include/sys/types.h:25,766 from /usr/local/lib/erlang/erts-17.1/include/erl_drv_nif.h:161,767 from /usr/local/lib/erlang/erts-17.1/include/erl_nif.h:33,768 from c_src/func_cdl_matching_low.c:2:769/home/nerves/.nerves/artifacts/nerves_system_rpi0-2.1.2/staging/usr/include/gnu/stubs.h:7:11: fatal error: gnu/stubs-soft.h: No such file or directory770 7 | # include <gnu/stubs-soft.h>771 | ^~~~~~~~~~~~~~~~~~772compilation terminated.773In file included from /home/nerves/.nerves/artifacts/nerves_system_rpi0-2.1.2/staging/usr/include/features.h:564,774 from /home/nerves/.nerves/artifacts/nerves_system_rpi0-2.1.2/staging/usr/include/sys/types.h:25,775 from /usr/local/lib/erlang/erts-17.1/include/erl_drv_nif.h:161,776 from /usr/local/lib/erlang/erts-17.1/include/erl_nif.h:33,777 from c_src/func_cdl_morning_doji_star.c:2:778/home/nerves/.nerves/artifacts/nerves_system_rpi0-2.1.2/staging/usr/include/gnu/stubs.h:7:11: fatal error: gnu/stubs-soft.h: No such file or directory779 7 | # include <gnu/stubs-soft.h>780 | ^~~~~~~~~~~~~~~~~~781compilation terminated.782In file included from /home/nerves/.nerves/artifacts/nerves_system_rpi0-2.1.2/staging/usr/include/features.h:564,783 from /home/nerves/.nerves/artifacts/nerves_system_rpi0-2.1.2/staging/usr/include/sys/types.h:25,784 from /usr/local/lib/erlang/erts-17.1/include/erl_drv_nif.h:161,785 from /usr/local/lib/erlang/erts-17.1/include/erl_nif.h:33,786 from c_src/func_cdl_morning_star.c:2:787/home/nerves/.nerves/artifacts/nerves_system_rpi0-2.1.2/staging/usr/include/gnu/stubs.h:7:11: fatal error: gnu/stubs-soft.h: No such file or directory788 7 | # include <gnu/stubs-soft.h>789 | ^~~~~~~~~~~~~~~~~~790compilation terminated.791In file included from /home/nerves/.nerves/artifacts/nerves_system_rpi0-2.1.2/staging/usr/include/features.h:564,792 from /home/nerves/.nerves/artifacts/nerves_system_rpi0-2.1.2/staging/usr/include/sys/types.h:25,793 from /usr/local/lib/erlang/erts-17.1/include/erl_drv_nif.h:161,794 from /usr/local/lib/erlang/erts-17.1/include/erl_nif.h:33,795 from c_src/func_cdl_on_neck.c:2:796/home/nerves/.nerves/artifacts/nerves_system_rpi0-2.1.2/staging/usr/include/gnu/stubs.h:7:11: fatal error: gnu/stubs-soft.h: No such file or directory797 7 | # include <gnu/stubs-soft.h>798 | ^~~~~~~~~~~~~~~~~~799compilation terminated.800In file included from /home/nerves/.nerves/artifacts/nerves_system_rpi0-2.1.2/staging/usr/include/features.h:564,801 from /home/nerves/.nerves/artifacts/nerves_system_rpi0-2.1.2/staging/usr/include/sys/types.h:25,802 from /usr/local/lib/erlang/erts-17.1/include/erl_drv_nif.h:161,803 from /usr/local/lib/erlang/erts-17.1/include/erl_nif.h:33,804 from c_src/func_cdl_piercing.c:2:805/home/nerves/.nerves/artifacts/nerves_system_rpi0-2.1.2/staging/usr/include/gnu/stubs.h:7:11: fatal error: gnu/stubs-soft.h: No such file or directory806 7 | # include <gnu/stubs-soft.h>807 | ^~~~~~~~~~~~~~~~~~808compilation terminated.809In file included from /home/nerves/.nerves/artifacts/nerves_system_rpi0-2.1.2/staging/usr/include/features.h:564,810 from /home/nerves/.nerves/artifacts/nerves_system_rpi0-2.1.2/staging/usr/include/sys/types.h:25,811 from /usr/local/lib/erlang/erts-17.1/include/erl_drv_nif.h:161,812 from /usr/local/lib/erlang/erts-17.1/include/erl_nif.h:33,813 from c_src/func_cdl_rickshaw_man.c:2:814/home/nerves/.nerves/artifacts/nerves_system_rpi0-2.1.2/staging/usr/include/gnu/stubs.h:7:11: fatal error: gnu/stubs-soft.h: No such file or directory815 7 | # include <gnu/stubs-soft.h>816 | ^~~~~~~~~~~~~~~~~~817compilation terminated.818In file included from /home/nerves/.nerves/artifacts/nerves_system_rpi0-2.1.2/staging/usr/include/features.h:564,819 from /home/nerves/.nerves/artifacts/nerves_system_rpi0-2.1.2/staging/usr/include/sys/types.h:25,820 from /usr/local/lib/erlang/erts-17.1/include/erl_drv_nif.h:161,821 from /usr/local/lib/erlang/erts-17.1/include/erl_nif.h:33,822 from c_src/func_cdl_rise_fall_3_methods.c:2:823/home/nerves/.nerves/artifacts/nerves_system_rpi0-2.1.2/staging/usr/include/gnu/stubs.h:7:11: fatal error: gnu/stubs-soft.h: No such file or directory824 7 | # include <gnu/stubs-soft.h>825 | ^~~~~~~~~~~~~~~~~~826compilation terminated.827In file included from /home/nerves/.nerves/artifacts/nerves_system_rpi0-2.1.2/staging/usr/include/features.h:564,828 from /home/nerves/.nerves/artifacts/nerves_system_rpi0-2.1.2/staging/usr/include/sys/types.h:25,829 from /usr/local/lib/erlang/erts-17.1/include/erl_drv_nif.h:161,830 from /usr/local/lib/erlang/erts-17.1/include/erl_nif.h:33,831 from c_src/func_cdl_separating_lines.c:2:832/home/nerves/.nerves/artifacts/nerves_system_rpi0-2.1.2/staging/usr/include/gnu/stubs.h:7:11: fatal error: gnu/stubs-soft.h: No such file or directory833 7 | # include <gnu/stubs-soft.h>834 | ^~~~~~~~~~~~~~~~~~835compilation terminated.836In file included from /home/nerves/.nerves/artifacts/nerves_system_rpi0-2.1.2/staging/usr/include/features.h:564,837 from /home/nerves/.nerves/artifacts/nerves_system_rpi0-2.1.2/staging/usr/include/sys/types.h:25,838 from /usr/local/lib/erlang/erts-17.1/include/erl_drv_nif.h:161,839 from /usr/local/lib/erlang/erts-17.1/include/erl_nif.h:33,840 from c_src/func_cdl_shooting_star.c:2:841/home/nerves/.nerves/artifacts/nerves_system_rpi0-2.1.2/staging/usr/include/gnu/stubs.h:7:11: fatal error: gnu/stubs-soft.h: No such file or directory842 7 | # include <gnu/stubs-soft.h>843 | ^~~~~~~~~~~~~~~~~~844compilation terminated.845In file included from /home/nerves/.nerves/artifacts/nerves_system_rpi0-2.1.2/staging/usr/include/features.h:564,846 from /home/nerves/.nerves/artifacts/nerves_system_rpi0-2.1.2/staging/usr/include/sys/types.h:25,847 from /usr/local/lib/erlang/erts-17.1/include/erl_drv_nif.h:161,848 from /usr/local/lib/erlang/erts-17.1/include/erl_nif.h:33,849 from c_src/func_cdl_short_line.c:2:850/home/nerves/.nerves/artifacts/nerves_system_rpi0-2.1.2/staging/usr/include/gnu/stubs.h:7:11: fatal error: gnu/stubs-soft.h: No such file or directory851 7 | # include <gnu/stubs-soft.h>852 | ^~~~~~~~~~~~~~~~~~853compilation terminated.854In file included from /home/nerves/.nerves/artifacts/nerves_system_rpi0-2.1.2/staging/usr/include/features.h:564,855 from /home/nerves/.nerves/artifacts/nerves_system_rpi0-2.1.2/staging/usr/include/sys/types.h:25,856 from /usr/local/lib/erlang/erts-17.1/include/erl_drv_nif.h:161,857 from /usr/local/lib/erlang/erts-17.1/include/erl_nif.h:33,858 from c_src/func_cdl_spinning_top.c:2:859/home/nerves/.nerves/artifacts/nerves_system_rpi0-2.1.2/staging/usr/include/gnu/stubs.h:7:11: fatal error: gnu/stubs-soft.h: No such file or directory860 7 | # include <gnu/stubs-soft.h>861 | ^~~~~~~~~~~~~~~~~~862compilation terminated.863In file included from /home/nerves/.nerves/artifacts/nerves_system_rpi0-2.1.2/staging/usr/include/features.h:564,864 from /home/nerves/.nerves/artifacts/nerves_system_rpi0-2.1.2/staging/usr/include/sys/types.h:25,865 from /usr/local/lib/erlang/erts-17.1/include/erl_drv_nif.h:161,866 from /usr/local/lib/erlang/erts-17.1/include/erl_nif.h:33,867 from c_src/func_cdl_stalled_pattern.c:2:868/home/nerves/.nerves/artifacts/nerves_system_rpi0-2.1.2/staging/usr/include/gnu/stubs.h:7:11: fatal error: gnu/stubs-soft.h: No such file or directory869 7 | # include <gnu/stubs-soft.h>870 | ^~~~~~~~~~~~~~~~~~871compilation terminated.872In file included from /home/nerves/.nerves/artifacts/nerves_system_rpi0-2.1.2/staging/usr/include/features.h:564,873 from /home/nerves/.nerves/artifacts/nerves_system_rpi0-2.1.2/staging/usr/include/sys/types.h:25,874 from /usr/local/lib/erlang/erts-17.1/include/erl_drv_nif.h:161,875 from /usr/local/lib/erlang/erts-17.1/include/erl_nif.h:33,876 from c_src/func_cdl_stick_sandwich.c:2:877/home/nerves/.nerves/artifacts/nerves_system_rpi0-2.1.2/staging/usr/include/gnu/stubs.h:7:11: fatal error: gnu/stubs-soft.h: No such file or directory878 7 | # include <gnu/stubs-soft.h>879 | ^~~~~~~~~~~~~~~~~~880compilation terminated.881In file included from /home/nerves/.nerves/artifacts/nerves_system_rpi0-2.1.2/staging/usr/include/features.h:564,882 from /home/nerves/.nerves/artifacts/nerves_system_rpi0-2.1.2/staging/usr/include/sys/types.h:25,883 from /usr/local/lib/erlang/erts-17.1/include/erl_drv_nif.h:161,884 from /usr/local/lib/erlang/erts-17.1/include/erl_nif.h:33,885 from c_src/func_cdl_takuri.c:2:886/home/nerves/.nerves/artifacts/nerves_system_rpi0-2.1.2/staging/usr/include/gnu/stubs.h:7:11: fatal error: gnu/stubs-soft.h: No such file or directory887 7 | # include <gnu/stubs-soft.h>888 | ^~~~~~~~~~~~~~~~~~889compilation terminated.890In file included from /home/nerves/.nerves/artifacts/nerves_system_rpi0-2.1.2/staging/usr/include/features.h:564,891 from /home/nerves/.nerves/artifacts/nerves_system_rpi0-2.1.2/staging/usr/include/sys/types.h:25,892 from /usr/local/lib/erlang/erts-17.1/include/erl_drv_nif.h:161,893 from /usr/local/lib/erlang/erts-17.1/include/erl_nif.h:33,894 from c_src/func_cdl_tasuki_gap.c:2:895/home/nerves/.nerves/artifacts/nerves_system_rpi0-2.1.2/staging/usr/include/gnu/stubs.h:7:11: fatal error: gnu/stubs-soft.h: No such file or directory896 7 | # include <gnu/stubs-soft.h>897 | ^~~~~~~~~~~~~~~~~~898compilation terminated.899In file included from /home/nerves/.nerves/artifacts/nerves_system_rpi0-2.1.2/staging/usr/include/features.h:564,900 from /home/nerves/.nerves/artifacts/nerves_system_rpi0-2.1.2/staging/usr/include/sys/types.h:25,901 from /usr/local/lib/erlang/erts-17.1/include/erl_drv_nif.h:161,902 from /usr/local/lib/erlang/erts-17.1/include/erl_nif.h:33,903 from c_src/func_cdl_thrusting.c:2:904/home/nerves/.nerves/artifacts/nerves_system_rpi0-2.1.2/staging/usr/include/gnu/stubs.h:7:11: fatal error: gnu/stubs-soft.h: No such file or directory905 7 | # include <gnu/stubs-soft.h>906 | ^~~~~~~~~~~~~~~~~~907compilation terminated.908In file included from /home/nerves/.nerves/artifacts/nerves_system_rpi0-2.1.2/staging/usr/include/features.h:564,909 from /home/nerves/.nerves/artifacts/nerves_system_rpi0-2.1.2/staging/usr/include/sys/types.h:25,910 from /usr/local/lib/erlang/erts-17.1/include/erl_drv_nif.h:161,911 from /usr/local/lib/erlang/erts-17.1/include/erl_nif.h:33,912 from c_src/func_cdl_tri_star.c:2:913/home/nerves/.nerves/artifacts/nerves_system_rpi0-2.1.2/staging/usr/include/gnu/stubs.h:7:11: fatal error: gnu/stubs-soft.h: No such file or directory914 7 | # include <gnu/stubs-soft.h>915 | ^~~~~~~~~~~~~~~~~~916compilation terminated.917In file included from /home/nerves/.nerves/artifacts/nerves_system_rpi0-2.1.2/staging/usr/include/features.h:564,918 from /home/nerves/.nerves/artifacts/nerves_system_rpi0-2.1.2/staging/usr/include/sys/types.h:25,919 from /usr/local/lib/erlang/erts-17.1/include/erl_drv_nif.h:161,920 from /usr/local/lib/erlang/erts-17.1/include/erl_nif.h:33,921 from c_src/func_cdl_unique_3_river.c:2:922/home/nerves/.nerves/artifacts/nerves_system_rpi0-2.1.2/staging/usr/include/gnu/stubs.h:7:11: fatal error: gnu/stubs-soft.h: No such file or directory923 7 | # include <gnu/stubs-soft.h>924 | ^~~~~~~~~~~~~~~~~~925compilation terminated.926In file included from /home/nerves/.nerves/artifacts/nerves_system_rpi0-2.1.2/staging/usr/include/features.h:564,927 from /home/nerves/.nerves/artifacts/nerves_system_rpi0-2.1.2/staging/usr/include/sys/types.h:25,928 from /usr/local/lib/erlang/erts-17.1/include/erl_drv_nif.h:161,929 from /usr/local/lib/erlang/erts-17.1/include/erl_nif.h:33,930 from c_src/func_cdl_upside_downside_gap_3_methods.c:2:931/home/nerves/.nerves/artifacts/nerves_system_rpi0-2.1.2/staging/usr/include/gnu/stubs.h:7:11: fatal error: gnu/stubs-soft.h: No such file or directory932 7 | # include <gnu/stubs-soft.h>933 | ^~~~~~~~~~~~~~~~~~934compilation terminated.935In file included from /home/nerves/.nerves/artifacts/nerves_system_rpi0-2.1.2/staging/usr/include/features.h:564,936 from /home/nerves/.nerves/artifacts/nerves_system_rpi0-2.1.2/staging/usr/include/sys/types.h:25,937 from /usr/local/lib/erlang/erts-17.1/include/erl_drv_nif.h:161,938 from /usr/local/lib/erlang/erts-17.1/include/erl_nif.h:33,939 from c_src/func_cdl_upside_gap_2_crows.c:2:940/home/nerves/.nerves/artifacts/nerves_system_rpi0-2.1.2/staging/usr/include/gnu/stubs.h:7:11: fatal error: gnu/stubs-soft.h: No such file or directory941 7 | # include <gnu/stubs-soft.h>942 | ^~~~~~~~~~~~~~~~~~943compilation terminated.944In file included from /home/nerves/.nerves/artifacts/nerves_system_rpi0-2.1.2/staging/usr/include/features.h:564,945 from /home/nerves/.nerves/artifacts/nerves_system_rpi0-2.1.2/staging/usr/include/sys/types.h:25,946 from /usr/local/lib/erlang/erts-17.1/include/erl_drv_nif.h:161,947 from /usr/local/lib/erlang/erts-17.1/include/erl_nif.h:33,948 from c_src/func_ceil.c:2:949/home/nerves/.nerves/artifacts/nerves_system_rpi0-2.1.2/staging/usr/include/gnu/stubs.h:7:11: fatal error: gnu/stubs-soft.h: No such file or directory950 7 | # include <gnu/stubs-soft.h>951 | ^~~~~~~~~~~~~~~~~~952compilation terminated.953In file included from /home/nerves/.nerves/artifacts/nerves_system_rpi0-2.1.2/staging/usr/include/features.h:564,954 from /home/nerves/.nerves/artifacts/nerves_system_rpi0-2.1.2/staging/usr/include/sys/types.h:25,955 from /usr/local/lib/erlang/erts-17.1/include/erl_drv_nif.h:161,956 from /usr/local/lib/erlang/erts-17.1/include/erl_nif.h:33,957 from c_src/func_cmo.c:2:958/home/nerves/.nerves/artifacts/nerves_system_rpi0-2.1.2/staging/usr/include/gnu/stubs.h:7:11: fatal error: gnu/stubs-soft.h: No such file or directory959 7 | # include <gnu/stubs-soft.h>960 | ^~~~~~~~~~~~~~~~~~961compilation terminated.962In file included from /home/nerves/.nerves/artifacts/nerves_system_rpi0-2.1.2/staging/usr/include/features.h:564,963 from /home/nerves/.nerves/artifacts/nerves_system_rpi0-2.1.2/staging/usr/include/sys/types.h:25,964 from /usr/local/lib/erlang/erts-17.1/include/erl_drv_nif.h:161,965 from /usr/local/lib/erlang/erts-17.1/include/erl_nif.h:33,966 from c_src/func_correl.c:2:967/home/nerves/.nerves/artifacts/nerves_system_rpi0-2.1.2/staging/usr/include/gnu/stubs.h:7:11: fatal error: gnu/stubs-soft.h: No such file or directory968 7 | # include <gnu/stubs-soft.h>969 | ^~~~~~~~~~~~~~~~~~970compilation terminated.971In file included from /home/nerves/.nerves/artifacts/nerves_system_rpi0-2.1.2/staging/usr/include/features.h:564,972 from /home/nerves/.nerves/artifacts/nerves_system_rpi0-2.1.2/staging/usr/include/sys/types.h:25,973 from /usr/local/lib/erlang/erts-17.1/include/erl_drv_nif.h:161,974 from /usr/local/lib/erlang/erts-17.1/include/erl_nif.h:33,975 from c_src/func_cos.c:2:976/home/nerves/.nerves/artifacts/nerves_system_rpi0-2.1.2/staging/usr/include/gnu/stubs.h:7:11: fatal error: gnu/stubs-soft.h: No such file or directory977 7 | # include <gnu/stubs-soft.h>978 | ^~~~~~~~~~~~~~~~~~979compilation terminated.980In file included from /home/nerves/.nerves/artifacts/nerves_system_rpi0-2.1.2/staging/usr/include/features.h:564,981 from /home/nerves/.nerves/artifacts/nerves_system_rpi0-2.1.2/staging/usr/include/sys/types.h:25,982 from /usr/local/lib/erlang/erts-17.1/include/erl_drv_nif.h:161,983 from /usr/local/lib/erlang/erts-17.1/include/erl_nif.h:33,984 from c_src/func_cosh.c:2:985/home/nerves/.nerves/artifacts/nerves_system_rpi0-2.1.2/staging/usr/include/gnu/stubs.h:7:11: fatal error: gnu/stubs-soft.h: No such file or directory986 7 | # include <gnu/stubs-soft.h>987 | ^~~~~~~~~~~~~~~~~~988compilation terminated.989In file included from /home/nerves/.nerves/artifacts/nerves_system_rpi0-2.1.2/staging/usr/include/features.h:564,990 from /home/nerves/.nerves/artifacts/nerves_system_rpi0-2.1.2/staging/usr/include/sys/types.h:25,991 from /usr/local/lib/erlang/erts-17.1/include/erl_drv_nif.h:161,992 from /usr/local/lib/erlang/erts-17.1/include/erl_nif.h:33,993 from c_src/func_dema.c:2:994/home/nerves/.nerves/artifacts/nerves_system_rpi0-2.1.2/staging/usr/include/gnu/stubs.h:7:11: fatal error: gnu/stubs-soft.h: No such file or directory995 7 | # include <gnu/stubs-soft.h>996 | ^~~~~~~~~~~~~~~~~~997compilation terminated.998In file included from /home/nerves/.nerves/artifacts/nerves_system_rpi0-2.1.2/staging/usr/include/features.h:564,999 from /home/nerves/.nerves/artifacts/nerves_system_rpi0-2.1.2/staging/usr/include/sys/types.h:25,1000 from /usr/local/lib/erlang/erts-17.1/include/erl_drv_nif.h:161,1001 from /usr/local/lib/erlang/erts-17.1/include/erl_nif.h:33,1002 from c_src/func_div.c:2:1003/home/nerves/.nerves/artifacts/nerves_system_rpi0-2.1.2/staging/usr/include/gnu/stubs.h:7:11: fatal error: gnu/stubs-soft.h: No such file or directory1004 7 | # include <gnu/stubs-soft.h>1005 | ^~~~~~~~~~~~~~~~~~1006compilation terminated.1007In file included from /home/nerves/.nerves/artifacts/nerves_system_rpi0-2.1.2/staging/usr/include/features.h:564,1008 from /home/nerves/.nerves/artifacts/nerves_system_rpi0-2.1.2/staging/usr/include/sys/types.h:25,1009 from /usr/local/lib/erlang/erts-17.1/include/erl_drv_nif.h:161,1010 from /usr/local/lib/erlang/erts-17.1/include/erl_nif.h:33,1011 from c_src/func_dx.c:2:1012/home/nerves/.nerves/artifacts/nerves_system_rpi0-2.1.2/staging/usr/include/gnu/stubs.h:7:11: fatal error: gnu/stubs-soft.h: No such file or directory1013 7 | # include <gnu/stubs-soft.h>1014 | ^~~~~~~~~~~~~~~~~~1015compilation terminated.1016In file included from /home/nerves/.nerves/artifacts/nerves_system_rpi0-2.1.2/staging/usr/include/features.h:564,1017 from /home/nerves/.nerves/artifacts/nerves_system_rpi0-2.1.2/staging/usr/include/sys/types.h:25,1018 from /usr/local/lib/erlang/erts-17.1/include/erl_drv_nif.h:161,1019 from /usr/local/lib/erlang/erts-17.1/include/erl_nif.h:33,1020 from c_src/func_ema.c:2:1021/home/nerves/.nerves/artifacts/nerves_system_rpi0-2.1.2/staging/usr/include/gnu/stubs.h:7:11: fatal error: gnu/stubs-soft.h: No such file or directory1022 7 | # include <gnu/stubs-soft.h>1023 | ^~~~~~~~~~~~~~~~~~1024compilation terminated.1025In file included from /home/nerves/.nerves/artifacts/nerves_system_rpi0-2.1.2/staging/usr/include/features.h:564,1026 from /home/nerves/.nerves/artifacts/nerves_system_rpi0-2.1.2/staging/usr/include/sys/types.h:25,1027 from /usr/local/lib/erlang/erts-17.1/include/erl_drv_nif.h:161,1028 from /usr/local/lib/erlang/erts-17.1/include/erl_nif.h:33,1029 from c_src/func_exp.c:2:1030/home/nerves/.nerves/artifacts/nerves_system_rpi0-2.1.2/staging/usr/include/gnu/stubs.h:7:11: fatal error: gnu/stubs-soft.h: No such file or directory1031 7 | # include <gnu/stubs-soft.h>1032 | ^~~~~~~~~~~~~~~~~~1033compilation terminated.1034In file included from /home/nerves/.nerves/artifacts/nerves_system_rpi0-2.1.2/staging/usr/include/features.h:564,1035 from /home/nerves/.nerves/artifacts/nerves_system_rpi0-2.1.2/staging/usr/include/sys/types.h:25,1036 from /usr/local/lib/erlang/erts-17.1/include/erl_drv_nif.h:161,1037 from /usr/local/lib/erlang/erts-17.1/include/erl_nif.h:33,1038 from c_src/func_floor.c:2:1039/home/nerves/.nerves/artifacts/nerves_system_rpi0-2.1.2/staging/usr/include/gnu/stubs.h:7:11: fatal error: gnu/stubs-soft.h: No such file or directory1040 7 | # include <gnu/stubs-soft.h>1041 | ^~~~~~~~~~~~~~~~~~1042compilation terminated.1043In file included from /home/nerves/.nerves/artifacts/nerves_system_rpi0-2.1.2/staging/usr/include/features.h:564,1044 from /home/nerves/.nerves/artifacts/nerves_system_rpi0-2.1.2/staging/usr/include/sys/types.h:25,1045 from /usr/local/lib/erlang/erts-17.1/include/erl_drv_nif.h:161,1046 from /usr/local/lib/erlang/erts-17.1/include/erl_nif.h:33,1047 from c_src/func_ht_dcperiod.c:2:1048/home/nerves/.nerves/artifacts/nerves_system_rpi0-2.1.2/staging/usr/include/gnu/stubs.h:7:11: fatal error: gnu/stubs-soft.h: No such file or directory1049 7 | # include <gnu/stubs-soft.h>1050 | ^~~~~~~~~~~~~~~~~~1051compilation terminated.1052In file included from /home/nerves/.nerves/artifacts/nerves_system_rpi0-2.1.2/staging/usr/include/features.h:564,1053 from /home/nerves/.nerves/artifacts/nerves_system_rpi0-2.1.2/staging/usr/include/sys/types.h:25,1054 from /usr/local/lib/erlang/erts-17.1/include/erl_drv_nif.h:161,1055 from /usr/local/lib/erlang/erts-17.1/include/erl_nif.h:33,1056 from c_src/func_ht_dcphase.c:2:1057/home/nerves/.nerves/artifacts/nerves_system_rpi0-2.1.2/staging/usr/include/gnu/stubs.h:7:11: fatal error: gnu/stubs-soft.h: No such file or directory1058 7 | # include <gnu/stubs-soft.h>1059 | ^~~~~~~~~~~~~~~~~~1060compilation terminated.1061In file included from /home/nerves/.nerves/artifacts/nerves_system_rpi0-2.1.2/staging/usr/include/features.h:564,1062 from /home/nerves/.nerves/artifacts/nerves_system_rpi0-2.1.2/staging/usr/include/sys/types.h:25,1063 from /usr/local/lib/erlang/erts-17.1/include/erl_drv_nif.h:161,1064 from /usr/local/lib/erlang/erts-17.1/include/erl_nif.h:33,1065 from c_src/func_ht_phasor.c:2:1066/home/nerves/.nerves/artifacts/nerves_system_rpi0-2.1.2/staging/usr/include/gnu/stubs.h:7:11: fatal error: gnu/stubs-soft.h: No such file or directory1067 7 | # include <gnu/stubs-soft.h>1068 | ^~~~~~~~~~~~~~~~~~1069compilation terminated.1070In file included from /home/nerves/.nerves/artifacts/nerves_system_rpi0-2.1.2/staging/usr/include/features.h:564,1071 from /home/nerves/.nerves/artifacts/nerves_system_rpi0-2.1.2/staging/usr/include/sys/types.h:25,1072 from /usr/local/lib/erlang/erts-17.1/include/erl_drv_nif.h:161,1073 from /usr/local/lib/erlang/erts-17.1/include/erl_nif.h:33,1074 from c_src/func_ht_sine.c:2:1075/home/nerves/.nerves/artifacts/nerves_system_rpi0-2.1.2/staging/usr/include/gnu/stubs.h:7:11: fatal error: gnu/stubs-soft.h: No such file or directory1076 7 | # include <gnu/stubs-soft.h>1077 | ^~~~~~~~~~~~~~~~~~1078compilation terminated.1079In file included from /home/nerves/.nerves/artifacts/nerves_system_rpi0-2.1.2/staging/usr/include/features.h:564,1080 from /home/nerves/.nerves/artifacts/nerves_system_rpi0-2.1.2/staging/usr/include/sys/types.h:25,1081 from /usr/local/lib/erlang/erts-17.1/include/erl_drv_nif.h:161,1082 from /usr/local/lib/erlang/erts-17.1/include/erl_nif.h:33,1083 from c_src/func_ht_trendline.c:2:1084/home/nerves/.nerves/artifacts/nerves_system_rpi0-2.1.2/staging/usr/include/gnu/stubs.h:7:11: fatal error: gnu/stubs-soft.h: No such file or directory1085 7 | # include <gnu/stubs-soft.h>1086 | ^~~~~~~~~~~~~~~~~~1087compilation terminated.1088In file included from /home/nerves/.nerves/artifacts/nerves_system_rpi0-2.1.2/staging/usr/include/features.h:564,1089 from /home/nerves/.nerves/artifacts/nerves_system_rpi0-2.1.2/staging/usr/include/sys/types.h:25,1090 from /usr/local/lib/erlang/erts-17.1/include/erl_drv_nif.h:161,1091 from /usr/local/lib/erlang/erts-17.1/include/erl_nif.h:33,1092 from c_src/func_ht_trendmode.c:2:1093/home/nerves/.nerves/artifacts/nerves_system_rpi0-2.1.2/staging/usr/include/gnu/stubs.h:7:11: fatal error: gnu/stubs-soft.h: No such file or directory1094 7 | # include <gnu/stubs-soft.h>1095 | ^~~~~~~~~~~~~~~~~~1096compilation terminated.1097In file included from /home/nerves/.nerves/artifacts/nerves_system_rpi0-2.1.2/staging/usr/include/features.h:564,1098 from /home/nerves/.nerves/artifacts/nerves_system_rpi0-2.1.2/staging/usr/include/sys/types.h:25,1099 from /usr/local/lib/erlang/erts-17.1/include/erl_drv_nif.h:161,1100 from /usr/local/lib/erlang/erts-17.1/include/erl_nif.h:33,1101 from c_src/func_kama.c:2:1102/home/nerves/.nerves/artifacts/nerves_system_rpi0-2.1.2/staging/usr/include/gnu/stubs.h:7:11: fatal error: gnu/stubs-soft.h: No such file or directory1103 7 | # include <gnu/stubs-soft.h>1104 | ^~~~~~~~~~~~~~~~~~1105compilation terminated.1106In file included from /home/nerves/.nerves/artifacts/nerves_system_rpi0-2.1.2/staging/usr/include/features.h:564,1107 from /home/nerves/.nerves/artifacts/nerves_system_rpi0-2.1.2/staging/usr/include/sys/types.h:25,1108 from /usr/local/lib/erlang/erts-17.1/include/erl_drv_nif.h:161,1109 from /usr/local/lib/erlang/erts-17.1/include/erl_nif.h:33,1110 from c_src/func_linear_reg.c:2:1111/home/nerves/.nerves/artifacts/nerves_system_rpi0-2.1.2/staging/usr/include/gnu/stubs.h:7:11: fatal error: gnu/stubs-soft.h: No such file or directory1112 7 | # include <gnu/stubs-soft.h>1113 | ^~~~~~~~~~~~~~~~~~1114compilation terminated.1115In file included from /home/nerves/.nerves/artifacts/nerves_system_rpi0-2.1.2/staging/usr/include/features.h:564,1116 from /home/nerves/.nerves/artifacts/nerves_system_rpi0-2.1.2/staging/usr/include/sys/types.h:25,1117 from /usr/local/lib/erlang/erts-17.1/include/erl_drv_nif.h:161,1118 from /usr/local/lib/erlang/erts-17.1/include/erl_nif.h:33,1119 from c_src/func_linear_reg_angle.c:2:1120/home/nerves/.nerves/artifacts/nerves_system_rpi0-2.1.2/staging/usr/include/gnu/stubs.h:7:11: fatal error: gnu/stubs-soft.h: No such file or directory1121 7 | # include <gnu/stubs-soft.h>1122 | ^~~~~~~~~~~~~~~~~~1123compilation terminated.1124In file included from /home/nerves/.nerves/artifacts/nerves_system_rpi0-2.1.2/staging/usr/include/features.h:564,1125 from /home/nerves/.nerves/artifacts/nerves_system_rpi0-2.1.2/staging/usr/include/sys/types.h:25,1126 from /usr/local/lib/erlang/erts-17.1/include/erl_drv_nif.h:161,1127 from /usr/local/lib/erlang/erts-17.1/include/erl_nif.h:33,1128 from c_src/func_linear_reg_intercept.c:2:1129/home/nerves/.nerves/artifacts/nerves_system_rpi0-2.1.2/staging/usr/include/gnu/stubs.h:7:11: fatal error: gnu/stubs-soft.h: No such file or directory1130 7 | # include <gnu/stubs-soft.h>1131 | ^~~~~~~~~~~~~~~~~~1132compilation terminated.1133In file included from /home/nerves/.nerves/artifacts/nerves_system_rpi0-2.1.2/staging/usr/include/features.h:564,1134 from /home/nerves/.nerves/artifacts/nerves_system_rpi0-2.1.2/staging/usr/include/sys/types.h:25,1135 from /usr/local/lib/erlang/erts-17.1/include/erl_drv_nif.h:161,1136 from /usr/local/lib/erlang/erts-17.1/include/erl_nif.h:33,1137 from c_src/func_linear_reg_slope.c:2:1138/home/nerves/.nerves/artifacts/nerves_system_rpi0-2.1.2/staging/usr/include/gnu/stubs.h:7:11: fatal error: gnu/stubs-soft.h: No such file or directory1139 7 | # include <gnu/stubs-soft.h>1140 | ^~~~~~~~~~~~~~~~~~1141compilation terminated.1142In file included from /home/nerves/.nerves/artifacts/nerves_system_rpi0-2.1.2/staging/usr/include/features.h:564,1143 from /home/nerves/.nerves/artifacts/nerves_system_rpi0-2.1.2/staging/usr/include/sys/types.h:25,1144 from /usr/local/lib/erlang/erts-17.1/include/erl_drv_nif.h:161,1145 from /usr/local/lib/erlang/erts-17.1/include/erl_nif.h:33,1146 from c_src/func_ln.c:2:1147/home/nerves/.nerves/artifacts/nerves_system_rpi0-2.1.2/staging/usr/include/gnu/stubs.h:7:11: fatal error: gnu/stubs-soft.h: No such file or directory1148 7 | # include <gnu/stubs-soft.h>1149 | ^~~~~~~~~~~~~~~~~~1150compilation terminated.1151In file included from /home/nerves/.nerves/artifacts/nerves_system_rpi0-2.1.2/staging/usr/include/features.h:564,1152 from /home/nerves/.nerves/artifacts/nerves_system_rpi0-2.1.2/staging/usr/include/sys/types.h:25,1153 from /usr/local/lib/erlang/erts-17.1/include/erl_drv_nif.h:161,1154 from /usr/local/lib/erlang/erts-17.1/include/erl_nif.h:33,1155 from c_src/func_log10.c:2:1156/home/nerves/.nerves/artifacts/nerves_system_rpi0-2.1.2/staging/usr/include/gnu/stubs.h:7:11: fatal error: gnu/stubs-soft.h: No such file or directory1157 7 | # include <gnu/stubs-soft.h>1158 | ^~~~~~~~~~~~~~~~~~1159compilation terminated.1160In file included from /home/nerves/.nerves/artifacts/nerves_system_rpi0-2.1.2/staging/usr/include/features.h:564,1161 from /home/nerves/.nerves/artifacts/nerves_system_rpi0-2.1.2/staging/usr/include/sys/types.h:25,1162 from /usr/local/lib/erlang/erts-17.1/include/erl_drv_nif.h:161,1163 from /usr/local/lib/erlang/erts-17.1/include/erl_nif.h:33,1164 from c_src/func_ma.c:2:1165/home/nerves/.nerves/artifacts/nerves_system_rpi0-2.1.2/staging/usr/include/gnu/stubs.h:7:11: fatal error: gnu/stubs-soft.h: No such file or directory1166 7 | # include <gnu/stubs-soft.h>1167 | ^~~~~~~~~~~~~~~~~~1168compilation terminated.1169In file included from /home/nerves/.nerves/artifacts/nerves_system_rpi0-2.1.2/staging/usr/include/features.h:564,1170 from /home/nerves/.nerves/artifacts/nerves_system_rpi0-2.1.2/staging/usr/include/sys/types.h:25,1171 from /usr/local/lib/erlang/erts-17.1/include/erl_drv_nif.h:161,1172 from /usr/local/lib/erlang/erts-17.1/include/erl_nif.h:33,1173 from c_src/func_macd.c:2:1174/home/nerves/.nerves/artifacts/nerves_system_rpi0-2.1.2/staging/usr/include/gnu/stubs.h:7:11: fatal error: gnu/stubs-soft.h: No such file or directory1175 7 | # include <gnu/stubs-soft.h>1176 | ^~~~~~~~~~~~~~~~~~1177compilation terminated.1178In file included from /home/nerves/.nerves/artifacts/nerves_system_rpi0-2.1.2/staging/usr/include/features.h:564,1179 from /home/nerves/.nerves/artifacts/nerves_system_rpi0-2.1.2/staging/usr/include/sys/types.h:25,1180 from /usr/local/lib/erlang/erts-17.1/include/erl_drv_nif.h:161,1181 from /usr/local/lib/erlang/erts-17.1/include/erl_nif.h:33,1182 from c_src/func_macdext.c:2:1183/home/nerves/.nerves/artifacts/nerves_system_rpi0-2.1.2/staging/usr/include/gnu/stubs.h:7:11: fatal error: gnu/stubs-soft.h: No such file or directory1184 7 | # include <gnu/stubs-soft.h>1185 | ^~~~~~~~~~~~~~~~~~1186compilation terminated.1187In file included from /home/nerves/.nerves/artifacts/nerves_system_rpi0-2.1.2/staging/usr/include/features.h:564,1188 from /home/nerves/.nerves/artifacts/nerves_system_rpi0-2.1.2/staging/usr/include/sys/types.h:25,1189 from /usr/local/lib/erlang/erts-17.1/include/erl_drv_nif.h:161,1190 from /usr/local/lib/erlang/erts-17.1/include/erl_nif.h:33,1191 from c_src/func_macdfix.c:2:1192/home/nerves/.nerves/artifacts/nerves_system_rpi0-2.1.2/staging/usr/include/gnu/stubs.h:7:11: fatal error: gnu/stubs-soft.h: No such file or directory1193 7 | # include <gnu/stubs-soft.h>1194 | ^~~~~~~~~~~~~~~~~~1195compilation terminated.1196In file included from /home/nerves/.nerves/artifacts/nerves_system_rpi0-2.1.2/staging/usr/include/features.h:564,1197 from /home/nerves/.nerves/artifacts/nerves_system_rpi0-2.1.2/staging/usr/include/sys/types.h:25,1198 from /usr/local/lib/erlang/erts-17.1/include/erl_drv_nif.h:161,1199 from /usr/local/lib/erlang/erts-17.1/include/erl_nif.h:33,1200 from c_src/func_mama.c:2:1201/home/nerves/.nerves/artifacts/nerves_system_rpi0-2.1.2/staging/usr/include/gnu/stubs.h:7:11: fatal error: gnu/stubs-soft.h: No such file or directory1202 7 | # include <gnu/stubs-soft.h>1203 | ^~~~~~~~~~~~~~~~~~1204compilation terminated.1205In file included from /home/nerves/.nerves/artifacts/nerves_system_rpi0-2.1.2/staging/usr/include/features.h:564,1206 from /home/nerves/.nerves/artifacts/nerves_system_rpi0-2.1.2/staging/usr/include/sys/types.h:25,1207 from /usr/local/lib/erlang/erts-17.1/include/erl_drv_nif.h:161,1208 from /usr/local/lib/erlang/erts-17.1/include/erl_nif.h:33,1209 from c_src/func_mavp.c:2:1210/home/nerves/.nerves/artifacts/nerves_system_rpi0-2.1.2/staging/usr/include/gnu/stubs.h:7:11: fatal error: gnu/stubs-soft.h: No such file or directory1211 7 | # include <gnu/stubs-soft.h>1212 | ^~~~~~~~~~~~~~~~~~1213compilation terminated.1214In file included from /home/nerves/.nerves/artifacts/nerves_system_rpi0-2.1.2/staging/usr/include/features.h:564,1215 from /home/nerves/.nerves/artifacts/nerves_system_rpi0-2.1.2/staging/usr/include/sys/types.h:25,1216 from /usr/local/lib/erlang/erts-17.1/include/erl_drv_nif.h:161,1217 from /usr/local/lib/erlang/erts-17.1/include/erl_nif.h:33,1218 from c_src/func_max.c:2:1219/home/nerves/.nerves/artifacts/nerves_system_rpi0-2.1.2/staging/usr/include/gnu/stubs.h:7:11: fatal error: gnu/stubs-soft.h: No such file or directory1220 7 | # include <gnu/stubs-soft.h>1221 | ^~~~~~~~~~~~~~~~~~1222compilation terminated.1223In file included from /home/nerves/.nerves/artifacts/nerves_system_rpi0-2.1.2/staging/usr/include/features.h:564,1224 from /home/nerves/.nerves/artifacts/nerves_system_rpi0-2.1.2/staging/usr/include/sys/types.h:25,1225 from /usr/local/lib/erlang/erts-17.1/include/erl_drv_nif.h:161,1226 from /usr/local/lib/erlang/erts-17.1/include/erl_nif.h:33,1227 from c_src/func_max_index.c:2:1228/home/nerves/.nerves/artifacts/nerves_system_rpi0-2.1.2/staging/usr/include/gnu/stubs.h:7:11: fatal error: gnu/stubs-soft.h: No such file or directory1229 7 | # include <gnu/stubs-soft.h>1230 | ^~~~~~~~~~~~~~~~~~1231compilation terminated.1232In file included from /home/nerves/.nerves/artifacts/nerves_system_rpi0-2.1.2/staging/usr/include/features.h:564,1233 from /home/nerves/.nerves/artifacts/nerves_system_rpi0-2.1.2/staging/usr/include/sys/types.h:25,1234 from /usr/local/lib/erlang/erts-17.1/include/erl_drv_nif.h:161,1235 from /usr/local/lib/erlang/erts-17.1/include/erl_nif.h:33,1236 from c_src/func_med_price.c:2:1237/home/nerves/.nerves/artifacts/nerves_system_rpi0-2.1.2/staging/usr/include/gnu/stubs.h:7:11: fatal error: gnu/stubs-soft.h: No such file or directory1238 7 | # include <gnu/stubs-soft.h>1239 | ^~~~~~~~~~~~~~~~~~1240compilation terminated.1241In file included from /home/nerves/.nerves/artifacts/nerves_system_rpi0-2.1.2/staging/usr/include/features.h:564,1242 from /home/nerves/.nerves/artifacts/nerves_system_rpi0-2.1.2/staging/usr/include/sys/types.h:25,1243 from /usr/local/lib/erlang/erts-17.1/include/erl_drv_nif.h:161,1244 from /usr/local/lib/erlang/erts-17.1/include/erl_nif.h:33,1245 from c_src/func_mfi.c:2:1246/home/nerves/.nerves/artifacts/nerves_system_rpi0-2.1.2/staging/usr/include/gnu/stubs.h:7:11: fatal error: gnu/stubs-soft.h: No such file or directory1247 7 | # include <gnu/stubs-soft.h>1248 | ^~~~~~~~~~~~~~~~~~1249compilation terminated.1250In file included from /home/nerves/.nerves/artifacts/nerves_system_rpi0-2.1.2/staging/usr/include/features.h:564,1251 from /home/nerves/.nerves/artifacts/nerves_system_rpi0-2.1.2/staging/usr/include/sys/types.h:25,1252 from /usr/local/lib/erlang/erts-17.1/include/erl_drv_nif.h:161,1253 from /usr/local/lib/erlang/erts-17.1/include/erl_nif.h:33,1254 from c_src/func_mid_point.c:2:1255/home/nerves/.nerves/artifacts/nerves_system_rpi0-2.1.2/staging/usr/include/gnu/stubs.h:7:11: fatal error: gnu/stubs-soft.h: No such file or directory1256 7 | # include <gnu/stubs-soft.h>1257 | ^~~~~~~~~~~~~~~~~~1258compilation terminated.1259In file included from /home/nerves/.nerves/artifacts/nerves_system_rpi0-2.1.2/staging/usr/include/features.h:564,1260 from /home/nerves/.nerves/artifacts/nerves_system_rpi0-2.1.2/staging/usr/include/sys/types.h:25,1261 from /usr/local/lib/erlang/erts-17.1/include/erl_drv_nif.h:161,1262 from /usr/local/lib/erlang/erts-17.1/include/erl_nif.h:33,1263 from c_src/func_mid_price.c:2:1264/home/nerves/.nerves/artifacts/nerves_system_rpi0-2.1.2/staging/usr/include/gnu/stubs.h:7:11: fatal error: gnu/stubs-soft.h: No such file or directory1265 7 | # include <gnu/stubs-soft.h>1266 | ^~~~~~~~~~~~~~~~~~1267compilation terminated.1268In file included from /home/nerves/.nerves/artifacts/nerves_system_rpi0-2.1.2/staging/usr/include/features.h:564,1269 from /home/nerves/.nerves/artifacts/nerves_system_rpi0-2.1.2/staging/usr/include/sys/types.h:25,1270 from /usr/local/lib/erlang/erts-17.1/include/erl_drv_nif.h:161,1271 from /usr/local/lib/erlang/erts-17.1/include/erl_nif.h:33,1272 from c_src/func_min.c:2:1273/home/nerves/.nerves/artifacts/nerves_system_rpi0-2.1.2/staging/usr/include/gnu/stubs.h:7:11: fatal error: gnu/stubs-soft.h: No such file or directory1274 7 | # include <gnu/stubs-soft.h>1275 | ^~~~~~~~~~~~~~~~~~1276compilation terminated.1277In file included from /home/nerves/.nerves/artifacts/nerves_system_rpi0-2.1.2/staging/usr/include/features.h:564,1278 from /home/nerves/.nerves/artifacts/nerves_system_rpi0-2.1.2/staging/usr/include/sys/types.h:25,1279 from /usr/local/lib/erlang/erts-17.1/include/erl_drv_nif.h:161,1280 from /usr/local/lib/erlang/erts-17.1/include/erl_nif.h:33,1281 from c_src/func_min_index.c:2:1282/home/nerves/.nerves/artifacts/nerves_system_rpi0-2.1.2/staging/usr/include/gnu/stubs.h:7:11: fatal error: gnu/stubs-soft.h: No such file or directory1283 7 | # include <gnu/stubs-soft.h>1284 | ^~~~~~~~~~~~~~~~~~1285compilation terminated.1286In file included from /home/nerves/.nerves/artifacts/nerves_system_rpi0-2.1.2/staging/usr/include/features.h:564,1287 from /home/nerves/.nerves/artifacts/nerves_system_rpi0-2.1.2/staging/usr/include/sys/types.h:25,1288 from /usr/local/lib/erlang/erts-17.1/include/erl_drv_nif.h:161,1289 from /usr/local/lib/erlang/erts-17.1/include/erl_nif.h:33,1290 from c_src/func_min_max.c:2:1291/home/nerves/.nerves/artifacts/nerves_system_rpi0-2.1.2/staging/usr/include/gnu/stubs.h:7:11: fatal error: gnu/stubs-soft.h: No such file or directory1292 7 | # include <gnu/stubs-soft.h>1293 | ^~~~~~~~~~~~~~~~~~1294compilation terminated.1295In file included from /home/nerves/.nerves/artifacts/nerves_system_rpi0-2.1.2/staging/usr/include/features.h:564,1296 from /home/nerves/.nerves/artifacts/nerves_system_rpi0-2.1.2/staging/usr/include/sys/types.h:25,1297 from /usr/local/lib/erlang/erts-17.1/include/erl_drv_nif.h:161,1298 from /usr/local/lib/erlang/erts-17.1/include/erl_nif.h:33,1299 from c_src/func_min_max_index.c:2:1300/home/nerves/.nerves/artifacts/nerves_system_rpi0-2.1.2/staging/usr/include/gnu/stubs.h:7:11: fatal error: gnu/stubs-soft.h: No such file or directory1301 7 | # include <gnu/stubs-soft.h>1302 | ^~~~~~~~~~~~~~~~~~1303compilation terminated.1304In file included from /home/nerves/.nerves/artifacts/nerves_system_rpi0-2.1.2/staging/usr/include/features.h:564,1305 from /home/nerves/.nerves/artifacts/nerves_system_rpi0-2.1.2/staging/usr/include/sys/types.h:25,1306 from /usr/local/lib/erlang/erts-17.1/include/erl_drv_nif.h:161,1307 from /usr/local/lib/erlang/erts-17.1/include/erl_nif.h:33,1308 from c_src/func_minus_di.c:2:1309/home/nerves/.nerves/artifacts/nerves_system_rpi0-2.1.2/staging/usr/include/gnu/stubs.h:7:11: fatal error: gnu/stubs-soft.h: No such file or directory1310 7 | # include <gnu/stubs-soft.h>1311 | ^~~~~~~~~~~~~~~~~~1312compilation terminated.1313In file included from /home/nerves/.nerves/artifacts/nerves_system_rpi0-2.1.2/staging/usr/include/features.h:564,1314 from /home/nerves/.nerves/artifacts/nerves_system_rpi0-2.1.2/staging/usr/include/sys/types.h:25,1315 from /usr/local/lib/erlang/erts-17.1/include/erl_drv_nif.h:161,1316 from /usr/local/lib/erlang/erts-17.1/include/erl_nif.h:33,1317 from c_src/func_minus_dm.c:2:1318/home/nerves/.nerves/artifacts/nerves_system_rpi0-2.1.2/staging/usr/include/gnu/stubs.h:7:11: fatal error: gnu/stubs-soft.h: No such file or directory1319 7 | # include <gnu/stubs-soft.h>1320 | ^~~~~~~~~~~~~~~~~~1321compilation terminated.1322In file included from /home/nerves/.nerves/artifacts/nerves_system_rpi0-2.1.2/staging/usr/include/features.h:564,1323 from /home/nerves/.nerves/artifacts/nerves_system_rpi0-2.1.2/staging/usr/include/sys/types.h:25,1324 from /usr/local/lib/erlang/erts-17.1/include/erl_drv_nif.h:161,1325 from /usr/local/lib/erlang/erts-17.1/include/erl_nif.h:33,1326 from c_src/func_mom.c:2:1327/home/nerves/.nerves/artifacts/nerves_system_rpi0-2.1.2/staging/usr/include/gnu/stubs.h:7:11: fatal error: gnu/stubs-soft.h: No such file or directory1328 7 | # include <gnu/stubs-soft.h>1329 | ^~~~~~~~~~~~~~~~~~1330compilation terminated.1331In file included from /home/nerves/.nerves/artifacts/nerves_system_rpi0-2.1.2/staging/usr/include/features.h:564,1332 from /home/nerves/.nerves/artifacts/nerves_system_rpi0-2.1.2/staging/usr/include/sys/types.h:25,1333 from /usr/local/lib/erlang/erts-17.1/include/erl_drv_nif.h:161,1334 from /usr/local/lib/erlang/erts-17.1/include/erl_nif.h:33,1335 from c_src/func_mult.c:2:1336/home/nerves/.nerves/artifacts/nerves_system_rpi0-2.1.2/staging/usr/include/gnu/stubs.h:7:11: fatal error: gnu/stubs-soft.h: No such file or directory1337 7 | # include <gnu/stubs-soft.h>1338 | ^~~~~~~~~~~~~~~~~~1339compilation terminated.1340In file included from /home/nerves/.nerves/artifacts/nerves_system_rpi0-2.1.2/staging/usr/include/features.h:564,1341 from /home/nerves/.nerves/artifacts/nerves_system_rpi0-2.1.2/staging/usr/include/sys/types.h:25,1342 from /usr/local/lib/erlang/erts-17.1/include/erl_drv_nif.h:161,1343 from /usr/local/lib/erlang/erts-17.1/include/erl_nif.h:33,1344 from c_src/func_natr.c:2:1345/home/nerves/.nerves/artifacts/nerves_system_rpi0-2.1.2/staging/usr/include/gnu/stubs.h:7:11: fatal error: gnu/stubs-soft.h: No such file or directory1346 7 | # include <gnu/stubs-soft.h>1347 | ^~~~~~~~~~~~~~~~~~1348compilation terminated.1349In file included from /home/nerves/.nerves/artifacts/nerves_system_rpi0-2.1.2/staging/usr/include/features.h:564,1350 from /home/nerves/.nerves/artifacts/nerves_system_rpi0-2.1.2/staging/usr/include/sys/types.h:25,1351 from /usr/local/lib/erlang/erts-17.1/include/erl_drv_nif.h:161,1352 from /usr/local/lib/erlang/erts-17.1/include/erl_nif.h:33,1353 from c_src/func_obv.c:2:1354/home/nerves/.nerves/artifacts/nerves_system_rpi0-2.1.2/staging/usr/include/gnu/stubs.h:7:11: fatal error: gnu/stubs-soft.h: No such file or directory1355 7 | # include <gnu/stubs-soft.h>1356 | ^~~~~~~~~~~~~~~~~~1357compilation terminated.1358In file included from /home/nerves/.nerves/artifacts/nerves_system_rpi0-2.1.2/staging/usr/include/features.h:564,1359 from /home/nerves/.nerves/artifacts/nerves_system_rpi0-2.1.2/staging/usr/include/sys/types.h:25,1360 from /usr/local/lib/erlang/erts-17.1/include/erl_drv_nif.h:161,1361 from /usr/local/lib/erlang/erts-17.1/include/erl_nif.h:33,1362 from c_src/func_plus_di.c:2:1363/home/nerves/.nerves/artifacts/nerves_system_rpi0-2.1.2/staging/usr/include/gnu/stubs.h:7:11: fatal error: gnu/stubs-soft.h: No such file or directory1364 7 | # include <gnu/stubs-soft.h>1365 | ^~~~~~~~~~~~~~~~~~1366compilation terminated.1367In file included from /home/nerves/.nerves/artifacts/nerves_system_rpi0-2.1.2/staging/usr/include/features.h:564,1368 from /home/nerves/.nerves/artifacts/nerves_system_rpi0-2.1.2/staging/usr/include/sys/types.h:25,1369 from /usr/local/lib/erlang/erts-17.1/include/erl_drv_nif.h:161,1370 from /usr/local/lib/erlang/erts-17.1/include/erl_nif.h:33,1371 from c_src/func_plus_dm.c:2:1372/home/nerves/.nerves/artifacts/nerves_system_rpi0-2.1.2/staging/usr/include/gnu/stubs.h:7:11: fatal error: gnu/stubs-soft.h: No such file or directory1373 7 | # include <gnu/stubs-soft.h>1374 | ^~~~~~~~~~~~~~~~~~1375compilation terminated.1376In file included from /home/nerves/.nerves/artifacts/nerves_system_rpi0-2.1.2/staging/usr/include/features.h:564,1377 from /home/nerves/.nerves/artifacts/nerves_system_rpi0-2.1.2/staging/usr/include/sys/types.h:25,1378 from /usr/local/lib/erlang/erts-17.1/include/erl_drv_nif.h:161,1379 from /usr/local/lib/erlang/erts-17.1/include/erl_nif.h:33,1380 from c_src/func_ppo.c:2:1381/home/nerves/.nerves/artifacts/nerves_system_rpi0-2.1.2/staging/usr/include/gnu/stubs.h:7:11: fatal error: gnu/stubs-soft.h: No such file or directory1382 7 | # include <gnu/stubs-soft.h>1383 | ^~~~~~~~~~~~~~~~~~1384compilation terminated.1385In file included from /home/nerves/.nerves/artifacts/nerves_system_rpi0-2.1.2/staging/usr/include/features.h:564,1386 from /home/nerves/.nerves/artifacts/nerves_system_rpi0-2.1.2/staging/usr/include/sys/types.h:25,1387 from /usr/local/lib/erlang/erts-17.1/include/erl_drv_nif.h:161,1388 from /usr/local/lib/erlang/erts-17.1/include/erl_nif.h:33,1389 from c_src/func_roc.c:2:1390/home/nerves/.nerves/artifacts/nerves_system_rpi0-2.1.2/staging/usr/include/gnu/stubs.h:7:11: fatal error: gnu/stubs-soft.h: No such file or directory1391 7 | # include <gnu/stubs-soft.h>1392 | ^~~~~~~~~~~~~~~~~~1393compilation terminated.1394In file included from /home/nerves/.nerves/artifacts/nerves_system_rpi0-2.1.2/staging/usr/include/features.h:564,1395 from /home/nerves/.nerves/artifacts/nerves_system_rpi0-2.1.2/staging/usr/include/sys/types.h:25,1396 from /usr/local/lib/erlang/erts-17.1/include/erl_drv_nif.h:161,1397 from /usr/local/lib/erlang/erts-17.1/include/erl_nif.h:33,1398 from c_src/func_rocp.c:2:1399/home/nerves/.nerves/artifacts/nerves_system_rpi0-2.1.2/staging/usr/include/gnu/stubs.h:7:11: fatal error: gnu/stubs-soft.h: No such file or directory1400 7 | # include <gnu/stubs-soft.h>1401 | ^~~~~~~~~~~~~~~~~~1402compilation terminated.1403In file included from /home/nerves/.nerves/artifacts/nerves_system_rpi0-2.1.2/staging/usr/include/features.h:564,1404 from /home/nerves/.nerves/artifacts/nerves_system_rpi0-2.1.2/staging/usr/include/sys/types.h:25,1405 from /usr/local/lib/erlang/erts-17.1/include/erl_drv_nif.h:161,1406 from /usr/local/lib/erlang/erts-17.1/include/erl_nif.h:33,1407 from c_src/func_rocr.c:2:1408/home/nerves/.nerves/artifacts/nerves_system_rpi0-2.1.2/staging/usr/include/gnu/stubs.h:7:11: fatal error: gnu/stubs-soft.h: No such file or directory1409 7 | # include <gnu/stubs-soft.h>1410 | ^~~~~~~~~~~~~~~~~~1411compilation terminated.1412In file included from /home/nerves/.nerves/artifacts/nerves_system_rpi0-2.1.2/staging/usr/include/features.h:564,1413 from /home/nerves/.nerves/artifacts/nerves_system_rpi0-2.1.2/staging/usr/include/sys/types.h:25,1414 from /usr/local/lib/erlang/erts-17.1/include/erl_drv_nif.h:161,1415 from /usr/local/lib/erlang/erts-17.1/include/erl_nif.h:33,1416 from c_src/func_rocr100.c:2:1417/home/nerves/.nerves/artifacts/nerves_system_rpi0-2.1.2/staging/usr/include/gnu/stubs.h:7:11: fatal error: gnu/stubs-soft.h: No such file or directory1418 7 | # include <gnu/stubs-soft.h>1419 | ^~~~~~~~~~~~~~~~~~1420compilation terminated.1421In file included from /home/nerves/.nerves/artifacts/nerves_system_rpi0-2.1.2/staging/usr/include/features.h:564,1422 from /home/nerves/.nerves/artifacts/nerves_system_rpi0-2.1.2/staging/usr/include/sys/types.h:25,1423 from /usr/local/lib/erlang/erts-17.1/include/erl_drv_nif.h:161,1424 from /usr/local/lib/erlang/erts-17.1/include/erl_nif.h:33,1425 from c_src/func_rsi.c:2:1426/home/nerves/.nerves/artifacts/nerves_system_rpi0-2.1.2/staging/usr/include/gnu/stubs.h:7:11: fatal error: gnu/stubs-soft.h: No such file or directory1427 7 | # include <gnu/stubs-soft.h>1428 | ^~~~~~~~~~~~~~~~~~1429compilation terminated.1430In file included from /home/nerves/.nerves/artifacts/nerves_system_rpi0-2.1.2/staging/usr/include/features.h:564,1431 from /home/nerves/.nerves/artifacts/nerves_system_rpi0-2.1.2/staging/usr/include/sys/types.h:25,1432 from /usr/local/lib/erlang/erts-17.1/include/erl_drv_nif.h:161,1433 from /usr/local/lib/erlang/erts-17.1/include/erl_nif.h:33,1434 from c_src/func_sar.c:2:1435/home/nerves/.nerves/artifacts/nerves_system_rpi0-2.1.2/staging/usr/include/gnu/stubs.h:7:11: fatal error: gnu/stubs-soft.h: No such file or directory1436 7 | # include <gnu/stubs-soft.h>1437 | ^~~~~~~~~~~~~~~~~~1438compilation terminated.1439In file included from /home/nerves/.nerves/artifacts/nerves_system_rpi0-2.1.2/staging/usr/include/features.h:564,1440 from /home/nerves/.nerves/artifacts/nerves_system_rpi0-2.1.2/staging/usr/include/sys/types.h:25,1441 from /usr/local/lib/erlang/erts-17.1/include/erl_drv_nif.h:161,1442 from /usr/local/lib/erlang/erts-17.1/include/erl_nif.h:33,1443 from c_src/func_sarext.c:2:1444/home/nerves/.nerves/artifacts/nerves_system_rpi0-2.1.2/staging/usr/include/gnu/stubs.h:7:11: fatal error: gnu/stubs-soft.h: No such file or directory1445 7 | # include <gnu/stubs-soft.h>1446 | ^~~~~~~~~~~~~~~~~~1447compilation terminated.1448In file included from /home/nerves/.nerves/artifacts/nerves_system_rpi0-2.1.2/staging/usr/include/features.h:564,1449 from /home/nerves/.nerves/artifacts/nerves_system_rpi0-2.1.2/staging/usr/include/sys/types.h:25,1450 from /usr/local/lib/erlang/erts-17.1/include/erl_drv_nif.h:161,1451 from /usr/local/lib/erlang/erts-17.1/include/erl_nif.h:33,1452 from c_src/func_sin.c:2:1453/home/nerves/.nerves/artifacts/nerves_system_rpi0-2.1.2/staging/usr/include/gnu/stubs.h:7:11: fatal error: gnu/stubs-soft.h: No such file or directory1454 7 | # include <gnu/stubs-soft.h>1455 | ^~~~~~~~~~~~~~~~~~1456compilation terminated.1457In file included from /home/nerves/.nerves/artifacts/nerves_system_rpi0-2.1.2/staging/usr/include/features.h:564,1458 from /home/nerves/.nerves/artifacts/nerves_system_rpi0-2.1.2/staging/usr/include/sys/types.h:25,1459 from /usr/local/lib/erlang/erts-17.1/include/erl_drv_nif.h:161,1460 from /usr/local/lib/erlang/erts-17.1/include/erl_nif.h:33,1461 from c_src/func_sinh.c:2:1462/home/nerves/.nerves/artifacts/nerves_system_rpi0-2.1.2/staging/usr/include/gnu/stubs.h:7:11: fatal error: gnu/stubs-soft.h: No such file or directory1463 7 | # include <gnu/stubs-soft.h>1464 | ^~~~~~~~~~~~~~~~~~1465compilation terminated.1466In file included from /home/nerves/.nerves/artifacts/nerves_system_rpi0-2.1.2/staging/usr/include/features.h:564,1467 from /home/nerves/.nerves/artifacts/nerves_system_rpi0-2.1.2/staging/usr/include/sys/types.h:25,1468 from /usr/local/lib/erlang/erts-17.1/include/erl_drv_nif.h:161,1469 from /usr/local/lib/erlang/erts-17.1/include/erl_nif.h:33,1470 from c_src/func_sma.c:2:1471/home/nerves/.nerves/artifacts/nerves_system_rpi0-2.1.2/staging/usr/include/gnu/stubs.h:7:11: fatal error: gnu/stubs-soft.h: No such file or directory1472 7 | # include <gnu/stubs-soft.h>1473 | ^~~~~~~~~~~~~~~~~~1474compilation terminated.1475In file included from /home/nerves/.nerves/artifacts/nerves_system_rpi0-2.1.2/staging/usr/include/features.h:564,1476 from /home/nerves/.nerves/artifacts/nerves_system_rpi0-2.1.2/staging/usr/include/sys/types.h:25,1477 from /usr/local/lib/erlang/erts-17.1/include/erl_drv_nif.h:161,1478 from /usr/local/lib/erlang/erts-17.1/include/erl_nif.h:33,1479 from c_src/func_sqrt.c:2:1480/home/nerves/.nerves/artifacts/nerves_system_rpi0-2.1.2/staging/usr/include/gnu/stubs.h:7:11: fatal error: gnu/stubs-soft.h: No such file or directory1481 7 | # include <gnu/stubs-soft.h>1482 | ^~~~~~~~~~~~~~~~~~1483compilation terminated.1484In file included from /home/nerves/.nerves/artifacts/nerves_system_rpi0-2.1.2/staging/usr/include/features.h:564,1485 from /home/nerves/.nerves/artifacts/nerves_system_rpi0-2.1.2/staging/usr/include/sys/types.h:25,1486 from /usr/local/lib/erlang/erts-17.1/include/erl_drv_nif.h:161,1487 from /usr/local/lib/erlang/erts-17.1/include/erl_nif.h:33,1488 from c_src/func_stddev.c:2:1489/home/nerves/.nerves/artifacts/nerves_system_rpi0-2.1.2/staging/usr/include/gnu/stubs.h:7:11: fatal error: gnu/stubs-soft.h: No such file or directory1490 7 | # include <gnu/stubs-soft.h>1491 | ^~~~~~~~~~~~~~~~~~1492compilation terminated.1493In file included from /home/nerves/.nerves/artifacts/nerves_system_rpi0-2.1.2/staging/usr/include/features.h:564,1494 from /home/nerves/.nerves/artifacts/nerves_system_rpi0-2.1.2/staging/usr/include/sys/types.h:25,1495 from /usr/local/lib/erlang/erts-17.1/include/erl_drv_nif.h:161,1496 from /usr/local/lib/erlang/erts-17.1/include/erl_nif.h:33,1497 from c_src/func_stoch.c:2:1498/home/nerves/.nerves/artifacts/nerves_system_rpi0-2.1.2/staging/usr/include/gnu/stubs.h:7:11: fatal error: gnu/stubs-soft.h: No such file or directory1499 7 | # include <gnu/stubs-soft.h>1500 | ^~~~~~~~~~~~~~~~~~1501compilation terminated.1502In file included from /home/nerves/.nerves/artifacts/nerves_system_rpi0-2.1.2/staging/usr/include/features.h:564,1503 from /home/nerves/.nerves/artifacts/nerves_system_rpi0-2.1.2/staging/usr/include/sys/types.h:25,1504 from /usr/local/lib/erlang/erts-17.1/include/erl_drv_nif.h:161,1505 from /usr/local/lib/erlang/erts-17.1/include/erl_nif.h:33,1506 from c_src/func_stochf.c:2:1507/home/nerves/.nerves/artifacts/nerves_system_rpi0-2.1.2/staging/usr/include/gnu/stubs.h:7:11: fatal error: gnu/stubs-soft.h: No such file or directory1508 7 | # include <gnu/stubs-soft.h>1509 | ^~~~~~~~~~~~~~~~~~1510compilation terminated.1511In file included from /home/nerves/.nerves/artifacts/nerves_system_rpi0-2.1.2/staging/usr/include/features.h:564,1512 from /home/nerves/.nerves/artifacts/nerves_system_rpi0-2.1.2/staging/usr/include/sys/types.h:25,1513 from /usr/local/lib/erlang/erts-17.1/include/erl_drv_nif.h:161,1514 from /usr/local/lib/erlang/erts-17.1/include/erl_nif.h:33,1515 from c_src/func_stochrsi.c:2:1516/home/nerves/.nerves/artifacts/nerves_system_rpi0-2.1.2/staging/usr/include/gnu/stubs.h:7:11: fatal error: gnu/stubs-soft.h: No such file or directory1517 7 | # include <gnu/stubs-soft.h>1518 | ^~~~~~~~~~~~~~~~~~1519compilation terminated.1520In file included from /home/nerves/.nerves/artifacts/nerves_system_rpi0-2.1.2/staging/usr/include/features.h:564,1521 from /home/nerves/.nerves/artifacts/nerves_system_rpi0-2.1.2/staging/usr/include/sys/types.h:25,1522 from /usr/local/lib/erlang/erts-17.1/include/erl_drv_nif.h:161,1523 from /usr/local/lib/erlang/erts-17.1/include/erl_nif.h:33,1524 from c_src/func_sub.c:2:1525/home/nerves/.nerves/artifacts/nerves_system_rpi0-2.1.2/staging/usr/include/gnu/stubs.h:7:11: fatal error: gnu/stubs-soft.h: No such file or directory1526 7 | # include <gnu/stubs-soft.h>1527 | ^~~~~~~~~~~~~~~~~~1528compilation terminated.1529In file included from /home/nerves/.nerves/artifacts/nerves_system_rpi0-2.1.2/staging/usr/include/features.h:564,1530 from /home/nerves/.nerves/artifacts/nerves_system_rpi0-2.1.2/staging/usr/include/sys/types.h:25,1531 from /usr/local/lib/erlang/erts-17.1/include/erl_drv_nif.h:161,1532 from /usr/local/lib/erlang/erts-17.1/include/erl_nif.h:33,1533 from c_src/func_sum.c:2:1534/home/nerves/.nerves/artifacts/nerves_system_rpi0-2.1.2/staging/usr/include/gnu/stubs.h:7:11: fatal error: gnu/stubs-soft.h: No such file or directory1535 7 | # include <gnu/stubs-soft.h>1536 | ^~~~~~~~~~~~~~~~~~1537compilation terminated.1538In file included from /home/nerves/.nerves/artifacts/nerves_system_rpi0-2.1.2/staging/usr/include/features.h:564,1539 from /home/nerves/.nerves/artifacts/nerves_system_rpi0-2.1.2/staging/usr/include/sys/types.h:25,1540 from /usr/local/lib/erlang/erts-17.1/include/erl_drv_nif.h:161,1541 from /usr/local/lib/erlang/erts-17.1/include/erl_nif.h:33,1542 from c_src/func_t3.c:2:1543/home/nerves/.nerves/artifacts/nerves_system_rpi0-2.1.2/staging/usr/include/gnu/stubs.h:7:11: fatal error: gnu/stubs-soft.h: No such file or directory1544 7 | # include <gnu/stubs-soft.h>1545 | ^~~~~~~~~~~~~~~~~~1546compilation terminated.1547In file included from /home/nerves/.nerves/artifacts/nerves_system_rpi0-2.1.2/staging/usr/include/features.h:564,1548 from /home/nerves/.nerves/artifacts/nerves_system_rpi0-2.1.2/staging/usr/include/sys/types.h:25,1549 from /usr/local/lib/erlang/erts-17.1/include/erl_drv_nif.h:161,1550 from /usr/local/lib/erlang/erts-17.1/include/erl_nif.h:33,1551 from c_src/func_tan.c:2:1552/home/nerves/.nerves/artifacts/nerves_system_rpi0-2.1.2/staging/usr/include/gnu/stubs.h:7:11: fatal error: gnu/stubs-soft.h: No such file or directory1553 7 | # include <gnu/stubs-soft.h>1554 | ^~~~~~~~~~~~~~~~~~1555compilation terminated.1556In file included from /home/nerves/.nerves/artifacts/nerves_system_rpi0-2.1.2/staging/usr/include/features.h:564,1557 from /home/nerves/.nerves/artifacts/nerves_system_rpi0-2.1.2/staging/usr/include/sys/types.h:25,1558 from /usr/local/lib/erlang/erts-17.1/include/erl_drv_nif.h:161,1559 from /usr/local/lib/erlang/erts-17.1/include/erl_nif.h:33,1560 from c_src/func_tanh.c:2:1561/home/nerves/.nerves/artifacts/nerves_system_rpi0-2.1.2/staging/usr/include/gnu/stubs.h:7:11: fatal error: gnu/stubs-soft.h: No such file or directory1562 7 | # include <gnu/stubs-soft.h>1563 | ^~~~~~~~~~~~~~~~~~1564compilation terminated.1565In file included from /home/nerves/.nerves/artifacts/nerves_system_rpi0-2.1.2/staging/usr/include/features.h:564,1566 from /home/nerves/.nerves/artifacts/nerves_system_rpi0-2.1.2/staging/usr/include/sys/types.h:25,1567 from /usr/local/lib/erlang/erts-17.1/include/erl_drv_nif.h:161,1568 from /usr/local/lib/erlang/erts-17.1/include/erl_nif.h:33,1569 from c_src/func_tema.c:2:1570/home/nerves/.nerves/artifacts/nerves_system_rpi0-2.1.2/staging/usr/include/gnu/stubs.h:7:11: fatal error: gnu/stubs-soft.h: No such file or directory1571 7 | # include <gnu/stubs-soft.h>1572 | ^~~~~~~~~~~~~~~~~~1573compilation terminated.1574In file included from /home/nerves/.nerves/artifacts/nerves_system_rpi0-2.1.2/staging/usr/include/features.h:564,1575 from /home/nerves/.nerves/artifacts/nerves_system_rpi0-2.1.2/staging/usr/include/sys/types.h:25,1576 from /usr/local/lib/erlang/erts-17.1/include/erl_drv_nif.h:161,1577 from /usr/local/lib/erlang/erts-17.1/include/erl_nif.h:33,1578 from c_src/func_trange.c:2:1579/home/nerves/.nerves/artifacts/nerves_system_rpi0-2.1.2/staging/usr/include/gnu/stubs.h:7:11: fatal error: gnu/stubs-soft.h: No such file or directory1580 7 | # include <gnu/stubs-soft.h>1581 | ^~~~~~~~~~~~~~~~~~1582compilation terminated.1583In file included from /home/nerves/.nerves/artifacts/nerves_system_rpi0-2.1.2/staging/usr/include/features.h:564,1584 from /home/nerves/.nerves/artifacts/nerves_system_rpi0-2.1.2/staging/usr/include/sys/types.h:25,1585 from /usr/local/lib/erlang/erts-17.1/include/erl_drv_nif.h:161,1586 from /usr/local/lib/erlang/erts-17.1/include/erl_nif.h:33,1587 from c_src/func_trima.c:2:1588/home/nerves/.nerves/artifacts/nerves_system_rpi0-2.1.2/staging/usr/include/gnu/stubs.h:7:11: fatal error: gnu/stubs-soft.h: No such file or directory1589 7 | # include <gnu/stubs-soft.h>1590 | ^~~~~~~~~~~~~~~~~~1591compilation terminated.1592In file included from /home/nerves/.nerves/artifacts/nerves_system_rpi0-2.1.2/staging/usr/include/features.h:564,1593 from /home/nerves/.nerves/artifacts/nerves_system_rpi0-2.1.2/staging/usr/include/sys/types.h:25,1594 from /usr/local/lib/erlang/erts-17.1/include/erl_drv_nif.h:161,1595 from /usr/local/lib/erlang/erts-17.1/include/erl_nif.h:33,1596 from c_src/func_trix.c:2:1597/home/nerves/.nerves/artifacts/nerves_system_rpi0-2.1.2/staging/usr/include/gnu/stubs.h:7:11: fatal error: gnu/stubs-soft.h: No such file or directory1598 7 | # include <gnu/stubs-soft.h>1599 | ^~~~~~~~~~~~~~~~~~1600compilation terminated.1601In file included from /home/nerves/.nerves/artifacts/nerves_system_rpi0-2.1.2/staging/usr/include/features.h:564,1602 from /home/nerves/.nerves/artifacts/nerves_system_rpi0-2.1.2/staging/usr/include/sys/types.h:25,1603 from /usr/local/lib/erlang/erts-17.1/include/erl_drv_nif.h:161,1604 from /usr/local/lib/erlang/erts-17.1/include/erl_nif.h:33,1605 from c_src/func_tsf.c:2:1606/home/nerves/.nerves/artifacts/nerves_system_rpi0-2.1.2/staging/usr/include/gnu/stubs.h:7:11: fatal error: gnu/stubs-soft.h: No such file or directory1607 7 | # include <gnu/stubs-soft.h>1608 | ^~~~~~~~~~~~~~~~~~1609compilation terminated.1610In file included from /home/nerves/.nerves/artifacts/nerves_system_rpi0-2.1.2/staging/usr/include/features.h:564,1611 from /home/nerves/.nerves/artifacts/nerves_system_rpi0-2.1.2/staging/usr/include/sys/types.h:25,1612 from /usr/local/lib/erlang/erts-17.1/include/erl_drv_nif.h:161,1613 from /usr/local/lib/erlang/erts-17.1/include/erl_nif.h:33,1614 from c_src/func_typprice.c:2:1615/home/nerves/.nerves/artifacts/nerves_system_rpi0-2.1.2/staging/usr/include/gnu/stubs.h:7:11: fatal error: gnu/stubs-soft.h: No such file or directory1616 7 | # include <gnu/stubs-soft.h>1617 | ^~~~~~~~~~~~~~~~~~1618compilation terminated.1619In file included from /home/nerves/.nerves/artifacts/nerves_system_rpi0-2.1.2/staging/usr/include/features.h:564,1620 from /home/nerves/.nerves/artifacts/nerves_system_rpi0-2.1.2/staging/usr/include/sys/types.h:25,1621 from /usr/local/lib/erlang/erts-17.1/include/erl_drv_nif.h:161,1622 from /usr/local/lib/erlang/erts-17.1/include/erl_nif.h:33,1623 from c_src/func_ultosc.c:2:1624/home/nerves/.nerves/artifacts/nerves_system_rpi0-2.1.2/staging/usr/include/gnu/stubs.h:7:11: fatal error: gnu/stubs-soft.h: No such file or directory1625 7 | # include <gnu/stubs-soft.h>1626 | ^~~~~~~~~~~~~~~~~~1627compilation terminated.1628In file included from /home/nerves/.nerves/artifacts/nerves_system_rpi0-2.1.2/staging/usr/include/features.h:564,1629 from /home/nerves/.nerves/artifacts/nerves_system_rpi0-2.1.2/staging/usr/include/sys/types.h:25,1630 from /usr/local/lib/erlang/erts-17.1/include/erl_drv_nif.h:161,1631 from /usr/local/lib/erlang/erts-17.1/include/erl_nif.h:33,1632 from c_src/func_var.c:2:1633/home/nerves/.nerves/artifacts/nerves_system_rpi0-2.1.2/staging/usr/include/gnu/stubs.h:7:11: fatal error: gnu/stubs-soft.h: No such file or directory1634 7 | # include <gnu/stubs-soft.h>1635 | ^~~~~~~~~~~~~~~~~~1636compilation terminated.1637In file included from /home/nerves/.nerves/artifacts/nerves_system_rpi0-2.1.2/staging/usr/include/features.h:564,1638 from /home/nerves/.nerves/artifacts/nerves_system_rpi0-2.1.2/staging/usr/include/sys/types.h:25,1639 from /usr/local/lib/erlang/erts-17.1/include/erl_drv_nif.h:161,1640 from /usr/local/lib/erlang/erts-17.1/include/erl_nif.h:33,1641 from c_src/func_wclprice.c:2:1642/home/nerves/.nerves/artifacts/nerves_system_rpi0-2.1.2/staging/usr/include/gnu/stubs.h:7:11: fatal error: gnu/stubs-soft.h: No such file or directory1643 7 | # include <gnu/stubs-soft.h>1644 | ^~~~~~~~~~~~~~~~~~1645compilation terminated.1646In file included from /home/nerves/.nerves/artifacts/nerves_system_rpi0-2.1.2/staging/usr/include/features.h:564,1647 from /home/nerves/.nerves/artifacts/nerves_system_rpi0-2.1.2/staging/usr/include/sys/types.h:25,1648 from /usr/local/lib/erlang/erts-17.1/include/erl_drv_nif.h:161,1649 from /usr/local/lib/erlang/erts-17.1/include/erl_nif.h:33,1650 from c_src/func_willr.c:2:1651/home/nerves/.nerves/artifacts/nerves_system_rpi0-2.1.2/staging/usr/include/gnu/stubs.h:7:11: fatal error: gnu/stubs-soft.h: No such file or directory1652 7 | # include <gnu/stubs-soft.h>1653 | ^~~~~~~~~~~~~~~~~~1654compilation terminated.1655In file included from /home/nerves/.nerves/artifacts/nerves_system_rpi0-2.1.2/staging/usr/include/features.h:564,1656 from /home/nerves/.nerves/artifacts/nerves_system_rpi0-2.1.2/staging/usr/include/sys/types.h:25,1657 from /usr/local/lib/erlang/erts-17.1/include/erl_drv_nif.h:161,1658 from /usr/local/lib/erlang/erts-17.1/include/erl_nif.h:33,1659 from c_src/func_wma.c:2:1660/home/nerves/.nerves/artifacts/nerves_system_rpi0-2.1.2/staging/usr/include/gnu/stubs.h:7:11: fatal error: gnu/stubs-soft.h: No such file or directory1661 7 | # include <gnu/stubs-soft.h>1662 | ^~~~~~~~~~~~~~~~~~1663compilation terminated.1664In file included from /home/nerves/.nerves/artifacts/nerves_system_rpi0-2.1.2/staging/usr/include/features.h:564,1665 from /home/nerves/.nerves/artifacts/nerves_system_rpi0-2.1.2/staging/usr/include/sys/types.h:25,1666 from /usr/local/lib/erlang/erts-17.1/include/erl_drv_nif.h:161,1667 from /usr/local/lib/erlang/erts-17.1/include/erl_nif.h:33,1668 from c_src/talib.c:2:1669/home/nerves/.nerves/artifacts/nerves_system_rpi0-2.1.2/staging/usr/include/gnu/stubs.h:7:11: fatal error: gnu/stubs-soft.h: No such file or directory1670 7 | # include <gnu/stubs-soft.h>1671 | ^~~~~~~~~~~~~~~~~~1672compilation terminated.1673In file included from /home/nerves/.nerves/artifacts/nerves_system_rpi0-2.1.2/staging/usr/include/features.h:564,1674 from /home/nerves/.nerves/artifacts/nerves_system_rpi0-2.1.2/staging/usr/include/sys/types.h:25,1675 from /usr/local/lib/erlang/erts-17.1/include/erl_drv_nif.h:161,1676 from /usr/local/lib/erlang/erts-17.1/include/erl_nif.h:33,1677 from c_src/util.c:1:1678/home/nerves/.nerves/artifacts/nerves_system_rpi0-2.1.2/staging/usr/include/gnu/stubs.h:7:11: fatal error: gnu/stubs-soft.h: No such file or directory1679 7 | # include <gnu/stubs-soft.h>1680 | ^~~~~~~~~~~~~~~~~~1681compilation terminated.1682make: *** [Makefile:34: all] Error 11683could not compile dependency :talib_ex_nif, "mix compile" failed. Errors may have been logged above. You can recompile this dependency with "mix deps.compile talib_ex_nif --force", update it with "mix deps.update talib_ex_nif" or clean it with "mix deps.clean talib_ex_nif"1684==> nerves_compatibility_test1685** (Mix) Could not compile with "make" (exit status: 2).1686You need to have gcc and make installed. If you are using1687Ubuntu or any other Debian-based system, install the packages1688"build-essential". Also install "erlang-dev" package if not1689included in your Erlang/OTP version. If you're on Fedora, run1690"dnf group install 'Development Tools'".1691