Build log
host
tdlib 0.0.2 · fail · run tdlib-0.0.2-1791128851444
1066 of 1066 lines
1Resolving Hex dependencies...2Resolution completed in 0.097s3Unchanged:4 circular_buffer 1.1.05 elixir_make 0.10.06 interactive_cmd 0.1.47 nerves 2.0.0-pre.28 nerves_discovery 0.1.59 nerves_logging 0.2.410 nerves_runtime 0.13.1311 nerves_system_bbb 2.30.212 nerves_system_br 1.34.413 nerves_system_mangopi_mq_pro 0.17.214 nerves_system_qemu_aarch64 0.4.215 nerves_system_rpi0 2.1.216 nerves_system_rpi4 2.1.217 nerves_system_rpi5 2.1.218 nerves_system_trellis 0.5.019 nerves_system_x86_64 1.34.220 nerves_toolchain_aarch64_nerves_linux_gnu 15.3.121 nerves_toolchain_armv6_nerves_linux_gnueabihf 15.3.122 nerves_toolchain_armv7_nerves_linux_gnueabihf 15.3.123 nerves_toolchain_riscv64_nerves_linux_gnu 15.3.124 nerves_toolchain_x86_64_nerves_linux_musl 15.3.125 nerves_uevent 0.1.726 poison 3.1.027 property_table 0.3.428 ring_logger 0.11.729 tablet 0.3.330 tdlib 0.0.231 toolshed 0.5.032 uboot_env 1.0.233All dependencies have been fetched34 warning: String.strip/1 is deprecated. Use String.trim/1 instead35 │36 4 │ @version File.read!("VERSION") |> String.strip37 │ ~38 │39 └─ /work/proj/deps/poison/mix.exs:4:44: Poison.Mixfile (module)4041==> tdlib42if [ ! -f priv/tdlib-json-cli ]; then \43 make extract build import; \44fi45make[1]: warning: jobserver unavailable: using -j1. Add '+' to parent make rule.46make[1]: Entering directory '/work/proj/deps/tdlib'47mkdir -p _build/tdlib; \48tar xvf priv/tdlib-json-cli_v1.1.1+1.tar.gz --directory _build/tdlib --strip-components 1; \49tar xvf priv/tdlib_v1.1.1.tar.gz --directory _build/tdlib/td --strip-components 1; \50patch _build/tdlib/td/CMakeLists.txt priv/disable-lto.patch51tdlib-json-cli-1.1.1-1/.gitignore52tdlib-json-cli-1.1.1-1/.gitmodules53tdlib-json-cli-1.1.1-1/.travis.yml54tdlib-json-cli-1.1.1-1/CMakeLists.txt55tdlib-json-cli-1.1.1-1/LICENSE56tdlib-json-cli-1.1.1-1/README.md57tdlib-json-cli-1.1.1-1/main.cpp58tdlib-json-cli-1.1.1-1/td/59tdlib-json-cli-1.1.1-1/types-generator/60tdlib-json-cli-1.1.1-1/types-generator/index.js61tdlib-json-cli-1.1.1-1/types-generator/package-lock.json62tdlib-json-cli-1.1.1-1/types-generator/package.json63tdlib-json-cli-1.1.1-1/types.json64td-1.1.1/.clang-format65td-1.1.1/.gitattributes66td-1.1.1/.gitignore67td-1.1.1/.travis.yml68td-1.1.1/.ycm_extra_conf.py69td-1.1.1/CHANGELOG.md70td-1.1.1/CMake/71td-1.1.1/CMake/AddCXXCompilerFlag.cmake72td-1.1.1/CMake/FindReadline.cmake73td-1.1.1/CMake/iOS.cmake74td-1.1.1/CMakeLists.txt75td-1.1.1/Doxyfile76td-1.1.1/LICENSE_1_0.txt77td-1.1.1/README.md78td-1.1.1/TdConfig.cmake79td-1.1.1/benchmark/80td-1.1.1/benchmark/CMakeLists.txt81td-1.1.1/benchmark/bench_actor.cpp82td-1.1.1/benchmark/bench_crypto.cpp83td-1.1.1/benchmark/bench_db.cpp84td-1.1.1/benchmark/bench_empty.cpp85td-1.1.1/benchmark/bench_handshake.cpp86td-1.1.1/benchmark/bench_http.cpp87td-1.1.1/benchmark/bench_http_reader.cpp88td-1.1.1/benchmark/bench_http_server.cpp89td-1.1.1/benchmark/bench_http_server_cheat.cpp90td-1.1.1/benchmark/bench_http_server_fast.cpp91td-1.1.1/benchmark/bench_log.cpp92td-1.1.1/benchmark/bench_misc.cpp93td-1.1.1/benchmark/bench_queue.cpp94td-1.1.1/benchmark/bench_tddb.cpp95td-1.1.1/benchmark/rmdir.cpp96td-1.1.1/benchmark/wget.cpp97td-1.1.1/bitbucket-pipelines.yml98td-1.1.1/example/99td-1.1.1/example/cpp/100td-1.1.1/example/cpp/CMakeLists.txt101td-1.1.1/example/cpp/td_example.cpp102td-1.1.1/example/cpp/tdjson_example.cpp103td-1.1.1/example/java/104td-1.1.1/example/java/.gitignore105td-1.1.1/example/java/CMakeLists.txt106td-1.1.1/example/java/README.md107td-1.1.1/example/java/org/108td-1.1.1/example/java/org/drinkless/109td-1.1.1/example/java/org/drinkless/tdlib/110td-1.1.1/example/java/org/drinkless/tdlib/Client.java111td-1.1.1/example/java/org/drinkless/tdlib/Log.java112td-1.1.1/example/java/org/drinkless/tdlib/example/113td-1.1.1/example/java/org/drinkless/tdlib/example/Example.java114td-1.1.1/example/java/td_jni.cpp115td-1.1.1/example/python/116td-1.1.1/example/python/tdjson_example.py117td-1.1.1/format.ps1118td-1.1.1/format.sh119td-1.1.1/gen_git_commit_h.ps1120td-1.1.1/gen_git_commit_h.sh121td-1.1.1/memprof/122td-1.1.1/memprof/memprof.cpp123td-1.1.1/memprof/memprof.h124td-1.1.1/sqlite/125td-1.1.1/sqlite/CMakeLists.txt126td-1.1.1/sqlite/sqlite/127td-1.1.1/sqlite/sqlite/LICENSE128td-1.1.1/sqlite/sqlite/sqlite3.c129td-1.1.1/sqlite/sqlite/sqlite3.h130td-1.1.1/sqlite/sqlite/sqlite3ext.h131td-1.1.1/sqlite/sqlite/sqlite3session.h132td-1.1.1/src.ps1133td-1.1.1/src.sh134td-1.1.1/td/135td-1.1.1/td/generate/136td-1.1.1/td/generate/CMakeLists.txt137td-1.1.1/td/generate/DoxygenTlDocumentationGenerator.php138td-1.1.1/td/generate/JavadocTlDocumentationGenerator.php139td-1.1.1/td/generate/TlDocumentationGenerator.php140td-1.1.1/td/generate/generate_c.cpp141td-1.1.1/td/generate/generate_common.cpp142td-1.1.1/td/generate/generate_java.cpp143td-1.1.1/td/generate/generate_json.cpp144td-1.1.1/td/generate/scheme/145td-1.1.1/td/generate/scheme/mtproto_api.tl146td-1.1.1/td/generate/scheme/mtproto_api.tlo147td-1.1.1/td/generate/scheme/secret_api.tl148td-1.1.1/td/generate/scheme/secret_api.tlo149td-1.1.1/td/generate/scheme/td_api.tl150td-1.1.1/td/generate/scheme/td_api.tlo151td-1.1.1/td/generate/scheme/telegram_api.tl152td-1.1.1/td/generate/scheme/telegram_api.tlo153td-1.1.1/td/generate/scheme/update-tlo.sh154td-1.1.1/td/generate/tl_json_converter.cpp155td-1.1.1/td/generate/tl_json_converter.h156td-1.1.1/td/generate/tl_writer_c.h157td-1.1.1/td/generate/tl_writer_cpp.cpp158td-1.1.1/td/generate/tl_writer_cpp.h159td-1.1.1/td/generate/tl_writer_h.cpp160td-1.1.1/td/generate/tl_writer_h.h161td-1.1.1/td/generate/tl_writer_hpp.cpp162td-1.1.1/td/generate/tl_writer_hpp.h163td-1.1.1/td/generate/tl_writer_java.cpp164td-1.1.1/td/generate/tl_writer_java.h165td-1.1.1/td/generate/tl_writer_jni_cpp.cpp166td-1.1.1/td/generate/tl_writer_jni_cpp.h167td-1.1.1/td/generate/tl_writer_jni_h.cpp168td-1.1.1/td/generate/tl_writer_jni_h.h169td-1.1.1/td/generate/tl_writer_td.cpp170td-1.1.1/td/generate/tl_writer_td.h171td-1.1.1/td/mtproto/172td-1.1.1/td/mtproto/AuthData.h173td-1.1.1/td/mtproto/AuthKey.h174td-1.1.1/td/mtproto/CryptoStorer.h175td-1.1.1/td/mtproto/Handshake.cpp176td-1.1.1/td/mtproto/Handshake.h177td-1.1.1/td/mtproto/HandshakeActor.cpp178td-1.1.1/td/mtproto/HandshakeActor.h179td-1.1.1/td/mtproto/HandshakeConnection.h180td-1.1.1/td/mtproto/HttpTransport.cpp181td-1.1.1/td/mtproto/HttpTransport.h182td-1.1.1/td/mtproto/IStreamTransport.cpp183td-1.1.1/td/mtproto/IStreamTransport.h184td-1.1.1/td/mtproto/NoCryptoStorer.h185td-1.1.1/td/mtproto/PacketStorer.h186td-1.1.1/td/mtproto/PingConnection.h187td-1.1.1/td/mtproto/RawConnection.cpp188td-1.1.1/td/mtproto/RawConnection.h189td-1.1.1/td/mtproto/SessionConnection.cpp190td-1.1.1/td/mtproto/SessionConnection.h191td-1.1.1/td/mtproto/TcpTransport.cpp192td-1.1.1/td/mtproto/TcpTransport.h193td-1.1.1/td/mtproto/Transport.cpp194td-1.1.1/td/mtproto/Transport.h195td-1.1.1/td/mtproto/crypto.cpp196td-1.1.1/td/mtproto/crypto.h197td-1.1.1/td/mtproto/utils.cpp198td-1.1.1/td/mtproto/utils.h199td-1.1.1/td/telegram/200td-1.1.1/td/telegram/AccessRights.h201td-1.1.1/td/telegram/AnimationsManager.cpp202td-1.1.1/td/telegram/AnimationsManager.h203td-1.1.1/td/telegram/AnimationsManager.hpp204td-1.1.1/td/telegram/AudiosManager.cpp205td-1.1.1/td/telegram/AudiosManager.h206td-1.1.1/td/telegram/AudiosManager.hpp207td-1.1.1/td/telegram/AuthManager.cpp208td-1.1.1/td/telegram/AuthManager.h209td-1.1.1/td/telegram/CallActor.cpp210td-1.1.1/td/telegram/CallActor.h211td-1.1.1/td/telegram/CallDiscardReason.cpp212td-1.1.1/td/telegram/CallDiscardReason.h213td-1.1.1/td/telegram/CallId.h214td-1.1.1/td/telegram/CallManager.cpp215td-1.1.1/td/telegram/CallManager.h216td-1.1.1/td/telegram/CallbackQueriesManager.cpp217td-1.1.1/td/telegram/CallbackQueriesManager.h218td-1.1.1/td/telegram/ChannelId.h219td-1.1.1/td/telegram/ChatId.h220td-1.1.1/td/telegram/Client.cpp221td-1.1.1/td/telegram/Client.h222td-1.1.1/td/telegram/ClientActor.cpp223td-1.1.1/td/telegram/ClientActor.h224td-1.1.1/td/telegram/ClientJson.cpp225td-1.1.1/td/telegram/ClientJson.h226td-1.1.1/td/telegram/ConfigManager.cpp227td-1.1.1/td/telegram/ConfigManager.h228td-1.1.1/td/telegram/ConfigShared.cpp229td-1.1.1/td/telegram/ConfigShared.h230td-1.1.1/td/telegram/Contact.cpp231td-1.1.1/td/telegram/Contact.h232td-1.1.1/td/telegram/ContactsManager.cpp233td-1.1.1/td/telegram/ContactsManager.h234td-1.1.1/td/telegram/DeviceTokenManager.cpp235td-1.1.1/td/telegram/DeviceTokenManager.h236td-1.1.1/td/telegram/DhCache.cpp237td-1.1.1/td/telegram/DhCache.h238td-1.1.1/td/telegram/DhConfig.h239td-1.1.1/td/telegram/DialogDb.cpp240td-1.1.1/td/telegram/DialogDb.h241td-1.1.1/td/telegram/DialogId.cpp242td-1.1.1/td/telegram/DialogId.h243td-1.1.1/td/telegram/DialogParticipant.cpp244td-1.1.1/td/telegram/DialogParticipant.h245td-1.1.1/td/telegram/DocumentsManager.cpp246td-1.1.1/td/telegram/DocumentsManager.h247td-1.1.1/td/telegram/DocumentsManager.hpp248td-1.1.1/td/telegram/Game.cpp249td-1.1.1/td/telegram/Game.h250td-1.1.1/td/telegram/Game.hpp251td-1.1.1/td/telegram/Global.cpp252td-1.1.1/td/telegram/Global.h253td-1.1.1/td/telegram/HashtagHints.cpp254td-1.1.1/td/telegram/HashtagHints.h255td-1.1.1/td/telegram/InlineQueriesManager.cpp256td-1.1.1/td/telegram/InlineQueriesManager.h257td-1.1.1/td/telegram/Location.cpp258td-1.1.1/td/telegram/Location.h259td-1.1.1/td/telegram/Log.cpp260td-1.1.1/td/telegram/Log.h261td-1.1.1/td/telegram/MessageEntity.cpp262td-1.1.1/td/telegram/MessageEntity.h263td-1.1.1/td/telegram/MessageId.h264td-1.1.1/td/telegram/MessagesDb.cpp265td-1.1.1/td/telegram/MessagesDb.h266td-1.1.1/td/telegram/MessagesManager.cpp267td-1.1.1/td/telegram/MessagesManager.h268td-1.1.1/td/telegram/PasswordManager.cpp269td-1.1.1/td/telegram/PasswordManager.h270td-1.1.1/td/telegram/Payments.cpp271td-1.1.1/td/telegram/Payments.h272td-1.1.1/td/telegram/Payments.hpp273td-1.1.1/td/telegram/Photo.cpp274td-1.1.1/td/telegram/Photo.h275td-1.1.1/td/telegram/Photo.hpp276td-1.1.1/td/telegram/PrivacyManager.cpp277td-1.1.1/td/telegram/PrivacyManager.h278td-1.1.1/td/telegram/PtsManager.h279td-1.1.1/td/telegram/ReplyMarkup.cpp280td-1.1.1/td/telegram/ReplyMarkup.h281td-1.1.1/td/telegram/ReplyMarkup.hpp282td-1.1.1/td/telegram/SecretChatActor.cpp283td-1.1.1/td/telegram/SecretChatActor.h284td-1.1.1/td/telegram/SecretChatDb.cpp285td-1.1.1/td/telegram/SecretChatDb.h286td-1.1.1/td/telegram/SecretChatId.h287td-1.1.1/td/telegram/SecretChatsManager.cpp288td-1.1.1/td/telegram/SecretChatsManager.h289td-1.1.1/td/telegram/SecretInputMedia.h290td-1.1.1/td/telegram/SequenceDispatcher.cpp291td-1.1.1/td/telegram/SequenceDispatcher.h292td-1.1.1/td/telegram/StateManager.cpp293td-1.1.1/td/telegram/StateManager.h294td-1.1.1/td/telegram/StickersManager.cpp295td-1.1.1/td/telegram/StickersManager.h296td-1.1.1/td/telegram/StickersManager.hpp297td-1.1.1/td/telegram/StorageManager.cpp298td-1.1.1/td/telegram/StorageManager.h299td-1.1.1/td/telegram/Td.cpp300td-1.1.1/td/telegram/Td.h301td-1.1.1/td/telegram/TdCallback.h302td-1.1.1/td/telegram/TdDb.cpp303td-1.1.1/td/telegram/TdDb.h304td-1.1.1/td/telegram/TdParameters.h305td-1.1.1/td/telegram/TopDialogManager.cpp306td-1.1.1/td/telegram/TopDialogManager.h307td-1.1.1/td/telegram/UniqueId.h308td-1.1.1/td/telegram/UpdatesManager.cpp309td-1.1.1/td/telegram/UpdatesManager.h310td-1.1.1/td/telegram/UserId.h311td-1.1.1/td/telegram/Version.h312td-1.1.1/td/telegram/VideoNotesManager.cpp313td-1.1.1/td/telegram/VideoNotesManager.h314td-1.1.1/td/telegram/VideoNotesManager.hpp315td-1.1.1/td/telegram/VideosManager.cpp316td-1.1.1/td/telegram/VideosManager.h317td-1.1.1/td/telegram/VideosManager.hpp318td-1.1.1/td/telegram/VoiceNotesManager.cpp319td-1.1.1/td/telegram/VoiceNotesManager.h320td-1.1.1/td/telegram/VoiceNotesManager.hpp321td-1.1.1/td/telegram/WebPageId.h322td-1.1.1/td/telegram/WebPagesManager.cpp323td-1.1.1/td/telegram/WebPagesManager.h324td-1.1.1/td/telegram/cli.cpp325td-1.1.1/td/telegram/files/326td-1.1.1/td/telegram/files/FileDb.cpp327td-1.1.1/td/telegram/files/FileDb.h328td-1.1.1/td/telegram/files/FileDownloader.cpp329td-1.1.1/td/telegram/files/FileDownloader.h330td-1.1.1/td/telegram/files/FileFromBytes.cpp331td-1.1.1/td/telegram/files/FileFromBytes.h332td-1.1.1/td/telegram/files/FileGcParameters.cpp333td-1.1.1/td/telegram/files/FileGcParameters.h334td-1.1.1/td/telegram/files/FileGcWorker.cpp335td-1.1.1/td/telegram/files/FileGcWorker.h336td-1.1.1/td/telegram/files/FileGenerateManager.cpp337td-1.1.1/td/telegram/files/FileGenerateManager.h338td-1.1.1/td/telegram/files/FileHashUploader.cpp339td-1.1.1/td/telegram/files/FileHashUploader.h340td-1.1.1/td/telegram/files/FileId.h341td-1.1.1/td/telegram/files/FileId.hpp342td-1.1.1/td/telegram/files/FileLoadManager.cpp343td-1.1.1/td/telegram/files/FileLoadManager.h344td-1.1.1/td/telegram/files/FileLoader.cpp345td-1.1.1/td/telegram/files/FileLoader.h346td-1.1.1/td/telegram/files/FileLoaderActor.h347td-1.1.1/td/telegram/files/FileLoaderUtils.cpp348td-1.1.1/td/telegram/files/FileLoaderUtils.h349td-1.1.1/td/telegram/files/FileLocation.h350td-1.1.1/td/telegram/files/FileManager.cpp351td-1.1.1/td/telegram/files/FileManager.h352td-1.1.1/td/telegram/files/FileManager.hpp353td-1.1.1/td/telegram/files/FileStats.cpp354td-1.1.1/td/telegram/files/FileStats.h355td-1.1.1/td/telegram/files/FileStatsWorker.cpp356td-1.1.1/td/telegram/files/FileStatsWorker.h357td-1.1.1/td/telegram/files/FileUploader.cpp358td-1.1.1/td/telegram/files/FileUploader.h359td-1.1.1/td/telegram/files/PartsManager.cpp360td-1.1.1/td/telegram/files/PartsManager.h361td-1.1.1/td/telegram/files/ResourceManager.cpp362td-1.1.1/td/telegram/files/ResourceManager.h363td-1.1.1/td/telegram/files/ResourceState.h364td-1.1.1/td/telegram/logevent/365td-1.1.1/td/telegram/logevent/LogEvent.h366td-1.1.1/td/telegram/logevent/SecretChatEvent.h367td-1.1.1/td/telegram/misc.cpp368td-1.1.1/td/telegram/misc.h369td-1.1.1/td/telegram/net/370td-1.1.1/td/telegram/net/AuthDataShared.cpp371td-1.1.1/td/telegram/net/AuthDataShared.h372td-1.1.1/td/telegram/net/ConnectionCreator.cpp373td-1.1.1/td/telegram/net/ConnectionCreator.h374td-1.1.1/td/telegram/net/DcAuthManager.cpp375td-1.1.1/td/telegram/net/DcAuthManager.h376td-1.1.1/td/telegram/net/DcId.h377td-1.1.1/td/telegram/net/DcOptions.h378td-1.1.1/td/telegram/net/DcOptionsSet.cpp379td-1.1.1/td/telegram/net/DcOptionsSet.h380td-1.1.1/td/telegram/net/MtprotoHeader.cpp381td-1.1.1/td/telegram/net/MtprotoHeader.h382td-1.1.1/td/telegram/net/NetActor.cpp383td-1.1.1/td/telegram/net/NetActor.h384td-1.1.1/td/telegram/net/NetQuery.cpp385td-1.1.1/td/telegram/net/NetQuery.h386td-1.1.1/td/telegram/net/NetQueryCounter.cpp387td-1.1.1/td/telegram/net/NetQueryCounter.h388td-1.1.1/td/telegram/net/NetQueryCreator.cpp389td-1.1.1/td/telegram/net/NetQueryCreator.h390td-1.1.1/td/telegram/net/NetQueryDelayer.cpp391td-1.1.1/td/telegram/net/NetQueryDelayer.h392td-1.1.1/td/telegram/net/NetQueryDispatcher.cpp393td-1.1.1/td/telegram/net/NetQueryDispatcher.h394td-1.1.1/td/telegram/net/NetStatsManager.cpp395td-1.1.1/td/telegram/net/NetStatsManager.h396td-1.1.1/td/telegram/net/NetType.h397td-1.1.1/td/telegram/net/PublicRsaKeyShared.cpp398td-1.1.1/td/telegram/net/PublicRsaKeyShared.h399td-1.1.1/td/telegram/net/PublicRsaKeyWatchdog.cpp400td-1.1.1/td/telegram/net/PublicRsaKeyWatchdog.h401td-1.1.1/td/telegram/net/Session.cpp402td-1.1.1/td/telegram/net/Session.h403td-1.1.1/td/telegram/net/SessionMultiProxy.cpp404td-1.1.1/td/telegram/net/SessionMultiProxy.h405td-1.1.1/td/telegram/net/SessionProxy.cpp406td-1.1.1/td/telegram/net/SessionProxy.h407td-1.1.1/td/telegram/net/TempAuthKeyWatchdog.h408td-1.1.1/td/telegram/td_c_client.cpp409td-1.1.1/td/telegram/td_c_client.h410td-1.1.1/td/telegram/td_emscripten.cpp411td-1.1.1/td/telegram/td_json_client.cpp412td-1.1.1/td/telegram/td_json_client.h413td-1.1.1/td/telegram/td_log.cpp414td-1.1.1/td/telegram/td_log.h415td-1.1.1/td/tl/416td-1.1.1/td/tl/TlObject.h417td-1.1.1/td/tl/tl_jni_object.cpp418td-1.1.1/td/tl/tl_jni_object.h419td-1.1.1/td/tl/tl_json.h420td-1.1.1/td/tl/tl_object_parse.h421td-1.1.1/td/tl/tl_object_store.h422td-1.1.1/tdactor/423td-1.1.1/tdactor/CMakeLists.txt424td-1.1.1/tdactor/example/425td-1.1.1/tdactor/example/example.cpp426td-1.1.1/tdactor/td/427td-1.1.1/tdactor/td/actor/428td-1.1.1/tdactor/td/actor/Condition.h429td-1.1.1/tdactor/td/actor/MultiPromise.cpp430td-1.1.1/tdactor/td/actor/MultiPromise.h431td-1.1.1/tdactor/td/actor/PromiseFuture.h432td-1.1.1/tdactor/td/actor/SchedulerLocalStorage.h433td-1.1.1/tdactor/td/actor/SignalSlot.h434td-1.1.1/tdactor/td/actor/SleepActor.h435td-1.1.1/tdactor/td/actor/Timeout.cpp436td-1.1.1/tdactor/td/actor/Timeout.h437td-1.1.1/tdactor/td/actor/actor.h438td-1.1.1/tdactor/td/actor/impl/439td-1.1.1/tdactor/td/actor/impl/Actor-decl.h440td-1.1.1/tdactor/td/actor/impl/Actor.h441td-1.1.1/tdactor/td/actor/impl/ActorId-decl.h442td-1.1.1/tdactor/td/actor/impl/ActorId.h443td-1.1.1/tdactor/td/actor/impl/ActorInfo-decl.h444td-1.1.1/tdactor/td/actor/impl/ActorInfo.h445td-1.1.1/tdactor/td/actor/impl/ConcurrentScheduler.cpp446td-1.1.1/tdactor/td/actor/impl/ConcurrentScheduler.h447td-1.1.1/tdactor/td/actor/impl/Event.h448td-1.1.1/tdactor/td/actor/impl/EventFull-decl.h449td-1.1.1/tdactor/td/actor/impl/EventFull.h450td-1.1.1/tdactor/td/actor/impl/Scheduler-decl.h451td-1.1.1/tdactor/td/actor/impl/Scheduler.cpp452td-1.1.1/tdactor/td/actor/impl/Scheduler.h453td-1.1.1/tdactor/td/actor/impl2/454td-1.1.1/tdactor/td/actor/impl2/ActorLocker.h455td-1.1.1/tdactor/td/actor/impl2/ActorSignals.h456td-1.1.1/tdactor/td/actor/impl2/ActorState.h457td-1.1.1/tdactor/td/actor/impl2/Scheduler.cpp458td-1.1.1/tdactor/td/actor/impl2/Scheduler.h459td-1.1.1/tdactor/td/actor/impl2/SchedulerId.h460td-1.1.1/tdactor/test/461td-1.1.1/tdactor/test/actors_bugs.cpp462td-1.1.1/tdactor/test/actors_impl2.cpp463td-1.1.1/tdactor/test/actors_main.cpp464td-1.1.1/tdactor/test/actors_simple.cpp465td-1.1.1/tdactor/test/actors_workers.cpp466td-1.1.1/tdclientjson_export_list467td-1.1.1/tddb/468td-1.1.1/tddb/CMakeLists.txt469td-1.1.1/tddb/td/470td-1.1.1/tddb/td/db/471td-1.1.1/tddb/td/db/BinlogKeyValue.h472td-1.1.1/tddb/td/db/DbKey.h473td-1.1.1/tddb/td/db/KeyValueSyncInterface.h474td-1.1.1/tddb/td/db/Pmc.h475td-1.1.1/tddb/td/db/SeqKeyValue.h476td-1.1.1/tddb/td/db/SqliteConnectionSafe.h477td-1.1.1/tddb/td/db/SqliteDb.cpp478td-1.1.1/tddb/td/db/SqliteDb.h479td-1.1.1/tddb/td/db/SqliteKeyValue.h480td-1.1.1/tddb/td/db/SqliteKeyValueAsync.cpp481td-1.1.1/tddb/td/db/SqliteKeyValueAsync.h482td-1.1.1/tddb/td/db/SqliteKeyValueSafe.h483td-1.1.1/tddb/td/db/SqliteStatement.cpp484td-1.1.1/tddb/td/db/SqliteStatement.h485td-1.1.1/tddb/td/db/TsSeqKeyValue.h486td-1.1.1/tddb/td/db/binlog/487td-1.1.1/tddb/td/db/binlog/Binlog.cpp488td-1.1.1/tddb/td/db/binlog/Binlog.h489td-1.1.1/tddb/td/db/binlog/BinlogEvent.cpp490td-1.1.1/tddb/td/db/binlog/BinlogEvent.h491td-1.1.1/tddb/td/db/binlog/BinlogHelper.h492td-1.1.1/tddb/td/db/binlog/BinlogInterface.h493td-1.1.1/tddb/td/db/binlog/ConcurrentBinlog.cpp494td-1.1.1/tddb/td/db/binlog/ConcurrentBinlog.h495td-1.1.1/tddb/td/db/binlog/binlog_dump.cpp496td-1.1.1/tddb/td/db/binlog/detail/497td-1.1.1/tddb/td/db/binlog/detail/BinlogEventsBuffer.cpp498td-1.1.1/tddb/td/db/binlog/detail/BinlogEventsBuffer.h499td-1.1.1/tddb/td/db/binlog/detail/BinlogEventsProcessor.cpp500td-1.1.1/tddb/td/db/binlog/detail/BinlogEventsProcessor.h501td-1.1.1/tddb/td/db/detail/502td-1.1.1/tddb/td/db/detail/RawSqliteDb.cpp503td-1.1.1/tddb/td/db/detail/RawSqliteDb.h504td-1.1.1/tdnet/505td-1.1.1/tdnet/CMakeLists.txt506td-1.1.1/tdnet/td/507td-1.1.1/tdnet/td/net/508td-1.1.1/tdnet/td/net/GetHostByNameActor.cpp509td-1.1.1/tdnet/td/net/GetHostByNameActor.h510td-1.1.1/tdnet/td/net/HttpChunkedByteFlow.cpp511td-1.1.1/tdnet/td/net/HttpChunkedByteFlow.h512td-1.1.1/tdnet/td/net/HttpConnectionBase.cpp513td-1.1.1/tdnet/td/net/HttpConnectionBase.h514td-1.1.1/tdnet/td/net/HttpContentLengthByteFlow.cpp515td-1.1.1/tdnet/td/net/HttpContentLengthByteFlow.h516td-1.1.1/tdnet/td/net/HttpFile.cpp517td-1.1.1/tdnet/td/net/HttpFile.h518td-1.1.1/tdnet/td/net/HttpHeaderCreator.h519td-1.1.1/tdnet/td/net/HttpInboundConnection.cpp520td-1.1.1/tdnet/td/net/HttpInboundConnection.h521td-1.1.1/tdnet/td/net/HttpOutboundConnection.cpp522td-1.1.1/tdnet/td/net/HttpOutboundConnection.h523td-1.1.1/tdnet/td/net/HttpQuery.cpp524td-1.1.1/tdnet/td/net/HttpQuery.h525td-1.1.1/tdnet/td/net/HttpReader.cpp526td-1.1.1/tdnet/td/net/HttpReader.h527td-1.1.1/tdnet/td/net/NetStats.h528td-1.1.1/tdnet/td/net/Socks5.cpp529td-1.1.1/tdnet/td/net/Socks5.h530td-1.1.1/tdnet/td/net/SslFd.cpp531td-1.1.1/tdnet/td/net/SslFd.h532td-1.1.1/tdnet/td/net/TcpListener.cpp533td-1.1.1/tdnet/td/net/TcpListener.h534td-1.1.1/tdnet/td/net/Wget.cpp535td-1.1.1/tdnet/td/net/Wget.h536td-1.1.1/tdtl/537td-1.1.1/tdtl/CMakeLists.txt538td-1.1.1/tdtl/td/539td-1.1.1/tdtl/td/tl/540td-1.1.1/tdtl/td/tl/tl_config.cpp541td-1.1.1/tdtl/td/tl/tl_config.h542td-1.1.1/tdtl/td/tl/tl_core.cpp543td-1.1.1/tdtl/td/tl/tl_core.h544td-1.1.1/tdtl/td/tl/tl_file_outputer.cpp545td-1.1.1/tdtl/td/tl/tl_file_outputer.h546td-1.1.1/tdtl/td/tl/tl_generate.cpp547td-1.1.1/tdtl/td/tl/tl_generate.h548td-1.1.1/tdtl/td/tl/tl_outputer.cpp549td-1.1.1/tdtl/td/tl/tl_outputer.h550td-1.1.1/tdtl/td/tl/tl_simple.h551td-1.1.1/tdtl/td/tl/tl_simple_parser.h552td-1.1.1/tdtl/td/tl/tl_string_outputer.cpp553td-1.1.1/tdtl/td/tl/tl_string_outputer.h554td-1.1.1/tdtl/td/tl/tl_writer.cpp555td-1.1.1/tdtl/td/tl/tl_writer.h556td-1.1.1/tdutils/557td-1.1.1/tdutils/CMakeLists.txt558td-1.1.1/tdutils/generate/559td-1.1.1/tdutils/generate/CMakeLists.txt560td-1.1.1/tdutils/generate/generate_mime_types_gperf.cpp561td-1.1.1/tdutils/generate/mime_types.txt562td-1.1.1/tdutils/td/563td-1.1.1/tdutils/td/utils/564td-1.1.1/tdutils/td/utils/AesCtrByteFlow.h565td-1.1.1/tdutils/td/utils/BigNum.cpp566td-1.1.1/tdutils/td/utils/BigNum.h567td-1.1.1/tdutils/td/utils/BufferedFd.h568td-1.1.1/tdutils/td/utils/BufferedReader.h569td-1.1.1/tdutils/td/utils/ByteFlow.h570td-1.1.1/tdutils/td/utils/ChangesProcessor.h571td-1.1.1/tdutils/td/utils/Closure.h572td-1.1.1/tdutils/td/utils/Container.h573td-1.1.1/tdutils/td/utils/FileLog.cpp574td-1.1.1/tdutils/td/utils/FileLog.h575td-1.1.1/tdutils/td/utils/FloodControlFast.h576td-1.1.1/tdutils/td/utils/FloodControlStrict.h577td-1.1.1/tdutils/td/utils/GitInfo.cpp578td-1.1.1/tdutils/td/utils/GitInfo.h579td-1.1.1/tdutils/td/utils/Gzip.cpp580td-1.1.1/tdutils/td/utils/Gzip.h581td-1.1.1/tdutils/td/utils/GzipByteFlow.cpp582td-1.1.1/tdutils/td/utils/GzipByteFlow.h583td-1.1.1/tdutils/td/utils/HazardPointers.h584td-1.1.1/tdutils/td/utils/Heap.h585td-1.1.1/tdutils/td/utils/Hints.cpp586td-1.1.1/tdutils/td/utils/Hints.h587td-1.1.1/tdutils/td/utils/HttpUrl.cpp588td-1.1.1/tdutils/td/utils/HttpUrl.h589td-1.1.1/tdutils/td/utils/JsonBuilder.cpp590td-1.1.1/tdutils/td/utils/JsonBuilder.h591td-1.1.1/tdutils/td/utils/List.h592td-1.1.1/tdutils/td/utils/MemoryLog.h593td-1.1.1/tdutils/td/utils/MimeType.cpp594td-1.1.1/tdutils/td/utils/MimeType.h595td-1.1.1/tdutils/td/utils/MovableValue.h596td-1.1.1/tdutils/td/utils/MpmcQueue.h597td-1.1.1/tdutils/td/utils/MpmcWaiter.h598td-1.1.1/tdutils/td/utils/MpscLinkQueue.h599td-1.1.1/tdutils/td/utils/MpscPollableQueue.h600td-1.1.1/tdutils/td/utils/Named.h601td-1.1.1/tdutils/td/utils/ObjectPool.h602td-1.1.1/tdutils/td/utils/Observer.h603td-1.1.1/tdutils/td/utils/OptionsParser.h604td-1.1.1/tdutils/td/utils/OrderedEventsProcessor.h605td-1.1.1/tdutils/td/utils/Parser.h606td-1.1.1/tdutils/td/utils/PathView.h607td-1.1.1/tdutils/td/utils/Random.cpp608td-1.1.1/tdutils/td/utils/Random.h609td-1.1.1/tdutils/td/utils/ScopeGuard.h610td-1.1.1/tdutils/td/utils/SharedObjectPool.h611td-1.1.1/tdutils/td/utils/Slice-decl.h612td-1.1.1/tdutils/td/utils/Slice.h613td-1.1.1/tdutils/td/utils/SpinLock.h614td-1.1.1/tdutils/td/utils/StackAllocator.cpp615td-1.1.1/tdutils/td/utils/StackAllocator.h616td-1.1.1/tdutils/td/utils/Status.cpp617td-1.1.1/tdutils/td/utils/Status.h618td-1.1.1/tdutils/td/utils/Storer.h619td-1.1.1/tdutils/td/utils/StorerBase.h620td-1.1.1/tdutils/td/utils/StringBuilder.cpp621td-1.1.1/tdutils/td/utils/StringBuilder.h622td-1.1.1/tdutils/td/utils/Time.cpp623td-1.1.1/tdutils/td/utils/Time.h624td-1.1.1/tdutils/td/utils/TimedStat.h625td-1.1.1/tdutils/td/utils/Timer.cpp626td-1.1.1/tdutils/td/utils/Timer.h627td-1.1.1/tdutils/td/utils/Variant.h628td-1.1.1/tdutils/td/utils/base64.cpp629td-1.1.1/tdutils/td/utils/base64.h630td-1.1.1/tdutils/td/utils/benchmark.h631td-1.1.1/tdutils/td/utils/buffer.cpp632td-1.1.1/tdutils/td/utils/buffer.h633td-1.1.1/tdutils/td/utils/common.h634td-1.1.1/tdutils/td/utils/config.h.in635td-1.1.1/tdutils/td/utils/crypto.cpp636td-1.1.1/tdutils/td/utils/crypto.h637td-1.1.1/tdutils/td/utils/filesystem.cpp638td-1.1.1/tdutils/td/utils/filesystem.h639td-1.1.1/tdutils/td/utils/find_boundary.cpp640td-1.1.1/tdutils/td/utils/find_boundary.h641td-1.1.1/tdutils/td/utils/format.h642td-1.1.1/tdutils/td/utils/int_types.h643td-1.1.1/tdutils/td/utils/invoke.h644td-1.1.1/tdutils/td/utils/logging.cpp645td-1.1.1/tdutils/td/utils/logging.h646td-1.1.1/tdutils/td/utils/misc.cpp647td-1.1.1/tdutils/td/utils/misc.h648td-1.1.1/tdutils/td/utils/optional.h649td-1.1.1/tdutils/td/utils/overloaded.h650td-1.1.1/tdutils/td/utils/port/651td-1.1.1/tdutils/td/utils/port/Clocks.h652td-1.1.1/tdutils/td/utils/port/CxCli.h653td-1.1.1/tdutils/td/utils/port/EventFd.h654td-1.1.1/tdutils/td/utils/port/EventFdBase.h655td-1.1.1/tdutils/td/utils/port/Fd.cpp656td-1.1.1/tdutils/td/utils/port/Fd.h657td-1.1.1/tdutils/td/utils/port/FileFd.cpp658td-1.1.1/tdutils/td/utils/port/FileFd.h659td-1.1.1/tdutils/td/utils/port/IPAddress.cpp660td-1.1.1/tdutils/td/utils/port/IPAddress.h661td-1.1.1/tdutils/td/utils/port/Poll.h662td-1.1.1/tdutils/td/utils/port/PollBase.h663td-1.1.1/tdutils/td/utils/port/RwMutex.h664td-1.1.1/tdutils/td/utils/port/ServerSocketFd.cpp665td-1.1.1/tdutils/td/utils/port/ServerSocketFd.h666td-1.1.1/tdutils/td/utils/port/SocketFd.cpp667td-1.1.1/tdutils/td/utils/port/SocketFd.h668td-1.1.1/tdutils/td/utils/port/Stat.cpp669td-1.1.1/tdutils/td/utils/port/Stat.h670td-1.1.1/tdutils/td/utils/port/config.h671td-1.1.1/tdutils/td/utils/port/detail/672td-1.1.1/tdutils/td/utils/port/detail/Epoll.cpp673td-1.1.1/tdutils/td/utils/port/detail/Epoll.h674td-1.1.1/tdutils/td/utils/port/detail/EventFdBsd.cpp675td-1.1.1/tdutils/td/utils/port/detail/EventFdBsd.h676td-1.1.1/tdutils/td/utils/port/detail/EventFdLinux.cpp677td-1.1.1/tdutils/td/utils/port/detail/EventFdLinux.h678td-1.1.1/tdutils/td/utils/port/detail/EventFdWindows.cpp679td-1.1.1/tdutils/td/utils/port/detail/EventFdWindows.h680td-1.1.1/tdutils/td/utils/port/detail/KQueue.cpp681td-1.1.1/tdutils/td/utils/port/detail/KQueue.h682td-1.1.1/tdutils/td/utils/port/detail/Poll.cpp683td-1.1.1/tdutils/td/utils/port/detail/Poll.h684td-1.1.1/tdutils/td/utils/port/detail/Select.cpp685td-1.1.1/tdutils/td/utils/port/detail/Select.h686td-1.1.1/tdutils/td/utils/port/detail/ThreadIdGuard.cpp687td-1.1.1/tdutils/td/utils/port/detail/ThreadIdGuard.h688td-1.1.1/tdutils/td/utils/port/detail/ThreadPthread.h689td-1.1.1/tdutils/td/utils/port/detail/ThreadStl.h690td-1.1.1/tdutils/td/utils/port/detail/WineventPoll.cpp691td-1.1.1/tdutils/td/utils/port/detail/WineventPoll.h692td-1.1.1/tdutils/td/utils/port/path.cpp693td-1.1.1/tdutils/td/utils/port/path.h694td-1.1.1/tdutils/td/utils/port/platform.h695td-1.1.1/tdutils/td/utils/port/signals.cpp696td-1.1.1/tdutils/td/utils/port/signals.h697td-1.1.1/tdutils/td/utils/port/sleep.cpp698td-1.1.1/tdutils/td/utils/port/sleep.h699td-1.1.1/tdutils/td/utils/port/thread.h700td-1.1.1/tdutils/td/utils/port/thread_local.cpp701td-1.1.1/tdutils/td/utils/port/thread_local.h702td-1.1.1/tdutils/td/utils/port/wstring_convert.cpp703td-1.1.1/tdutils/td/utils/port/wstring_convert.h704td-1.1.1/tdutils/td/utils/queue.h705td-1.1.1/tdutils/td/utils/tests.h706td-1.1.1/tdutils/td/utils/tl_helpers.h707td-1.1.1/tdutils/td/utils/tl_parsers.cpp708td-1.1.1/tdutils/td/utils/tl_parsers.h709td-1.1.1/tdutils/td/utils/tl_storers.h710td-1.1.1/tdutils/td/utils/type_traits.h711td-1.1.1/tdutils/td/utils/unicode.cpp712td-1.1.1/tdutils/td/utils/unicode.h713td-1.1.1/tdutils/td/utils/utf8.cpp714td-1.1.1/tdutils/td/utils/utf8.h715td-1.1.1/tdutils/test/716td-1.1.1/tdutils/test/HazardPointers.cpp717td-1.1.1/tdutils/test/MpmcQueue.cpp718td-1.1.1/tdutils/test/MpmcWaiter.cpp719td-1.1.1/tdutils/test/MpscLinkQueue.cpp720td-1.1.1/tdutils/test/OrderedEventsProcessor.cpp721td-1.1.1/tdutils/test/SharedObjectPool.cpp722td-1.1.1/tdutils/test/crypto.cpp723td-1.1.1/tdutils/test/filesystem.cpp724td-1.1.1/tdutils/test/gzip.cpp725td-1.1.1/tdutils/test/heap.cpp726td-1.1.1/tdutils/test/json.cpp727td-1.1.1/tdutils/test/misc.cpp728td-1.1.1/tdutils/test/pq.cpp729td-1.1.1/tdutils/test/variant.cpp730td-1.1.1/test/731td-1.1.1/test/CMakeLists.txt732td-1.1.1/test/TestsRunner.cpp733td-1.1.1/test/TestsRunner.h734td-1.1.1/test/data.cpp735td-1.1.1/test/data.h736td-1.1.1/test/db.cpp737td-1.1.1/test/fuzz_url.cpp738td-1.1.1/test/http.cpp739td-1.1.1/test/main.cpp740td-1.1.1/test/message_entities.cpp741td-1.1.1/test/mtproto.cpp742td-1.1.1/test/secret.cpp743td-1.1.1/test/string_cleaning.cpp744td-1.1.1/test/tdclient.cpp745td-1.1.1/test/tests_runner.cpp746td-1.1.1/test/tests_runner.h747patching file _build/tdlib/td/CMakeLists.txt748mkdir _build/tdlib/rel; \749cd _build/tdlib/rel; \750cmake -DCMAKE_BUILD_TYPE=Release ..; \751make -j2 VERBOSE=0752CMake Deprecation Warning at CMakeLists.txt:1 (cmake_minimum_required):753 Compatibility with CMake < 3.5 will be removed from a future version of754 CMake.755756 Update the VERSION argument <min> value or use a ...<max> suffix to tell757 CMake that the project does not need compatibility with older versions.758759760-- The CXX compiler identification is GNU 13.3.0761-- Detecting CXX compiler ABI info762-- Detecting CXX compiler ABI info - done763-- Check for working CXX compiler: /usr/bin/c++ - skipped764-- Detecting CXX compile features765-- Detecting CXX compile features - done766CMake Deprecation Warning at td/CMakeLists.txt:1 (cmake_minimum_required):767 Compatibility with CMake < 3.5 will be removed from a future version of768 CMake.769770 Update the VERSION argument <min> value or use a ...<max> suffix to tell771 CMake that the project does not need compatibility with older versions.772773774-- The C compiler identification is GNU 13.3.0775-- Detecting C compiler ABI info776-- Detecting C compiler ABI info - done777-- Check for working C compiler: /usr/bin/cc - skipped778-- Detecting C compile features779-- Detecting C compile features - done780-- Use link time optimizations: -flto=auto -fno-fat-lto-objects781-- Could NOT find ccache782-- Found OpenSSL: /usr/lib/x86_64-linux-gnu/libcrypto.so (found version "3.0.13") 783-- Found OpenSSL: /usr/include /usr/lib/x86_64-linux-gnu/libssl.so;/usr/lib/x86_64-linux-gnu/libcrypto.so784-- Performing Test HAVE_STD14785-- Performing Test HAVE_STD14 - Success786-- Performing Test CMAKE_HAVE_LIBC_PTHREAD787-- Performing Test CMAKE_HAVE_LIBC_PTHREAD - Success788-- Found Threads: TRUE 789-- Performing Test HAVE_CXX_FLAG_WALL790-- Performing Test HAVE_CXX_FLAG_WALL - Success791-- Performing Test HAVE_CXX_FLAG_WEXTRA792-- Performing Test HAVE_CXX_FLAG_WEXTRA - Success793-- Performing Test HAVE_CXX_FLAG_WIMPLICIT_FALLTHROUGH_2794-- Performing Test HAVE_CXX_FLAG_WIMPLICIT_FALLTHROUGH_2 - Success795-- Performing Test HAVE_CXX_FLAG_WPOINTER_ARITH796-- Performing Test HAVE_CXX_FLAG_WPOINTER_ARITH - Success797-- Performing Test HAVE_CXX_FLAG_WCAST_QUAL798-- Performing Test HAVE_CXX_FLAG_WCAST_QUAL - Success799-- Performing Test HAVE_CXX_FLAG_WSIGN_COMPARE800-- Performing Test HAVE_CXX_FLAG_WSIGN_COMPARE - Success801-- Performing Test HAVE_CXX_FLAG_WDUPLICATED_BRANCHES802-- Performing Test HAVE_CXX_FLAG_WDUPLICATED_BRANCHES - Success803-- Performing Test HAVE_CXX_FLAG_WDUPLICATED_COND804-- Performing Test HAVE_CXX_FLAG_WDUPLICATED_COND - Success805-- Performing Test HAVE_CXX_FLAG_WALLOC_ZERO806-- Performing Test HAVE_CXX_FLAG_WALLOC_ZERO - Success807-- Performing Test HAVE_CXX_FLAG_WLOGICAL_OP808-- Performing Test HAVE_CXX_FLAG_WLOGICAL_OP - Success809-- Performing Test HAVE_CXX_FLAG_WTAUTOLOGICAL_COMPARE810-- Performing Test HAVE_CXX_FLAG_WTAUTOLOGICAL_COMPARE - Success811-- Performing Test HAVE_CXX_FLAG_WVLA812-- Performing Test HAVE_CXX_FLAG_WVLA - Success813-- Performing Test HAVE_CXX_FLAG_WNON_VIRTUAL_DTOR814-- Performing Test HAVE_CXX_FLAG_WNON_VIRTUAL_DTOR - Success815-- Performing Test HAVE_CXX_FLAG_WUNUSED_PARAMETER816-- Performing Test HAVE_CXX_FLAG_WUNUSED_PARAMETER - Success817-- Performing Test HAVE_CXX_FLAG_WCONVERSION818-- Performing Test HAVE_CXX_FLAG_WCONVERSION - Success819-- Performing Test HAVE_CXX_FLAG_WSIGN_CONVERSION820-- Performing Test HAVE_CXX_FLAG_WSIGN_CONVERSION - Success821-- Performing Test HAVE_CXX_FLAG_WCXX14_COMPAT_PEDANTIC822-- Performing Test HAVE_CXX_FLAG_WCXX14_COMPAT_PEDANTIC - Failed823-- Performing Test HAVE_CXX_FLAG_QUNUSED_ARGUMENTS824-- Performing Test HAVE_CXX_FLAG_QUNUSED_ARGUMENTS - Failed825-- Performing Test HAVE_CXX_FLAG_WODR826-- Performing Test HAVE_CXX_FLAG_WODR - Success827-- Performing Test HAVE_CXX_FLAG_FLTO_ODR_TYPE_MERGING828-- Performing Test HAVE_CXX_FLAG_FLTO_ODR_TYPE_MERGING - Success829CMake Deprecation Warning at td/tdtl/CMakeLists.txt:1 (cmake_minimum_required):830 Compatibility with CMake < 3.5 will be removed from a future version of831 CMake.832833 Update the VERSION argument <min> value or use a ...<max> suffix to tell834 CMake that the project does not need compatibility with older versions.835836837CMake Deprecation Warning at td/tdutils/CMakeLists.txt:1 (cmake_minimum_required):838 Compatibility with CMake < 3.5 will be removed from a future version of839 CMake.840841 Update the VERSION argument <min> value or use a ...<max> suffix to tell842 CMake that the project does not need compatibility with older versions.843844845-- Found ZLIB: /usr/lib/x86_64-linux-gnu/libz.so (found version "1.3") 846-- Found ZLIB: /usr/include /usr/lib/x86_64-linux-gnu/libz.so847CMake Deprecation Warning at td/tdutils/generate/CMakeLists.txt:1 (cmake_minimum_required):848 Compatibility with CMake < 3.5 will be removed from a future version of849 CMake.850851 Update the VERSION argument <min> value or use a ...<max> suffix to tell852 CMake that the project does not need compatibility with older versions.853854855CMake Deprecation Warning at td/td/generate/CMakeLists.txt:1 (cmake_minimum_required):856 Compatibility with CMake < 3.5 will be removed from a future version of857 CMake.858859 Update the VERSION argument <min> value or use a ...<max> suffix to tell860 CMake that the project does not need compatibility with older versions.861862863CMake Deprecation Warning at td/tdactor/CMakeLists.txt:1 (cmake_minimum_required):864 Compatibility with CMake < 3.5 will be removed from a future version of865 CMake.866867 Update the VERSION argument <min> value or use a ...<max> suffix to tell868 CMake that the project does not need compatibility with older versions.869870871CMake Deprecation Warning at td/tdnet/CMakeLists.txt:1 (cmake_minimum_required):872 Compatibility with CMake < 3.5 will be removed from a future version of873 CMake.874875 Update the VERSION argument <min> value or use a ...<max> suffix to tell876 CMake that the project does not need compatibility with older versions.877878879CMake Deprecation Warning at td/sqlite/CMakeLists.txt:1 (cmake_minimum_required):880 Compatibility with CMake < 3.5 will be removed from a future version of881 CMake.882883 Update the VERSION argument <min> value or use a ...<max> suffix to tell884 CMake that the project does not need compatibility with older versions.885886887CMake Deprecation Warning at td/tddb/CMakeLists.txt:1 (cmake_minimum_required):888 Compatibility with CMake < 3.5 will be removed from a future version of889 CMake.890891 Update the VERSION argument <min> value or use a ...<max> suffix to tell892 CMake that the project does not need compatibility with older versions.893894895CMake Deprecation Warning at td/test/CMakeLists.txt:1 (cmake_minimum_required):896 Compatibility with CMake < 3.5 will be removed from a future version of897 CMake.898899 Update the VERSION argument <min> value or use a ...<max> suffix to tell900 CMake that the project does not need compatibility with older versions.901902903CMake Deprecation Warning at td/benchmark/CMakeLists.txt:1 (cmake_minimum_required):904 Compatibility with CMake < 3.5 will be removed from a future version of905 CMake.906907 Update the VERSION argument <min> value or use a ...<max> suffix to tell908 CMake that the project does not need compatibility with older versions.909910911-- Performing Test COMPILER_HAS_HIDDEN_VISIBILITY912-- Performing Test COMPILER_HAS_HIDDEN_VISIBILITY - Success913-- Performing Test COMPILER_HAS_HIDDEN_INLINE_VISIBILITY914-- Performing Test COMPILER_HAS_HIDDEN_INLINE_VISIBILITY - Success915-- Performing Test COMPILER_HAS_DEPRECATED_ATTR916-- Performing Test COMPILER_HAS_DEPRECATED_ATTR - Success917-- Could NOT find Readline (missing: READLINE_INCLUDE_DIR READLINE_LIBRARY) 918-- Could NOT find Readline919-- Configuring done (8.2s)920-- Generating done (0.2s)921-- Build files have been written to: /work/proj/deps/tdlib/_build/tdlib/rel922make[2]: Entering directory '/work/proj/deps/tdlib/_build/tdlib/rel'923/usr/bin/cmake -S/work/proj/deps/tdlib/_build/tdlib -B/work/proj/deps/tdlib/_build/tdlib/rel --check-build-system CMakeFiles/Makefile.cmake 0924/usr/bin/cmake -E cmake_progress_start /work/proj/deps/tdlib/_build/tdlib/rel/CMakeFiles /work/proj/deps/tdlib/_build/tdlib/rel//CMakeFiles/progress.marks925make -f CMakeFiles/Makefile2 all926make[3]: Entering directory '/work/proj/deps/tdlib/_build/tdlib/rel'927make -f td/sqlite/CMakeFiles/tdsqlite.dir/build.make td/sqlite/CMakeFiles/tdsqlite.dir/depend928make -f td/tdutils/generate/CMakeFiles/generate_mime_types_gperf.dir/build.make td/tdutils/generate/CMakeFiles/generate_mime_types_gperf.dir/depend929make[4]: Entering directory '/work/proj/deps/tdlib/_build/tdlib/rel'930cd /work/proj/deps/tdlib/_build/tdlib/rel && /usr/bin/cmake -E cmake_depends "Unix Makefiles" /work/proj/deps/tdlib/_build/tdlib /work/proj/deps/tdlib/_build/tdlib/td/sqlite /work/proj/deps/tdlib/_build/tdlib/rel /work/proj/deps/tdlib/_build/tdlib/rel/td/sqlite /work/proj/deps/tdlib/_build/tdlib/rel/td/sqlite/CMakeFiles/tdsqlite.dir/DependInfo.cmake "--color="931make[4]: Entering directory '/work/proj/deps/tdlib/_build/tdlib/rel'932cd /work/proj/deps/tdlib/_build/tdlib/rel && /usr/bin/cmake -E cmake_depends "Unix Makefiles" /work/proj/deps/tdlib/_build/tdlib /work/proj/deps/tdlib/_build/tdlib/td/tdutils/generate /work/proj/deps/tdlib/_build/tdlib/rel /work/proj/deps/tdlib/_build/tdlib/rel/td/tdutils/generate /work/proj/deps/tdlib/_build/tdlib/rel/td/tdutils/generate/CMakeFiles/generate_mime_types_gperf.dir/DependInfo.cmake "--color="933make[4]: Leaving directory '/work/proj/deps/tdlib/_build/tdlib/rel'934make -f td/sqlite/CMakeFiles/tdsqlite.dir/build.make td/sqlite/CMakeFiles/tdsqlite.dir/build935make[4]: Entering directory '/work/proj/deps/tdlib/_build/tdlib/rel'936make[4]: Leaving directory '/work/proj/deps/tdlib/_build/tdlib/rel'937make -f td/tdutils/generate/CMakeFiles/generate_mime_types_gperf.dir/build.make td/tdutils/generate/CMakeFiles/generate_mime_types_gperf.dir/build938make[4]: Entering directory '/work/proj/deps/tdlib/_build/tdlib/rel'939[ 1%] Building C object td/sqlite/CMakeFiles/tdsqlite.dir/sqlite/sqlite3.c.o940cd /work/proj/deps/tdlib/_build/tdlib/rel/td/sqlite && /usr/bin/cc -DHAVE_USLEEP -DNDEBUG=1 -DSQLITE_DEFAULT_MEMSTATUS=0 -DSQLITE_DISABLE_LFS -DSQLITE_ENABLE_FTS5 -DSQLITE_HAS_CODEC -DSQLITE_OMIT_DECLTYPE -DSQLITE_OMIT_LOAD_EXTENSION -DSQLITE_OMIT_PROGRESS_CALLBACK -DSQLITE_TEMP_STORE=2 -D_FILE_OFFSET_BITS=64 -I/work/proj/deps/tdlib/_build/tdlib/td/sqlite -Wno-deprecated-declarations -Wno-unused-variable -Wno-unused-const-variable -Wno-unused-function -O3 -DNDEBUG -fPIC -MD -MT td/sqlite/CMakeFiles/tdsqlite.dir/sqlite/sqlite3.c.o -MF CMakeFiles/tdsqlite.dir/sqlite/sqlite3.c.o.d -o CMakeFiles/tdsqlite.dir/sqlite/sqlite3.c.o -c /work/proj/deps/tdlib/_build/tdlib/td/sqlite/sqlite/sqlite3.c941[ 2%] Building CXX object td/tdutils/generate/CMakeFiles/generate_mime_types_gperf.dir/generate_mime_types_gperf.cpp.o942cd /work/proj/deps/tdlib/_build/tdlib/rel/td/tdutils/generate && /usr/bin/c++ -D_FILE_OFFSET_BITS=64 -std=c++14 -fno-omit-frame-pointer -fno-exceptions -fno-rtti -ffunction-sections -fdata-sections -Wall -Wextra -Wimplicit-fallthrough=2 -Wpointer-arith -Wcast-qual -Wsign-compare -Wduplicated-branches -Wduplicated-cond -Walloc-zero -Wlogical-op -Wno-tautological-compare -Wpointer-arith -Wvla -Wnon-virtual-dtor -Wno-unused-parameter -Wconversion -Wno-sign-conversion -Wodr -flto-odr-type-merging -O3 -DNDEBUG -fPIE -MD -MT td/tdutils/generate/CMakeFiles/generate_mime_types_gperf.dir/generate_mime_types_gperf.cpp.o -MF CMakeFiles/generate_mime_types_gperf.dir/generate_mime_types_gperf.cpp.o.d -o CMakeFiles/generate_mime_types_gperf.dir/generate_mime_types_gperf.cpp.o -c /work/proj/deps/tdlib/_build/tdlib/td/tdutils/generate/generate_mime_types_gperf.cpp943[ 2%] Linking CXX executable generate_mime_types_gperf944cd /work/proj/deps/tdlib/_build/tdlib/rel/td/tdutils/generate && /usr/bin/cmake -E cmake_link_script CMakeFiles/generate_mime_types_gperf.dir/link.txt --verbose=0945make[4]: Leaving directory '/work/proj/deps/tdlib/_build/tdlib/rel'946[ 2%] Built target generate_mime_types_gperf947make -f td/tdtl/CMakeFiles/tdtl.dir/build.make td/tdtl/CMakeFiles/tdtl.dir/depend948make[4]: Entering directory '/work/proj/deps/tdlib/_build/tdlib/rel'949cd /work/proj/deps/tdlib/_build/tdlib/rel && /usr/bin/cmake -E cmake_depends "Unix Makefiles" /work/proj/deps/tdlib/_build/tdlib /work/proj/deps/tdlib/_build/tdlib/td/tdtl /work/proj/deps/tdlib/_build/tdlib/rel /work/proj/deps/tdlib/_build/tdlib/rel/td/tdtl /work/proj/deps/tdlib/_build/tdlib/rel/td/tdtl/CMakeFiles/tdtl.dir/DependInfo.cmake "--color="950make[4]: Leaving directory '/work/proj/deps/tdlib/_build/tdlib/rel'951make -f td/tdtl/CMakeFiles/tdtl.dir/build.make td/tdtl/CMakeFiles/tdtl.dir/build952make[4]: Entering directory '/work/proj/deps/tdlib/_build/tdlib/rel'953[ 2%] Building CXX object td/tdtl/CMakeFiles/tdtl.dir/td/tl/tl_config.cpp.o954cd /work/proj/deps/tdlib/_build/tdlib/rel/td/tdtl && /usr/bin/c++ -D_FILE_OFFSET_BITS=64 -I/work/proj/deps/tdlib/_build/tdlib/td/tdtl -std=c++14 -fno-omit-frame-pointer -fno-exceptions -fno-rtti -ffunction-sections -fdata-sections -Wall -Wextra -Wimplicit-fallthrough=2 -Wpointer-arith -Wcast-qual -Wsign-compare -Wduplicated-branches -Wduplicated-cond -Walloc-zero -Wlogical-op -Wno-tautological-compare -Wpointer-arith -Wvla -Wnon-virtual-dtor -Wno-unused-parameter -Wconversion -Wno-sign-conversion -Wodr -flto-odr-type-merging -O3 -DNDEBUG -fPIC -MD -MT td/tdtl/CMakeFiles/tdtl.dir/td/tl/tl_config.cpp.o -MF CMakeFiles/tdtl.dir/td/tl/tl_config.cpp.o.d -o CMakeFiles/tdtl.dir/td/tl/tl_config.cpp.o -c /work/proj/deps/tdlib/_build/tdlib/td/tdtl/td/tl/tl_config.cpp955[ 3%] Building CXX object td/tdtl/CMakeFiles/tdtl.dir/td/tl/tl_core.cpp.o956cd /work/proj/deps/tdlib/_build/tdlib/rel/td/tdtl && /usr/bin/c++ -D_FILE_OFFSET_BITS=64 -I/work/proj/deps/tdlib/_build/tdlib/td/tdtl -std=c++14 -fno-omit-frame-pointer -fno-exceptions -fno-rtti -ffunction-sections -fdata-sections -Wall -Wextra -Wimplicit-fallthrough=2 -Wpointer-arith -Wcast-qual -Wsign-compare -Wduplicated-branches -Wduplicated-cond -Walloc-zero -Wlogical-op -Wno-tautological-compare -Wpointer-arith -Wvla -Wnon-virtual-dtor -Wno-unused-parameter -Wconversion -Wno-sign-conversion -Wodr -flto-odr-type-merging -O3 -DNDEBUG -fPIC -MD -MT td/tdtl/CMakeFiles/tdtl.dir/td/tl/tl_core.cpp.o -MF CMakeFiles/tdtl.dir/td/tl/tl_core.cpp.o.d -o CMakeFiles/tdtl.dir/td/tl/tl_core.cpp.o -c /work/proj/deps/tdlib/_build/tdlib/td/tdtl/td/tl/tl_core.cpp957[ 3%] Building CXX object td/tdtl/CMakeFiles/tdtl.dir/td/tl/tl_file_outputer.cpp.o958cd /work/proj/deps/tdlib/_build/tdlib/rel/td/tdtl && /usr/bin/c++ -D_FILE_OFFSET_BITS=64 -I/work/proj/deps/tdlib/_build/tdlib/td/tdtl -std=c++14 -fno-omit-frame-pointer -fno-exceptions -fno-rtti -ffunction-sections -fdata-sections -Wall -Wextra -Wimplicit-fallthrough=2 -Wpointer-arith -Wcast-qual -Wsign-compare -Wduplicated-branches -Wduplicated-cond -Walloc-zero -Wlogical-op -Wno-tautological-compare -Wpointer-arith -Wvla -Wnon-virtual-dtor -Wno-unused-parameter -Wconversion -Wno-sign-conversion -Wodr -flto-odr-type-merging -O3 -DNDEBUG -fPIC -MD -MT td/tdtl/CMakeFiles/tdtl.dir/td/tl/tl_file_outputer.cpp.o -MF CMakeFiles/tdtl.dir/td/tl/tl_file_outputer.cpp.o.d -o CMakeFiles/tdtl.dir/td/tl/tl_file_outputer.cpp.o -c /work/proj/deps/tdlib/_build/tdlib/td/tdtl/td/tl/tl_file_outputer.cpp959[ 3%] Building CXX object td/tdtl/CMakeFiles/tdtl.dir/td/tl/tl_generate.cpp.o960cd /work/proj/deps/tdlib/_build/tdlib/rel/td/tdtl && /usr/bin/c++ -D_FILE_OFFSET_BITS=64 -I/work/proj/deps/tdlib/_build/tdlib/td/tdtl -std=c++14 -fno-omit-frame-pointer -fno-exceptions -fno-rtti -ffunction-sections -fdata-sections -Wall -Wextra -Wimplicit-fallthrough=2 -Wpointer-arith -Wcast-qual -Wsign-compare -Wduplicated-branches -Wduplicated-cond -Walloc-zero -Wlogical-op -Wno-tautological-compare -Wpointer-arith -Wvla -Wnon-virtual-dtor -Wno-unused-parameter -Wconversion -Wno-sign-conversion -Wodr -flto-odr-type-merging -O3 -DNDEBUG -fPIC -MD -MT td/tdtl/CMakeFiles/tdtl.dir/td/tl/tl_generate.cpp.o -MF CMakeFiles/tdtl.dir/td/tl/tl_generate.cpp.o.d -o CMakeFiles/tdtl.dir/td/tl/tl_generate.cpp.o -c /work/proj/deps/tdlib/_build/tdlib/td/tdtl/td/tl/tl_generate.cpp961[ 4%] Building CXX object td/tdtl/CMakeFiles/tdtl.dir/td/tl/tl_outputer.cpp.o962cd /work/proj/deps/tdlib/_build/tdlib/rel/td/tdtl && /usr/bin/c++ -D_FILE_OFFSET_BITS=64 -I/work/proj/deps/tdlib/_build/tdlib/td/tdtl -std=c++14 -fno-omit-frame-pointer -fno-exceptions -fno-rtti -ffunction-sections -fdata-sections -Wall -Wextra -Wimplicit-fallthrough=2 -Wpointer-arith -Wcast-qual -Wsign-compare -Wduplicated-branches -Wduplicated-cond -Walloc-zero -Wlogical-op -Wno-tautological-compare -Wpointer-arith -Wvla -Wnon-virtual-dtor -Wno-unused-parameter -Wconversion -Wno-sign-conversion -Wodr -flto-odr-type-merging -O3 -DNDEBUG -fPIC -MD -MT td/tdtl/CMakeFiles/tdtl.dir/td/tl/tl_outputer.cpp.o -MF CMakeFiles/tdtl.dir/td/tl/tl_outputer.cpp.o.d -o CMakeFiles/tdtl.dir/td/tl/tl_outputer.cpp.o -c /work/proj/deps/tdlib/_build/tdlib/td/tdtl/td/tl/tl_outputer.cpp963[ 4%] Building CXX object td/tdtl/CMakeFiles/tdtl.dir/td/tl/tl_string_outputer.cpp.o964cd /work/proj/deps/tdlib/_build/tdlib/rel/td/tdtl && /usr/bin/c++ -D_FILE_OFFSET_BITS=64 -I/work/proj/deps/tdlib/_build/tdlib/td/tdtl -std=c++14 -fno-omit-frame-pointer -fno-exceptions -fno-rtti -ffunction-sections -fdata-sections -Wall -Wextra -Wimplicit-fallthrough=2 -Wpointer-arith -Wcast-qual -Wsign-compare -Wduplicated-branches -Wduplicated-cond -Walloc-zero -Wlogical-op -Wno-tautological-compare -Wpointer-arith -Wvla -Wnon-virtual-dtor -Wno-unused-parameter -Wconversion -Wno-sign-conversion -Wodr -flto-odr-type-merging -O3 -DNDEBUG -fPIC -MD -MT td/tdtl/CMakeFiles/tdtl.dir/td/tl/tl_string_outputer.cpp.o -MF CMakeFiles/tdtl.dir/td/tl/tl_string_outputer.cpp.o.d -o CMakeFiles/tdtl.dir/td/tl/tl_string_outputer.cpp.o -c /work/proj/deps/tdlib/_build/tdlib/td/tdtl/td/tl/tl_string_outputer.cpp965[ 4%] Building CXX object td/tdtl/CMakeFiles/tdtl.dir/td/tl/tl_writer.cpp.o966cd /work/proj/deps/tdlib/_build/tdlib/rel/td/tdtl && /usr/bin/c++ -D_FILE_OFFSET_BITS=64 -I/work/proj/deps/tdlib/_build/tdlib/td/tdtl -std=c++14 -fno-omit-frame-pointer -fno-exceptions -fno-rtti -ffunction-sections -fdata-sections -Wall -Wextra -Wimplicit-fallthrough=2 -Wpointer-arith -Wcast-qual -Wsign-compare -Wduplicated-branches -Wduplicated-cond -Walloc-zero -Wlogical-op -Wno-tautological-compare -Wpointer-arith -Wvla -Wnon-virtual-dtor -Wno-unused-parameter -Wconversion -Wno-sign-conversion -Wodr -flto-odr-type-merging -O3 -DNDEBUG -fPIC -MD -MT td/tdtl/CMakeFiles/tdtl.dir/td/tl/tl_writer.cpp.o -MF CMakeFiles/tdtl.dir/td/tl/tl_writer.cpp.o.d -o CMakeFiles/tdtl.dir/td/tl/tl_writer.cpp.o -c /work/proj/deps/tdlib/_build/tdlib/td/tdtl/td/tl/tl_writer.cpp967[ 5%] Linking CXX static library libtdtl.a968cd /work/proj/deps/tdlib/_build/tdlib/rel/td/tdtl && /usr/bin/cmake -P CMakeFiles/tdtl.dir/cmake_clean_target.cmake969cd /work/proj/deps/tdlib/_build/tdlib/rel/td/tdtl && /usr/bin/cmake -E cmake_link_script CMakeFiles/tdtl.dir/link.txt --verbose=0970make[4]: Leaving directory '/work/proj/deps/tdlib/_build/tdlib/rel'971[ 5%] Built target tdtl972make -f td/CMakeFiles/git_commit.dir/build.make td/CMakeFiles/git_commit.dir/depend973make[4]: Entering directory '/work/proj/deps/tdlib/_build/tdlib/rel'974cd /work/proj/deps/tdlib/_build/tdlib/rel && /usr/bin/cmake -E cmake_depends "Unix Makefiles" /work/proj/deps/tdlib/_build/tdlib /work/proj/deps/tdlib/_build/tdlib/td /work/proj/deps/tdlib/_build/tdlib/rel /work/proj/deps/tdlib/_build/tdlib/rel/td /work/proj/deps/tdlib/_build/tdlib/rel/td/CMakeFiles/git_commit.dir/DependInfo.cmake "--color="975make[4]: Leaving directory '/work/proj/deps/tdlib/_build/tdlib/rel'976make -f td/CMakeFiles/git_commit.dir/build.make td/CMakeFiles/git_commit.dir/build977make[4]: Entering directory '/work/proj/deps/tdlib/_build/tdlib/rel'978[ 5%] Generate git_commit.h979cd /work/proj/deps/tdlib/_build/tdlib/td && ./gen_git_commit_h.sh980fatal: not a git repository (or any parent up to mount point /)981Stopping at filesystem boundary (GIT_DISCOVERY_ACROSS_FILESYSTEM not set).982fatal: not a git repository (or any parent up to mount point /)983Stopping at filesystem boundary (GIT_DISCOVERY_ACROSS_FILESYSTEM not set).984make[4]: Leaving directory '/work/proj/deps/tdlib/_build/tdlib/rel'985[ 5%] Built target git_commit986make -f td/td/generate/CMakeFiles/generate_c.dir/build.make td/td/generate/CMakeFiles/generate_c.dir/depend987make[4]: Entering directory '/work/proj/deps/tdlib/_build/tdlib/rel'988cd /work/proj/deps/tdlib/_build/tdlib/rel && /usr/bin/cmake -E cmake_depends "Unix Makefiles" /work/proj/deps/tdlib/_build/tdlib /work/proj/deps/tdlib/_build/tdlib/td/td/generate /work/proj/deps/tdlib/_build/tdlib/rel /work/proj/deps/tdlib/_build/tdlib/rel/td/td/generate /work/proj/deps/tdlib/_build/tdlib/rel/td/td/generate/CMakeFiles/generate_c.dir/DependInfo.cmake "--color="989make[4]: Leaving directory '/work/proj/deps/tdlib/_build/tdlib/rel'990make -f td/td/generate/CMakeFiles/generate_c.dir/build.make td/td/generate/CMakeFiles/generate_c.dir/build991make[4]: Entering directory '/work/proj/deps/tdlib/_build/tdlib/rel'992[ 6%] Building CXX object td/td/generate/CMakeFiles/generate_c.dir/generate_c.cpp.o993cd /work/proj/deps/tdlib/_build/tdlib/rel/td/td/generate && /usr/bin/c++ -D_FILE_OFFSET_BITS=64 -I/work/proj/deps/tdlib/_build/tdlib/td/tdtl -std=c++14 -fno-omit-frame-pointer -fno-exceptions -fno-rtti -ffunction-sections -fdata-sections -Wall -Wextra -Wimplicit-fallthrough=2 -Wpointer-arith -Wcast-qual -Wsign-compare -Wduplicated-branches -Wduplicated-cond -Walloc-zero -Wlogical-op -Wno-tautological-compare -Wpointer-arith -Wvla -Wnon-virtual-dtor -Wno-unused-parameter -Wconversion -Wno-sign-conversion -Wodr -flto-odr-type-merging -O3 -DNDEBUG -fPIE -MD -MT td/td/generate/CMakeFiles/generate_c.dir/generate_c.cpp.o -MF CMakeFiles/generate_c.dir/generate_c.cpp.o.d -o CMakeFiles/generate_c.dir/generate_c.cpp.o -c /work/proj/deps/tdlib/_build/tdlib/td/td/generate/generate_c.cpp994[ 6%] Linking CXX executable generate_c995cd /work/proj/deps/tdlib/_build/tdlib/rel/td/td/generate && /usr/bin/cmake -E cmake_link_script CMakeFiles/generate_c.dir/link.txt --verbose=0996make[4]: Leaving directory '/work/proj/deps/tdlib/_build/tdlib/rel'997[ 6%] Built target generate_c998make -f td/td/generate/CMakeFiles/td_generate_java_api.dir/build.make td/td/generate/CMakeFiles/td_generate_java_api.dir/depend999make[4]: Entering directory '/work/proj/deps/tdlib/_build/tdlib/rel'1000cd /work/proj/deps/tdlib/_build/tdlib/rel && /usr/bin/cmake -E cmake_depends "Unix Makefiles" /work/proj/deps/tdlib/_build/tdlib /work/proj/deps/tdlib/_build/tdlib/td/td/generate /work/proj/deps/tdlib/_build/tdlib/rel /work/proj/deps/tdlib/_build/tdlib/rel/td/td/generate /work/proj/deps/tdlib/_build/tdlib/rel/td/td/generate/CMakeFiles/td_generate_java_api.dir/DependInfo.cmake "--color="1001make[4]: Leaving directory '/work/proj/deps/tdlib/_build/tdlib/rel'1002make -f td/td/generate/CMakeFiles/td_generate_java_api.dir/build.make td/td/generate/CMakeFiles/td_generate_java_api.dir/build1003make[4]: Entering directory '/work/proj/deps/tdlib/_build/tdlib/rel'1004[ 6%] Building CXX object td/td/generate/CMakeFiles/td_generate_java_api.dir/generate_java.cpp.o1005cd /work/proj/deps/tdlib/_build/tdlib/rel/td/td/generate && /usr/bin/c++ -D_FILE_OFFSET_BITS=64 -I/work/proj/deps/tdlib/_build/tdlib/td/tdtl -std=c++14 -fno-omit-frame-pointer -fno-exceptions -fno-rtti -ffunction-sections -fdata-sections -Wall -Wextra -Wimplicit-fallthrough=2 -Wpointer-arith -Wcast-qual -Wsign-compare -Wduplicated-branches -Wduplicated-cond -Walloc-zero -Wlogical-op -Wno-tautological-compare -Wpointer-arith -Wvla -Wnon-virtual-dtor -Wno-unused-parameter -Wconversion -Wno-sign-conversion -Wodr -flto-odr-type-merging -O3 -DNDEBUG -fPIE -MD -MT td/td/generate/CMakeFiles/td_generate_java_api.dir/generate_java.cpp.o -MF CMakeFiles/td_generate_java_api.dir/generate_java.cpp.o.d -o CMakeFiles/td_generate_java_api.dir/generate_java.cpp.o -c /work/proj/deps/tdlib/_build/tdlib/td/td/generate/generate_java.cpp1006[ 6%] Building CXX object td/td/generate/CMakeFiles/td_generate_java_api.dir/tl_writer_java.cpp.o1007cd /work/proj/deps/tdlib/_build/tdlib/rel/td/td/generate && /usr/bin/c++ -D_FILE_OFFSET_BITS=64 -I/work/proj/deps/tdlib/_build/tdlib/td/tdtl -std=c++14 -fno-omit-frame-pointer -fno-exceptions -fno-rtti -ffunction-sections -fdata-sections -Wall -Wextra -Wimplicit-fallthrough=2 -Wpointer-arith -Wcast-qual -Wsign-compare -Wduplicated-branches -Wduplicated-cond -Walloc-zero -Wlogical-op -Wno-tautological-compare -Wpointer-arith -Wvla -Wnon-virtual-dtor -Wno-unused-parameter -Wconversion -Wno-sign-conversion -Wodr -flto-odr-type-merging -O3 -DNDEBUG -fPIE -MD -MT td/td/generate/CMakeFiles/td_generate_java_api.dir/tl_writer_java.cpp.o -MF CMakeFiles/td_generate_java_api.dir/tl_writer_java.cpp.o.d -o CMakeFiles/td_generate_java_api.dir/tl_writer_java.cpp.o -c /work/proj/deps/tdlib/_build/tdlib/td/td/generate/tl_writer_java.cpp1008[ 7%] Linking CXX executable td_generate_java_api1009cd /work/proj/deps/tdlib/_build/tdlib/rel/td/td/generate && /usr/bin/cmake -E cmake_link_script CMakeFiles/td_generate_java_api.dir/link.txt --verbose=01010make[4]: Leaving directory '/work/proj/deps/tdlib/_build/tdlib/rel'1011[ 7%] Built target td_generate_java_api1012make -f td/tdutils/generate/CMakeFiles/tdmime_auto.dir/build.make td/tdutils/generate/CMakeFiles/tdmime_auto.dir/depend1013make[4]: Entering directory '/work/proj/deps/tdlib/_build/tdlib/rel'1014cd /work/proj/deps/tdlib/_build/tdlib/rel && /usr/bin/cmake -E cmake_depends "Unix Makefiles" /work/proj/deps/tdlib/_build/tdlib /work/proj/deps/tdlib/_build/tdlib/td/tdutils/generate /work/proj/deps/tdlib/_build/tdlib/rel /work/proj/deps/tdlib/_build/tdlib/rel/td/tdutils/generate /work/proj/deps/tdlib/_build/tdlib/rel/td/tdutils/generate/CMakeFiles/tdmime_auto.dir/DependInfo.cmake "--color="1015make[4]: Leaving directory '/work/proj/deps/tdlib/_build/tdlib/rel'1016make -f td/tdutils/generate/CMakeFiles/tdmime_auto.dir/build.make td/tdutils/generate/CMakeFiles/tdmime_auto.dir/build1017make[4]: Entering directory '/work/proj/deps/tdlib/_build/tdlib/rel'1018[ 7%] Generating /work/proj/deps/tdlib/_build/tdlib/td/tdutils/generate/auto/mime_type_to_extension.gperf, /work/proj/deps/tdlib/_build/tdlib/td/tdutils/generate/auto/extension_to_mime_type.gperf1019cd /work/proj/deps/tdlib/_build/tdlib/td/tdutils/generate && /work/proj/deps/tdlib/_build/tdlib/rel/td/tdutils/generate/generate_mime_types_gperf mime_types.txt /work/proj/deps/tdlib/_build/tdlib/td/tdutils/generate/auto/mime_type_to_extension.gperf /work/proj/deps/tdlib/_build/tdlib/td/tdutils/generate/auto/extension_to_mime_type.gperf1020Extension "wmz" matches more than one type1021Extension "sub" matches more than one type1022[ 7%] Generating /work/proj/deps/tdlib/_build/tdlib/td/tdutils/generate/auto/mime_type_to_extension.cpp1023cd /work/proj/deps/tdlib/_build/tdlib/td/tdutils/generate && gperf -m100 auto/mime_type_to_extension.gperf | grep -v __gnu_inline__ > auto/mime_type_to_extension.cpp1024/bin/sh: 1: gperf: not found1025make[4]: *** [td/tdutils/generate/CMakeFiles/tdmime_auto.dir/build.make:78: /work/proj/deps/tdlib/_build/tdlib/td/tdutils/generate/auto/mime_type_to_extension.cpp] Error 11026make[4]: *** Deleting file '/work/proj/deps/tdlib/_build/tdlib/td/tdutils/generate/auto/mime_type_to_extension.cpp'1027make[4]: Leaving directory '/work/proj/deps/tdlib/_build/tdlib/rel'1028make[3]: *** [CMakeFiles/Makefile2:736: td/tdutils/generate/CMakeFiles/tdmime_auto.dir/all] Error 21029make[3]: *** Waiting for unfinished jobs....1030/work/proj/deps/tdlib/_build/tdlib/td/sqlite/sqlite/sqlite3.c: In function ‘sqlite3SelectNew’:1031/work/proj/deps/tdlib/_build/tdlib/td/sqlite/sqlite/sqlite3.c:117655:10: warning: function may return address of local variable [-Wreturn-local-addr]1032117655 | return pNew;1033 | ^~~~1034/work/proj/deps/tdlib/_build/tdlib/td/sqlite/sqlite/sqlite3.c:117615:10: note: declared here1035117615 | Select standin;1036 | ^~~~~~~1037/work/proj/deps/tdlib/_build/tdlib/td/sqlite/sqlite/sqlite3.c:117615:10: note: declared here1038In file included from /usr/include/string.h:548,1039 from /work/proj/deps/tdlib/_build/tdlib/td/sqlite/sqlite/sqlite3.c:11467:1040In function ‘memcpy’,1041 inlined from ‘sqlite3Fts5IndexQuery’ at /work/proj/deps/tdlib/_build/tdlib/td/sqlite/sqlite/sqlite3.c:195001:5:1042/usr/include/x86_64-linux-gnu/bits/string_fortified.h:29:10: warning: ‘__builtin_memcpy’ specified bound 18446744073709551615 exceeds maximum object size 9223372036854775807 [-Wstringop-overflow=]1043 29 | return __builtin___memcpy_chk (__dest, __src, __len,1044 | ^~~~~~~~~~~~~~~~~~~~~~~~~~~~~~~~~~~~~~~~~~~~~1045 30 | __glibc_objsize0 (__dest));1046 | ~~~~~~~~~~~~~~~~~~~~~~~~~~1047[ 7%] Linking C static library libtdsqlite.a1048cd /work/proj/deps/tdlib/_build/tdlib/rel/td/sqlite && /usr/bin/cmake -P CMakeFiles/tdsqlite.dir/cmake_clean_target.cmake1049cd /work/proj/deps/tdlib/_build/tdlib/rel/td/sqlite && /usr/bin/cmake -E cmake_link_script CMakeFiles/tdsqlite.dir/link.txt --verbose=01050make[4]: Leaving directory '/work/proj/deps/tdlib/_build/tdlib/rel'1051[ 7%] Built target tdsqlite1052make[3]: Leaving directory '/work/proj/deps/tdlib/_build/tdlib/rel'1053make[2]: *** [Makefile:136: all] Error 21054make[2]: Leaving directory '/work/proj/deps/tdlib/_build/tdlib/rel'1055make[1]: *** [Makefile:29: build] Error 21056make[1]: Leaving directory '/work/proj/deps/tdlib'1057make: *** [Makefile:14: all] Error 21058could not compile dependency :tdlib, "mix compile" failed. Errors may have been logged above. You can recompile this dependency with "mix deps.compile tdlib --force", update it with "mix deps.update tdlib" or clean it with "mix deps.clean tdlib"1059==> nerves_compatibility_test1060** (Mix) Could not compile with "make" (exit status: 2).1061You need to have gcc and make installed. If you are using1062Ubuntu or any other Debian-based system, install the packages1063"build-essential". Also install "erlang-dev" package if not1064included in your Erlang/OTP version. If you're on Fedora, run1065"dnf group install 'Development Tools'".1066