tpm

Build log

nerves_system_rpi4

tpm 0.2.0 · fail · run tpm-0.2.0-1791143576330
287 of 287 lines
1Resolving Hex dependencies...2Resolution completed in 0.101s3Unchanged:4  castore 1.0.215  circular_buffer 1.1.06  elixir_make 0.10.07  interactive_cmd 0.1.48  muontrap 1.8.09  nerves 2.0.0-pre.210  nerves_discovery 0.1.511  nerves_logging 0.2.412  nerves_runtime 0.13.1313  nerves_system_bbb 2.30.214  nerves_system_br 1.34.415  nerves_system_mangopi_mq_pro 0.17.216  nerves_system_qemu_aarch64 0.4.217  nerves_system_rpi0 2.1.218  nerves_system_rpi4 2.1.219  nerves_system_rpi5 2.1.220  nerves_system_trellis 0.5.021  nerves_system_x86_64 1.34.222  nerves_toolchain_aarch64_nerves_linux_gnu 15.3.123  nerves_toolchain_armv6_nerves_linux_gnueabihf 15.3.124  nerves_toolchain_armv7_nerves_linux_gnueabihf 15.3.125  nerves_toolchain_riscv64_nerves_linux_gnu 15.3.126  nerves_toolchain_x86_64_nerves_linux_musl 15.3.127  nerves_uevent 0.1.728  property_table 0.3.429  ring_logger 0.11.730  tablet 0.3.331  toolshed 0.5.032  tpm 0.2.033  uboot_env 1.0.234  x509 0.9.235* Getting tpm (Hex package)36* Getting nerves (Hex package)37* Getting ring_logger (Hex package)38* Getting toolshed (Hex package)39* Getting nerves_runtime (Hex package)40* Getting nerves_system_bbb (Hex package)41* Getting nerves_system_mangopi_mq_pro (Hex package)42* Getting nerves_system_qemu_aarch64 (Hex package)43* Getting nerves_system_rpi0 (Hex package)44* Getting nerves_system_rpi4 (Hex package)45* Getting nerves_system_rpi5 (Hex package)46* Getting nerves_system_trellis (Hex package)47* Getting nerves_system_x86_64 (Hex package)48* Getting nerves_system_br (Hex package)49* Getting nerves_toolchain_x86_64_nerves_linux_musl (Hex package)50* Getting nerves_toolchain_armv7_nerves_linux_gnueabihf (Hex package)51* Getting nerves_toolchain_aarch64_nerves_linux_gnu (Hex package)52* Getting nerves_toolchain_armv6_nerves_linux_gnueabihf (Hex package)53* Getting nerves_toolchain_riscv64_nerves_linux_gnu (Hex package)54* Getting nerves_logging (Hex package)55* Getting nerves_uevent (Hex package)56* Getting uboot_env (Hex package)57* Getting elixir_make (Hex package)58* Getting property_table (Hex package)59* Getting circular_buffer (Hex package)60* Getting interactive_cmd (Hex package)61* Getting nerves_discovery (Hex package)62* Getting tablet (Hex package)63* Getting castore (Hex package)64* Getting muontrap (Hex package)65* Getting x509 (Hex package)66==> nerves_system_br67Generated nerves_system_br app68warning: "xref: [exclude: ...]" in your mix.exs file is deprecated, instead use: "elixirc_options: [no_warn_undefined: ...]"69  (mix 1.20.3) lib/mix/tasks/compile.elixir.ex:243: Mix.Tasks.Compile.Elixir.xref_exclude_opts/270  (mix 1.20.3) lib/mix/tasks/compile.elixir.ex:142: Mix.Tasks.Compile.Elixir.run/171  (mix 1.20.3) lib/mix/task.ex:502: anonymous fn/3 in Mix.Task.run_task/572  (mix 1.20.3) lib/mix/task.compiler.ex:299: Mix.Task.Compiler.run_compiler/273  (mix 1.20.3) lib/mix/task.compiler.ex:287: Mix.Task.Compiler.run/474  (mix 1.20.3) lib/mix/tasks/compile.all.ex:75: Mix.Tasks.Compile.All.do_run/27576==> x50977Compiling 24 files (.ex)78     warning: the variable "size" is accessed inside size(...) of a bitstring but it was defined outside of the match. You must precede it with the pin operator79     │80 371 │     <<i::unsigned-size(size)-unit(8)>> = :crypto.strong_rand_bytes(size)81     │                        ~82     │83     └─ lib/x509/certificate.ex:371:24: X509.Certificate.random_serial/18485Generated x509 app86==> circular_buffer87Compiling 1 file (.ex)88Generated circular_buffer app89==> tablet90Compiling 2 files (.ex)91Generated tablet app92==> elixir_make93Compiling 8 files (.ex)94Generated elixir_make app95==> nerves_logging96 CC kmsg_tailer.o97 LD kmsg_tailer98Compiling 5 files (.ex)99Generated nerves_logging app100==> castore101Compiling 1 file (.ex)102Generated castore app103==> nerves_discovery104Compiling 5 files (.ex)105Generated nerves_discovery app106==> ring_logger107Compiling 7 files (.ex)108Generated ring_logger app109==> interactive_cmd110Compiling 1 file (.ex)111Generated interactive_cmd app112==> nerves113Compiling 65 files (.ex)114    warning: redefining module Mix.Tasks.Nerves.Init (current version loaded from /work/proj/_build/rpi4/lib/nerves/ebin/Elixir.Mix.Tasks.Nerves.Init.beam)115    │116  6 │ defmodule Mix.Tasks.Nerves.Init do117    │ ~~~~~~~~~~~~~~~~~~~~~~~~~~~~~~~~~~118    │119    └─ lib/mix/tasks/nerves.init.ex:6: Mix.Tasks.Nerves.Init (module)120121    warning: redefining module Nerves (current version loaded from /work/proj/_build/rpi4/lib/nerves/ebin/Elixir.Nerves.beam)122    │123  6 │ defmodule Nerves do124    │ ~~~~~~~~~~~~~~~~~~~125    │126    └─ lib/nerves.ex:6: Nerves (module)127128    warning: redefining module Nerves.ArtifactResolver (current version loaded from /work/proj/_build/rpi4/lib/nerves/ebin/Elixir.Nerves.ArtifactResolver.beam)129    │130  5 │ defmodule Nerves.ArtifactResolver do131    │ ~~~~~~~~~~~~~~~~~~~~~~~~~~~~~~~~~~~~132    │133    └─ lib/nerves/artifact_resolver.ex:5: Nerves.ArtifactResolver (module)134135    warning: redefining module Nerves.BuildAction.AppModes (current version loaded from /work/proj/_build/rpi4/lib/nerves/ebin/Elixir.Nerves.BuildAction.AppModes.beam)136    │137  6 │ defmodule Nerves.BuildAction.AppModes do138    │ ~~~~~~~~~~~~~~~~~~~~~~~~~~~~~~~~~~~~~~~~139    │140    └─ lib/nerves/build_action/app_modes.ex:6: Nerves.BuildAction.AppModes (module)141142    warning: redefining module Nerves.BuildAction.CheckExecutables (current version loaded from /work/proj/_build/rpi4/lib/nerves/ebin/Elixir.Nerves.BuildAction.CheckExecutables.beam)143    │144  5 │ defmodule Nerves.BuildAction.CheckExecutables do145    │ ~~~~~~~~~~~~~~~~~~~~~~~~~~~~~~~~~~~~~~~~~~~~~~~~146    │147    └─ lib/nerves/build_action/check_executables.ex:5: Nerves.BuildAction.CheckExecutables (module)148149    warning: redefining module Nerves.BuildAction.Erlinit (current version loaded from /work/proj/_build/rpi4/lib/nerves/ebin/Elixir.Nerves.BuildAction.Erlinit.beam)150    │151  8 │ defmodule Nerves.BuildAction.Erlinit do152    │ ~~~~~~~~~~~~~~~~~~~~~~~~~~~~~~~~~~~~~~~153    │154    └─ lib/nerves/build_action/erlinit.ex:8: Nerves.BuildAction.Erlinit (module)155156    warning: redefining module Nerves.BuildAction.Firmware (current version loaded from /work/proj/_build/rpi4/lib/nerves/ebin/Elixir.Nerves.BuildAction.Firmware.beam)157    │158  5 │ defmodule Nerves.BuildAction.Firmware do159    │ ~~~~~~~~~~~~~~~~~~~~~~~~~~~~~~~~~~~~~~~~160    │161    └─ lib/nerves/build_action/firmware.ex:5: Nerves.BuildAction.Firmware (module)162163    warning: redefining module Nerves.BuildAction.IExStartupCheck (current version loaded from /work/proj/_build/rpi4/lib/nerves/ebin/Elixir.Nerves.BuildAction.IExStartupCheck.beam)164    │165  7 │ defmodule Nerves.BuildAction.IExStartupCheck do166    │ ~~~~~~~~~~~~~~~~~~~~~~~~~~~~~~~~~~~~~~~~~~~~~~~167    │168    └─ lib/nerves/build_action/iex_startup_check.ex:7: Nerves.BuildAction.IExStartupCheck (module)169170    warning: redefining module Nerves.BuildAction.NervesV1System (current version loaded from /work/proj/_build/rpi4/lib/nerves/ebin/Elixir.Nerves.BuildAction.NervesV1System.beam)171    │172  5 │ defmodule Nerves.BuildAction.NervesV1System do173    │ ~~~~~~~~~~~~~~~~~~~~~~~~~~~~~~~~~~~~~~~~~~~~~~174    │175    └─ lib/nerves/build_action/nerves_v1_system.ex:5: Nerves.BuildAction.NervesV1System (module)176177    warning: redefining module Nerves.BuildAction.NervesV1Toolchain (current version loaded from /work/proj/_build/rpi4/lib/nerves/ebin/Elixir.Nerves.BuildAction.NervesV1Toolchain.beam)178    │179  5 │ defmodule Nerves.BuildAction.NervesV1Toolchain do180    │ ~~~~~~~~~~~~~~~~~~~~~~~~~~~~~~~~~~~~~~~~~~~~~~~~~181    │182    └─ lib/nerves/build_action/nerves_v1_toolchain.ex:5: Nerves.BuildAction.NervesV1Toolchain (module)183184    warning: redefining module Nerves.BuildAction.Rootfs (current version loaded from /work/proj/_build/rpi4/lib/nerves/ebin/Elixir.Nerves.BuildAction.Rootfs.beam)185    │186  5 │ defmodule Nerves.BuildAction.Rootfs do187    │ ~~~~~~~~~~~~~~~~~~~~~~~~~~~~~~~~~~~~~~188    │189    └─ lib/nerves/build_action/rootfs.ex:5: Nerves.BuildAction.Rootfs (module)190191    warning: redefining module Nerves.BuildAction.SortApps (current version loaded from /work/proj/_build/rpi4/lib/nerves/ebin/Elixir.Nerves.BuildAction.SortApps.beam)192    │193  6 │ defmodule Nerves.BuildAction.SortApps do194    │ ~~~~~~~~~~~~~~~~~~~~~~~~~~~~~~~~~~~~~~~~195    │196    └─ lib/nerves/build_action/sort_apps.ex:6: Nerves.BuildAction.SortApps (module)197198    warning: redefining module Nerves.BuildAction.StripAll (current version loaded from /work/proj/_build/rpi4/lib/nerves/ebin/Elixir.Nerves.BuildAction.StripAll.beam)199    │200  5 │ defmodule Nerves.BuildAction.StripAll do201    │ ~~~~~~~~~~~~~~~~~~~~~~~~~~~~~~~~~~~~~~~~202    │203    └─ lib/nerves/build_action/strip_all.ex:5: Nerves.BuildAction.StripAll (module)204205    warning: redefining module Nerves.BuildAction.Trimmer (current version loaded from /work/proj/_build/rpi4/lib/nerves/ebin/Elixir.Nerves.BuildAction.Trimmer.beam)206    │207  5 │ defmodule Nerves.BuildAction.Trimmer do208    │ ~~~~~~~~~~~~~~~~~~~~~~~~~~~~~~~~~~~~~~~209    │210    └─ lib/nerves/build_action/trimmer.ex:5: Nerves.BuildAction.Trimmer (module)211212    warning: redefining module Nerves.BuildPlan (current version loaded from /work/proj/_build/rpi4/lib/nerves/ebin/Elixir.Nerves.BuildPlan.beam)213    │214  5 │ defmodule Nerves.BuildPlan do215    │ ~~~~~~~~~~~~~~~~~~~~~~~~~~~~~216    │217    └─ lib/nerves/build_plan.ex:5: Nerves.BuildPlan (module)218219    warning: redefining module Nerves.BuildPlan.Checks (current version loaded from /work/proj/_build/rpi4/lib/nerves/ebin/Elixir.Nerves.BuildPlan.Checks.beam)220    │221  5 │ defmodule Nerves.BuildPlan.Checks do222    │ ~~~~~~~~~~~~~~~~~~~~~~~~~~~~~~~~~~~~223    │224    └─ lib/nerves/build_plan/checks.ex:5: Nerves.BuildPlan.Checks (module)225226    warning: redefining module Nerves.Container (current version loaded from /work/proj/_build/rpi4/lib/nerves/ebin/Elixir.Nerves.Container.beam)227    │228  6 │ defmodule Nerves.Container do229    │ ~~~~~~~~~~~~~~~~~~~~~~~~~~~~~230    │231    └─ lib/nerves/container.ex:6: Nerves.Container (module)232233    warning: redefining module Nerves.Fingerprint (current version loaded from /work/proj/_build/rpi4/lib/nerves/ebin/Elixir.Nerves.Fingerprint.beam)234    │235  5 │ defmodule Nerves.Fingerprint do236    │ ~~~~~~~~~~~~~~~~~~~~~~~~~~~~~~~237    │238    └─ lib/nerves/fingerprint.ex:5: Nerves.Fingerprint (module)239240    warning: redefining module Nerves.MixPackage (current version loaded from /work/proj/_build/rpi4/lib/nerves/ebin/Elixir.Nerves.MixPackage.beam)241    │242  5 │ defmodule Nerves.MixPackage do243    │ ~~~~~~~~~~~~~~~~~~~~~~~~~~~~~~244    │245    └─ lib/nerves/mix_package.ex:5: Nerves.MixPackage (module)246247    warning: redefining module Nerves.Paths (current version loaded from /work/proj/_build/rpi4/lib/nerves/ebin/Elixir.Nerves.Paths.beam)248    │249  5 │ defmodule Nerves.Paths do250    │ ~~~~~~~~~~~~~~~~~~~~~~~~~251    │252    └─ lib/nerves/paths.ex:5: Nerves.Paths (module)253254    warning: redefining module Nerves.TargetTuple (current version loaded from /work/proj/_build/rpi4/lib/nerves/ebin/Elixir.Nerves.TargetTuple.beam)255    │256  5 │ defmodule Nerves.TargetTuple do257    │ ~~~~~~~~~~~~~~~~~~~~~~~~~~~~~~~258    │259    └─ lib/nerves/target_tuple.ex:5: Nerves.TargetTuple (module)260261Generated nerves app262==> nerves_toolchain_aarch64_nerves_linux_gnu263Compiling 1 file (.ex)264Generated nerves_toolchain_aarch64_nerves_linux_gnu app265==> nerves_system_rpi4266Generated nerves_system_rpi4 app267==> muontrap268make[1]: Entering directory '/work/proj/deps_rpi4/muontrap/c_src'269 CC muontrap.o270Assembler messages:271Fatal error: can't create /work/proj/_build/rpi4/lib/muontrap/obj/muontrap.o: No such file or directory272muontrap.c:901:1: fatal error: error writing to -: Broken pipe273  901 | }274      | ^275compilation terminated.276make[1]: *** [Makefile:41: /work/proj/_build/rpi4/lib/muontrap/obj/muontrap.o] Error 1277make[1]: Leaving directory '/work/proj/deps_rpi4/muontrap/c_src'278make: *** [Makefile:5: all] Error 2279could not compile dependency :muontrap, "mix compile" failed. Errors may have been logged above. You can recompile this dependency with "mix deps.compile muontrap --force", update it with "mix deps.update muontrap" or clean it with "mix deps.clean muontrap"280==> nerves_compatibility_test281** (Mix) Could not compile with "make" (exit status: 2).282You need to have gcc and make installed. If you are using283Ubuntu or any other Debian-based system, install the packages284"build-essential". Also install "erlang-dev" package if not285included in your Erlang/OTP version. If you're on Fedora, run286"dnf group install 'Development Tools'".287