Build log
host
vintage_net_wifi 0.12.11 · fail · run vintage_net_wifi-0.12.11-1791152270245
65 of 65 lines
1Resolving Hex dependencies...2Resolution completed in 0.098s3Unchanged:4 beam_notify 1.1.15 circular_buffer 1.1.06 elixir_make 0.10.07 interactive_cmd 0.1.48 muontrap 1.8.09 nerves 2.0.0-pre.210 nerves_discovery 0.1.511 nerves_logging 0.2.412 nerves_runtime 0.13.1313 nerves_system_bbb 2.30.214 nerves_system_br 1.34.415 nerves_system_mangopi_mq_pro 0.17.216 nerves_system_qemu_aarch64 0.4.217 nerves_system_rpi0 2.1.218 nerves_system_rpi4 2.1.219 nerves_system_rpi5 2.1.220 nerves_system_trellis 0.5.021 nerves_system_x86_64 1.34.222 nerves_toolchain_aarch64_nerves_linux_gnu 15.3.123 nerves_toolchain_armv6_nerves_linux_gnueabihf 15.3.124 nerves_toolchain_armv7_nerves_linux_gnueabihf 15.3.125 nerves_toolchain_riscv64_nerves_linux_gnu 15.3.126 nerves_toolchain_x86_64_nerves_linux_musl 15.3.127 nerves_uevent 0.1.728 property_table 0.3.429 ring_logger 0.11.730 tablet 0.3.331 toolshed 0.5.032 uboot_env 1.0.233 vintage_net 0.13.1334 vintage_net_wifi 0.12.1135All dependencies have been fetched36==> vintage_net_wifi37Package libnl-genl-3.0 was not found in the pkg-config search path.38Perhaps you should add the directory containing `libnl-genl-3.0.pc'39to the PKG_CONFIG_PATH environment variable40Package 'libnl-genl-3.0', required by 'virtual:world', not found41 CC force_ap_scan.o42Package libnl-genl-3.0 was not found in the pkg-config search path.43Perhaps you should add the directory containing `libnl-genl-3.0.pc'44to the PKG_CONFIG_PATH environment variable45Package 'libnl-genl-3.0', required by 'virtual:world', not found46 CC mesh_mode.o47Package libnl-genl-3.0 was not found in the pkg-config search path.48Perhaps you should add the directory containing `libnl-genl-3.0.pc'49to the PKG_CONFIG_PATH environment variable50Package 'libnl-genl-3.0', required by 'virtual:world', not found51c_src/mesh_mode.c:24:10: fatal error: netlink/genl/genl.h: No such file or directory52 24 | #include <netlink/genl/genl.h>53 | ^~~~~~~~~~~~~~~~~~~~~54c_src/force_ap_scan.c:24:10: fatal error: netlink/genl/genl.h: No such file or directory55 24 | #include <netlink/genl/genl.h>56 | ^~~~~~~~~~~~~~~~~~~~~57compilation terminated.58compilation terminated.59make: *** [Makefile:92: /work/proj/_build/host/lib/vintage_net_wifi/obj/force_ap_scan.o] Error 160make: *** Waiting for unfinished jobs....61make: *** [Makefile:92: /work/proj/_build/host/lib/vintage_net_wifi/obj/mesh_mode.o] Error 162could not compile dependency :vintage_net_wifi, "mix compile" failed. Errors may have been logged above. You can recompile this dependency with "mix deps.compile vintage_net_wifi --force", update it with "mix deps.update vintage_net_wifi" or clean it with "mix deps.clean vintage_net_wifi"63==> nerves_compatibility_test64** (Mix) Could not compile with "make" (exit status: 2).65