vintage_net_wizard

Build log

host

vintage_net_wizard 0.4.17 · fail · run vintage_net_wizard-0.4.17-1791152952631
87 of 87 lines
1Resolving Hex dependencies...2Resolution completed in 0.202s3Unchanged:4  beam_notify 1.1.15  circular_buffer 1.1.06  cowboy 2.19.07  cowboy_telemetry 0.4.08  cowlib 2.20.0 VULNERABLE!9    EEF-CVE-2026-43966 (MEDIUM)10    aka: CVE-2026-43966, GHSA-w4f7-4cxr-rv3c11    HTTP Response Splitting via Non-VCHAR Bytes in cow_http_struct_hd:escape_string/212    https://osv.dev/vulnerability/EEF-CVE-2026-439661314    EEF-CVE-2026-43969 (LOW)15    aka: CVE-2026-43969, GHSA-g2wm-735q-3f5616    Cookie Request Header Injection via Unvalidated Encoder in cow_cookie:cookie/117    https://osv.dev/vulnerability/EEF-CVE-2026-4396918  elixir_make 0.10.019  interactive_cmd 0.1.420  jason 1.4.521  mime 2.0.722  muontrap 1.8.023  nerves 2.0.0-pre.224  nerves_discovery 0.1.525  nerves_logging 0.2.426  nerves_runtime 0.13.1327  nerves_system_bbb 2.30.228  nerves_system_br 1.34.429  nerves_system_mangopi_mq_pro 0.17.230  nerves_system_qemu_aarch64 0.4.231  nerves_system_rpi0 2.1.232  nerves_system_rpi4 2.1.233  nerves_system_rpi5 2.1.234  nerves_system_trellis 0.5.035  nerves_system_x86_64 1.34.236  nerves_toolchain_aarch64_nerves_linux_gnu 15.3.137  nerves_toolchain_armv6_nerves_linux_gnueabihf 15.3.138  nerves_toolchain_armv7_nerves_linux_gnueabihf 15.3.139  nerves_toolchain_riscv64_nerves_linux_gnu 15.3.140  nerves_toolchain_x86_64_nerves_linux_musl 15.3.141  nerves_uevent 0.1.742  phoenix_html 4.3.043  plug 1.20.344  plug_cowboy 2.9.045  plug_crypto 2.2.046  property_table 0.3.447  ranch 2.3.048  ring_logger 0.11.749  tablet 0.3.350  telemetry 1.4.251  toolshed 0.5.052  uboot_env 1.0.253  vintage_net 0.13.1354  vintage_net_wifi 0.12.1155  vintage_net_wizard 0.4.1756Found packages with security advisories, see above for details57All dependencies have been fetched58==> vintage_net_wifi59Package libnl-genl-3.0 was not found in the pkg-config search path.60Perhaps you should add the directory containing `libnl-genl-3.0.pc'61to the PKG_CONFIG_PATH environment variable62Package 'libnl-genl-3.0', required by 'virtual:world', not found63 CC force_ap_scan.o64Package libnl-genl-3.0 was not found in the pkg-config search path.65Perhaps you should add the directory containing `libnl-genl-3.0.pc'66to the PKG_CONFIG_PATH environment variable67Package 'libnl-genl-3.0', required by 'virtual:world', not found68 CC mesh_mode.o69Package libnl-genl-3.0 was not found in the pkg-config search path.70Perhaps you should add the directory containing `libnl-genl-3.0.pc'71to the PKG_CONFIG_PATH environment variable72Package 'libnl-genl-3.0', required by 'virtual:world', not found73c_src/force_ap_scan.c:24:10: fatal error: netlink/genl/genl.h: No such file or directory74   24 | #include <netlink/genl/genl.h>75      |          ^~~~~~~~~~~~~~~~~~~~~76compilation terminated.77make: *** [Makefile:93: /work/proj/_build/host/lib/vintage_net_wifi/obj/force_ap_scan.o] Error 178make: *** Waiting for unfinished jobs....79c_src/mesh_mode.c:24:10: fatal error: netlink/genl/genl.h: No such file or directory80   24 | #include <netlink/genl/genl.h>81      |          ^~~~~~~~~~~~~~~~~~~~~82compilation terminated.83make: *** [Makefile:93: /work/proj/_build/host/lib/vintage_net_wifi/obj/mesh_mode.o] Error 184could not compile dependency :vintage_net_wifi, "mix compile" failed. Errors may have been logged above. You can recompile this dependency with "mix deps.compile vintage_net_wifi --force", update it with "mix deps.update vintage_net_wifi" or clean it with "mix deps.clean vintage_net_wifi"85==> nerves_compatibility_test86** (Mix) Could not compile with "make" (exit status: 2).87