xav

Build log

nerves_system_rpi5

xav 0.12.0 · fail · run xav-0.12.0-1791159068646
146 of 146 lines
1Resolving Hex dependencies...2Resolution completed in 0.094s3Unchanged:4  circular_buffer 1.1.05  elixir_make 0.10.06  interactive_cmd 0.1.47  nerves 2.0.0-pre.28  nerves_discovery 0.1.59  nerves_logging 0.2.410  nerves_runtime 0.13.1311  nerves_system_bbb 2.30.212  nerves_system_br 1.34.413  nerves_system_mangopi_mq_pro 0.17.214  nerves_system_qemu_aarch64 0.4.215  nerves_system_rpi0 2.1.216  nerves_system_rpi4 2.1.217  nerves_system_rpi5 2.1.218  nerves_system_trellis 0.5.019  nerves_system_x86_64 1.34.220  nerves_toolchain_aarch64_nerves_linux_gnu 15.3.121  nerves_toolchain_armv6_nerves_linux_gnueabihf 15.3.122  nerves_toolchain_armv7_nerves_linux_gnueabihf 15.3.123  nerves_toolchain_riscv64_nerves_linux_gnu 15.3.124  nerves_toolchain_x86_64_nerves_linux_musl 15.3.125  nerves_uevent 0.1.726  nimble_options 1.1.127  property_table 0.3.428  ring_logger 0.11.729  tablet 0.3.330  toolshed 0.5.031  uboot_env 1.0.232  xav 0.12.033* Getting xav (Hex package)34* Getting nerves (Hex package)35* Getting ring_logger (Hex package)36* Getting toolshed (Hex package)37* Getting nerves_runtime (Hex package)38* Getting nerves_system_bbb (Hex package)39* Getting nerves_system_mangopi_mq_pro (Hex package)40* Getting nerves_system_qemu_aarch64 (Hex package)41* Getting nerves_system_rpi0 (Hex package)42* Getting nerves_system_rpi4 (Hex package)43* Getting nerves_system_rpi5 (Hex package)44* Getting nerves_system_trellis (Hex package)45* Getting nerves_system_x86_64 (Hex package)46* Getting nerves_system_br (Hex package)47* Getting nerves_toolchain_x86_64_nerves_linux_musl (Hex package)48* Getting nerves_toolchain_armv7_nerves_linux_gnueabihf (Hex package)49* Getting nerves_toolchain_aarch64_nerves_linux_gnu (Hex package)50* Getting nerves_toolchain_armv6_nerves_linux_gnueabihf (Hex package)51* Getting nerves_toolchain_riscv64_nerves_linux_gnu (Hex package)52* Getting nerves_logging (Hex package)53* Getting nerves_uevent (Hex package)54* Getting uboot_env (Hex package)55* Getting elixir_make (Hex package)56* Getting property_table (Hex package)57* Getting circular_buffer (Hex package)58* Getting interactive_cmd (Hex package)59* Getting nerves_discovery (Hex package)60* Getting tablet (Hex package)61* Getting nimble_options (Hex package)62==> nerves_system_br63Generated nerves_system_br app64==> circular_buffer65Compiling 1 file (.ex)66Generated circular_buffer app67==> nimble_options68Compiling 3 files (.ex)69Generated nimble_options app70==> tablet71Compiling 2 files (.ex)72Generated tablet app73==> elixir_make74Compiling 8 files (.ex)75Generated elixir_make app76==> xav77mkdir -p /work/proj/_build/rpi5/lib/xav/priv78mkdir -p /work/proj/_build/rpi5/lib/xav/priv79/home/nerves/.nerves/artifacts/nerves_toolchain_aarch64_nerves_linux_gnu-15.3.1/bin/aarch64-nerves-linux-gnu-gcc -mabi=lp64 -Wl,-z,max-page-size=4096 -Wl,-z,common-page-size=4096 -fstack-protector-strong -mcpu=cortex-a76 -fPIE -pie -Wl,-z,now -Wl,-z,relro -D_LARGEFILE_SOURCE -D_LARGEFILE64_SOURCE -D_FILE_OFFSET_BITS=64  -pipe -O2 --sysroot /home/nerves/.nerves/artifacts/nerves_system_rpi5-2.1.2/staging  -fPIC -shared -I/home/nerves/.nerves/artifacts/nerves_system_rpi5-2.1.2/staging/usr/lib/erlang/erts-17.0.6/include -Ic_src/xav  c_src/xav/xav_decoder.c c_src/xav/decoder.c c_src/xav/video_converter.c c_src/xav/audio_converter.c c_src/xav/utils.c c_src/xav/channel_layout.c -o /work/proj/_build/rpi5/lib/xav/priv/libxavdecoder.so -lavcodec -lswscale -lavutil -lavformat -lavdevice -lswresample80/home/nerves/.nerves/artifacts/nerves_toolchain_aarch64_nerves_linux_gnu-15.3.1/bin/aarch64-nerves-linux-gnu-gcc -mabi=lp64 -Wl,-z,max-page-size=4096 -Wl,-z,common-page-size=4096 -fstack-protector-strong -mcpu=cortex-a76 -fPIE -pie -Wl,-z,now -Wl,-z,relro -D_LARGEFILE_SOURCE -D_LARGEFILE64_SOURCE -D_FILE_OFFSET_BITS=64  -pipe -O2 --sysroot /home/nerves/.nerves/artifacts/nerves_system_rpi5-2.1.2/staging  -fPIC -shared -I/home/nerves/.nerves/artifacts/nerves_system_rpi5-2.1.2/staging/usr/lib/erlang/erts-17.0.6/include -Ic_src/xav  c_src/xav/xav_reader.c c_src/xav/reader.c c_src/xav/video_converter.c c_src/xav/audio_converter.c c_src/xav/utils.c -o /work/proj/_build/rpi5/lib/xav/priv/libxavreader.so -lavcodec -lswscale -lavutil -lavformat -lavdevice -lswresample81In file included from c_src/xav/xav_reader.h:2,82                 from c_src/xav/xav_reader.c:1:83c_src/xav/reader.h:8:10: fatal error: libswscale/swscale.h: No such file or directory84    8 | #include <libswscale/swscale.h>85      |          ^~~~~~~~~~~~~~~~~~~~~~86In file included from c_src/xav/decoder.h:6,87                 from c_src/xav/xav_decoder.h:2,88                 from c_src/xav/xav_decoder.c:1:89c_src/xav/utils.h:8:10: fatal error: libswscale/swscale.h: No such file or directory90    8 | #include <libswscale/swscale.h>91      |          ^~~~~~~~~~~~~~~~~~~~~~92compilation terminated.93compilation terminated.94In file included from c_src/xav/reader.c:1:95c_src/xav/reader.h:8:10: fatal error: libswscale/swscale.h: No such file or directory96    8 | #include <libswscale/swscale.h>97      |          ^~~~~~~~~~~~~~~~~~~~~~98compilation terminated.99In file included from c_src/xav/decoder.h:6,100                 from c_src/xav/decoder.c:1:101c_src/xav/utils.h:8:10: fatal error: libswscale/swscale.h: No such file or directory102    8 | #include <libswscale/swscale.h>103      |          ^~~~~~~~~~~~~~~~~~~~~~104compilation terminated.105In file included from c_src/xav/video_converter.c:1:106c_src/xav/video_converter.h:5:10: fatal error: libswscale/swscale.h: No such file or directory107    5 | #include <libswscale/swscale.h>108      |          ^~~~~~~~~~~~~~~~~~~~~~109compilation terminated.110In file included from c_src/xav/video_converter.c:1:111c_src/xav/video_converter.h:5:10: fatal error: libswscale/swscale.h: No such file or directory112    5 | #include <libswscale/swscale.h>113      |          ^~~~~~~~~~~~~~~~~~~~~~114compilation terminated.115In file included from c_src/xav/audio_converter.c:9:116c_src/xav/utils.h:8:10: fatal error: libswscale/swscale.h: No such file or directory117    8 | #include <libswscale/swscale.h>118      |          ^~~~~~~~~~~~~~~~~~~~~~119compilation terminated.120In file included from c_src/xav/utils.c:1:121c_src/xav/utils.h:8:10: fatal error: libswscale/swscale.h: No such file or directory122    8 | #include <libswscale/swscale.h>123      |          ^~~~~~~~~~~~~~~~~~~~~~124compilation terminated.125In file included from c_src/xav/audio_converter.c:9:126c_src/xav/utils.h:8:10: fatal error: libswscale/swscale.h: No such file or directory127    8 | #include <libswscale/swscale.h>128      |          ^~~~~~~~~~~~~~~~~~~~~~129compilation terminated.130make: *** [Makefile:57: /work/proj/_build/rpi5/lib/xav/priv/libxavreader.so] Error 1131make: *** Waiting for unfinished jobs....132In file included from c_src/xav/utils.c:1:133c_src/xav/utils.h:8:10: fatal error: libswscale/swscale.h: No such file or directory134    8 | #include <libswscale/swscale.h>135      |          ^~~~~~~~~~~~~~~~~~~~~~136compilation terminated.137make: *** [Makefile:53: /work/proj/_build/rpi5/lib/xav/priv/libxavdecoder.so] Error 1138could not compile dependency :xav, "mix compile" failed. Errors may have been logged above. You can recompile this dependency with "mix deps.compile xav --force", update it with "mix deps.update xav" or clean it with "mix deps.clean xav"139==> nerves_compatibility_test140** (Mix) Could not compile with "make" (exit status: 2).141You need to have gcc and make installed. If you are using142Ubuntu or any other Debian-based system, install the packages143"build-essential". Also install "erlang-dev" package if not144included in your Erlang/OTP version. If you're on Fedora, run145"dnf group install 'Development Tools'".146