Build log
nerves_system_x86_64
diode_client 1.4.12 · fail · run diode_client-1.4.12-1789456042005
168 of 168 lines
1Resolving Hex dependencies...2Resolution completed in 0.292s3Unchanged:4 cbor 1.0.25 circular_buffer 1.1.06 curve25519 1.0.67 debouncer 1.0.18 deoxysii 1.0.49 diode_client 1.4.1210 elixir_make 0.10.011 ex_sha3 0.1.512 interactive_cmd 0.1.413 jason 1.4.514 libsecp256k1_diode_fork 0.1.1815 nerves 1.15.016 nerves_discovery 0.1.517 nerves_logging 0.2.418 nerves_runtime 0.13.1319 nerves_system_bbb 2.30.220 nerves_system_br 1.34.421 nerves_system_mangopi_mq_pro 0.17.222 nerves_system_qemu_aarch64 0.4.223 nerves_system_rpi 2.1.224 nerves_system_rpi0 2.1.225 nerves_system_rpi0_2 2.1.226 nerves_system_rpi2 2.1.227 nerves_system_rpi3 2.1.228 nerves_system_rpi4 2.1.229 nerves_system_rpi5 2.1.230 nerves_system_x86_64 1.34.231 nerves_toolchain_aarch64_nerves_linux_gnu 15.3.132 nerves_toolchain_armv6_nerves_linux_gnueabihf 15.3.133 nerves_toolchain_armv7_nerves_linux_gnueabihf 15.3.134 nerves_toolchain_riscv64_nerves_linux_gnu 15.3.135 nerves_toolchain_x86_64_nerves_linux_musl 15.3.136 nerves_uevent 0.1.737 network_monitor 1.1.538 oncrash 0.1.039 profiler 0.4.740 property_table 0.3.441 pure_erlsha2 2.2.242 ring_logger 0.11.743 shoehorn 0.9.344 tablet 0.3.345 telemetry 1.4.246 toolshed 0.5.047 uboot_env 1.0.248 websockex 0.5.149* Getting diode_client (Hex package)50* Getting nerves (Hex package)51* Getting shoehorn (Hex package)52* Getting ring_logger (Hex package)53* Getting toolshed (Hex package)54* Getting nerves_runtime (Hex package)55* Getting nerves_system_bbb (Hex package)56* Getting nerves_system_mangopi_mq_pro (Hex package)57* Getting nerves_system_qemu_aarch64 (Hex package)58* Getting nerves_system_rpi (Hex package)59* Getting nerves_system_rpi0 (Hex package)60* Getting nerves_system_rpi0_2 (Hex package)61* Getting nerves_system_rpi2 (Hex package)62* Getting nerves_system_rpi3 (Hex package)63* Getting nerves_system_rpi4 (Hex package)64* Getting nerves_system_rpi5 (Hex package)65* Getting nerves_system_x86_64 (Hex package)66* Getting nerves_system_br (Hex package)67* Getting nerves_toolchain_x86_64_nerves_linux_musl (Hex package)68* Getting nerves_toolchain_aarch64_nerves_linux_gnu (Hex package)69* Getting nerves_toolchain_armv7_nerves_linux_gnueabihf (Hex package)70* Getting nerves_toolchain_armv6_nerves_linux_gnueabihf (Hex package)71* Getting nerves_toolchain_riscv64_nerves_linux_gnu (Hex package)72* Getting nerves_logging (Hex package)73* Getting nerves_uevent (Hex package)74* Getting uboot_env (Hex package)75* Getting elixir_make (Hex package)76* Getting property_table (Hex package)77* Getting circular_buffer (Hex package)78* Getting interactive_cmd (Hex package)79* Getting jason (Hex package)80* Getting nerves_discovery (Hex package)81* Getting tablet (Hex package)82* Getting cbor (Hex package)83* Getting curve25519 (Hex package)84* Getting debouncer (Hex package)85* Getting deoxysii (Hex package)86* Getting ex_sha3 (Hex package)87* Getting libsecp256k1 (Hex package)88* Getting network_monitor (Hex package)89* Getting oncrash (Hex package)90* Getting profiler (Hex package)91* Getting pure_erlsha2 (Hex package)92* Getting websockex (Hex package)93* Getting telemetry (Hex package)94==> jason95Compiling 10 files (.ex)96Generated jason app97==> tablet98Compiling 2 files (.ex)99Generated tablet app100==> elixir_make101Compiling 8 files (.ex)102Generated elixir_make app103==> nerves_discovery104Compiling 5 files (.ex)105Generated nerves_discovery app106==> interactive_cmd107Compiling 1 file (.ex)108Generated interactive_cmd app109==> nerves110HOST_CC port.o111HOST_LD port112Compiling 55 files (.ex)113Generated nerves app114==> nerves_compatibility_test115116Nerves environment117 MIX_TARGET: x86_64118 MIX_ENV: prod119120Checking for prebuilt Nerves artifacts...121 Found nerves_system_x86_64 in cache122 /home/nerves/.nerves/artifacts/nerves_system_x86_64-portable-1.34.2123 Found nerves_toolchain_x86_64_nerves_linux_musl in cache124 /home/nerves/.nerves/artifacts/nerves_toolchain_x86_64_nerves_linux_musl-linux_x86_64-15.3.1125==> nerves126==> nerves_compatibility_test127128Nerves environment129 MIX_TARGET: x86_64130 MIX_ENV: prod131132==> network_monitor133Compiling 1 file (.ex)134Generated network_monitor app135==> oncrash136Compiling 1 file (.ex)137Generated oncrash app138==> nerves_compatibility_test139===> Fetching rebar3_hex v7.2.0140===> Fetching hex_core v0.18.0141===> Fetching verl v1.1.1142===> Analyzing applications...143===> Compiling verl144===> Compiling hex_core145===> Compiling rebar3_hex146===> Analyzing applications...147===> Compiling pure_erlsha2148==> libsecp256k1149Compiling nif libsecp256k1 with args: ["--from-mix-deps-compile", "--no-warnings-as-errors", "--no-code-path-pruning"]150Cloning into 'secp256k1'...151Updating files: 80% (153/189)Updating files: 81% (154/189)Updating files: 82% (155/189)Updating files: 83% (157/189)Updating files: 84% (159/189)Updating files: 85% (161/189)Updating files: 86% (163/189)Updating files: 87% (165/189)Updating files: 88% (167/189)Updating files: 89% (169/189)Updating files: 90% (171/189)Updating files: 91% (172/189)Updating files: 92% (174/189)Updating files: 93% (176/189)Updating files: 94% (178/189)Updating files: 95% (180/189)Updating files: 96% (182/189)Updating files: 97% (184/189)Updating files: 98% (186/189)Updating files: 99% (188/189)Updating files: 100% (189/189)Updating files: 100% (189/189), done.152configure.ac:28: warning: The macro `AC_PROG_CC_C89' is obsolete.153configure.ac:28: You should run autoupdate.154./lib/autoconf/c.m4:1652: AC_PROG_CC_C89 is expanded from...155configure.ac:28: the top level156configure.ac:10: installing 'build-aux/compile'157configure.ac:5: installing 'build-aux/config.guess'158configure.ac:5: installing 'build-aux/config.sub'159configure.ac:9: installing 'build-aux/install-sh'160configure.ac:9: installing 'build-aux/missing'161Makefile.am: installing 'build-aux/depcomp'162parallel-tests: installing 'build-aux/test-driver'163configure: error: in `/work/proj/deps_x86_64/libsecp256k1/c_src/secp256k1':164configure: error: cannot run C compiled programs.165If you meant to cross compile, use `--host'.166See `config.log' for more details167make: *** [Makefile:55: c_src/secp256k1/Makefile] Error 77168could not compile dependency :libsecp256k1, "mix compile" failed. Errors may have been logged above. You can recompile this dependency with "mix deps.compile libsecp256k1 --force", update it with "mix deps.update libsecp256k1" or clean it with "mix deps.clean libsecp256k1"